{"text_format":"3","workbook":"xlsx","n_sheets":6,"sheets":["EH_Summary","Dx_License","Dx_Implement. and Support","NTCSA_License","NTCSA_Implement. and Support","Currency"],"not_rendered":{"external_links":11,"defined_names":422},"read":"whole","date_system":"1900"}

{"sheet":"EH_Summary","index":0,"n_rows":38,"n_cols":10,"rows_kept":38,"merged":[[3,1,3,6],[8,1,21,1],[22,1,35,1]]}
[]
[null,"Costing : Enterprise Historian"]
[]
[null,"VENDOR NAME"]
[]
[]
[]
[null,null,"ENVIRONMENT","DESCRIPTION","YEAR 1","YEAR 2","YEAR 3","YEAR 4","YEAR 5"]
[null,"Dx","PRODUCTION ENVIRONMENT","Subscription service",{"$f":"Dx_License!E28","v":0},{"$f":"Dx_License!F28","v":0},{"$f":"Dx_License!G28","v":0},{"$f":"Dx_License!H28","v":0},{"$f":"Dx_License!I28","v":0}]
[null,null,"PRE-PRODUCTION ENVIRONMENT","Subscription service",{"$f":"Dx_License!E29","v":0},{"$f":"Dx_License!F29","v":0},{"$f":"Dx_License!G29","v":0},{"$f":"Dx_License!H29","v":0},{"$f":"Dx_License!I29","v":0}]
[null,null,"DISASTER RECOVERY ENVIRONMENT","Subscription service",{"$f":"Dx_License!E30","v":0},{"$f":"Dx_License!F30","v":0},{"$f":"Dx_License!G30","v":0},{"$f":"Dx_License!H30","v":0},{"$f":"Dx_License!I30","v":0}]
[null,null,"QUALITY ASSURANCE ENVIRONMENT","Subscription service",{"$f":"Dx_License!E31","v":0},{"$f":"Dx_License!F31","v":0},{"$f":"Dx_License!G31","v":0},{"$f":"Dx_License!H31","v":0},{"$f":"Dx_License!I31","v":0}]
[null,null,"DEVELOPMENT ENVIRONMENT","Subscription service",{"$f":"Dx_License!E32","v":0},{"$f":"Dx_License!F32","v":0},{"$f":"Dx_License!G32","v":0},{"$f":"Dx_License!H32","v":0},{"$f":"Dx_License!I32","v":0}]
[null,null,"TRAINING ENVIRONMENT","Subscription service",{"$f":"Dx_License!E33","v":0},{"$f":"Dx_License!F33","v":0},{"$f":"Dx_License!G33","v":0},{"$f":"Dx_License!H33","v":0},{"$f":"Dx_License!I33","v":0}]
[null,null,"TOTAL",null,{"$f":"SUM(E9:E14)","v":0},{"$f":"SUM(F9:F14)","v":0},{"$f":"SUM(G9:G14)","v":0},{"$f":"SUM(H9:H14)","v":0},{"$f":"SUM(I9:I14)","v":0}]
[null,null,"SUB TOTAL",{"$f":"SUM(E15,F15,G15,H15,I15)","v":0}]
[]
[null,null,"SOLUTION IMPLEMENTATION",{"$f":"'Dx_Implement. and Support'!D144","v":0}]
[null,null,"SOLUTION SUPPORT",{"$f":"'Dx_Implement. and Support'!D146","v":0}]
[null,null,"SUB TOTAL",{"$f":"SUM(D18,D19)","v":0}]
[]
[null,null,"GRAND TOTAL",{"$nulls":6},{"$f":"SUM(D16,D20)","v":0}]
[null,"NTCSA","PRODUCTION ENVIRONMENT","Subscription service",{"$f":"NTCSA_License!E28","v":0},{"$f":"NTCSA_License!F28","v":0},{"$f":"NTCSA_License!G28","v":0},{"$f":"NTCSA_License!H28","v":0},{"$f":"NTCSA_License!I28","v":0}]
[null,null,"PRE-PRODUCTION ENVIRONMENT","Subscription service",{"$f":"NTCSA_License!E29","v":0},{"$f":"NTCSA_License!F29","v":0},{"$f":"NTCSA_License!G29","v":0},{"$f":"NTCSA_License!H29","v":0},{"$f":"NTCSA_License!I29","v":0}]
[null,null,"DISASTER RECOVERY ENVIRONMENT","Subscription service",{"$f":"NTCSA_License!E30","v":0},{"$f":"NTCSA_License!F30","v":0},{"$f":"NTCSA_License!G30","v":0},{"$f":"NTCSA_License!H30","v":0},{"$f":"NTCSA_License!I30","v":0}]
[null,null,"QUALITY ASSURANCE ENVIRONMENT","Subscription service",{"$f":"NTCSA_License!E31","v":0},{"$f":"NTCSA_License!F31","v":0},{"$f":"NTCSA_License!G31","v":0},{"$f":"NTCSA_License!H31","v":0},{"$f":"NTCSA_License!I31","v":0}]
[null,null,"DEVELOPMENT ENVIRONMENT","Subscription service",{"$f":"NTCSA_License!E32","v":0},{"$f":"NTCSA_License!F32","v":0},{"$f":"NTCSA_License!G32","v":0},{"$f":"NTCSA_License!H32","v":0},{"$f":"NTCSA_License!I32","v":0}]
[null,null,"TRAINING ENVIRONMENT","Subscription service",{"$f":"NTCSA_License!E33","v":0},{"$f":"NTCSA_License!F33","v":0},{"$f":"NTCSA_License!G33","v":0},{"$f":"NTCSA_License!H33","v":0},{"$f":"NTCSA_License!I33","v":0}]
[null,null,"TOTAL",null,{"$f":"SUM(E23:E28)","v":0},{"$f":"SUM(F23:F28)","v":0},{"$f":"SUM(G23:G28)","v":0},{"$f":"SUM(H23:H28)","v":0},{"$f":"SUM(I23:I28)","v":0}]
[null,null,"SUB TOTAL",{"$f":"SUM(E29,F29,G29,H29,I29)","v":0}]
{"$rows_left_out":9}
{"sheet":"Dx_License","index":1,"n_rows":174,"n_cols":30,"rows_kept":174,"merged":[[1,1,1,7],[25,1,25,8],[27,1,32,1],[36,1,36,11],[37,8,37,11],[37,12,37,15],[37,16,37,19],[37,20,37,23],[37,24,37,27],[38,5,38,7],[39,0,40,0],[41,0,42,0],[59,1,59,11],[60,8,60,11],[60,12,60,15],[60,16,60,19],[60,20,60,23],[60,24,60,27],[61,5,61,7],[82,1,82,11],[83,8,83,11],[83,12,83,15],[83,16,83,19],[83,20,83,23],[83,24,83,27],[84,5,84,7],[105,1,105,11],[106,8,106,11],[106,12,106,15],[106,16,106,19],[106,20,106,23],[106,24,106,27],[107,5,107,7],[115,0,116,0],[117,0,118,0],[119,0,121,0],[122,0,131,0],[128,1,128,11],[129,8,129,11],[129,12,129,15],[129,16,129,19],[129,20,129,23],[129,24,129,27],[130,5,130,7],[132,0,135,0],[136,0,137,0],[138,0,143,0],[144,0,145,0],[151,1,151,11],[152,8,152,11],[152,12,152,15],[152,16,152,19],[152,20,152,23],[152,24,152,27],[153,5,153,7],[155,0,158,0],[159,0,160,0],[161,0,166,0],[167,0,168,0]]}
[]
[null,{"$f":"EH_Summary!B4","v":"VENDOR NAME"}]
[]
[]
[]
[null,"IMPORTANT NOTES"]
[null,"All cells highlighted in GREEN must be completed"]
[null,"Quoted prices MUST be in ZAR, EXCLUDING VAT and ESCALATIONS"]
[]
[null,"Dx Historian"]
[null,"Prices MUST be quoted based on the SCOPE provided"]
[null,"Select the currency from the CURRENCY drop-down list in COLUMN \"G\""]
[]
[null,"Capture the applicable Currency, ROE and ROE Published Date on the \"Currency sheet\". "]
[null,"The adjustments for prevailing rates and the basis for future price adjustments will be determined at time of contracting. "]
[null,"Exchange rate variations may not be claimed for the local mark-up in the pricing structure"]
[]
[null,"NB: PROVIDE THE REQUIRED SUBSCRIPTION LICENSES for the different Environments as per the TABLES below"]
[]
[null,"Provide Contract Price Adjustment Formula in COLUMN AD"]
[]
[null,"All Prices must be exclusive of VAT"]
[]
[]
[]
[null,"SUMMARY BASED ON 2 MILLION TAGS"]
[null,null,"ENVIRONMENT","DESCRIPTION","YEAR 1","YEAR 2","YEAR 3","YEAR 4","YEAR 5","TOTAL"]
[null,"ENTERPRISE HISTORIAN","PRODUCTION ENVIRONMENT","Subscription service",{"$f":"L55","v":0},{"$f":"P55","v":0},{"$f":"T55","v":0},{"$f":"X55","v":0},{"$f":"AB55","v":0},{"$f":"SUM(E28:I28)","v":0}]
[null,null,"PRE-PRODUCTION ENVIRONMENT","Subscription service",{"$f":"L78","v":0},{"$f":"P78","v":0},{"$f":"T78","v":0},{"$f":"X78","v":0},{"$f":"AB78","v":0},{"$f":"SUM(E29:I29)","v":0}]
[null,null,"DISASTER RECOVERY ENVIRONMENT","Subscription service",{"$f":"L101","v":0},{"$f":"P101","v":0},{"$f":"T101","v":0},{"$f":"X101","v":0},{"$f":"AB101","v":0},0]
{"$rows_left_out":145}
{"sheet":"Dx_Implement. and Support","index":2,"n_rows":148,"n_cols":35,"rows_kept":148,"merged":[[1,2,1,7],[26,6,26,8],[26,9,26,12],[27,6,27,8],[28,1,38,1],[28,2,38,2],[41,1,44,1],[41,2,44,2],[48,2,48,6],[50,2,55,2],[56,2,61,2],[62,2,67,2],[68,2,73,2],[74,2,79,2],[80,2,85,2],[86,2,97,2],[98,2,104,2],[105,2,110,2],[111,2,116,2],[117,2,122,2],[125,9,125,32],[126,5,126,7],[126,9,126,12],[126,14,126,17],[126,19,126,22],[126,24,126,27],[126,29,126,32],[127,5,127,7],[129,1,136,1],[129,2,136,2]]}
[]
[null,null,{"$f":"EH_Summary!B4","v":"VENDOR NAME"}]
[]
[]
[]
[null,null,"IMPORTANT NOTES"]
[null,null,"All cells highlighted in GREEN must be completed"]
[null,null,"Quoted prices MUST be in ZAR, EXCLUDING VAT and ESCALATIONS"]
[]
[null,null,"Dx Historian"]
[null,null,"Prices MUST be quoted based on the SCOPE provided"]
[null,null,"Estimated quantities are based on the required number of Licenses"]
[null,null,"Select the currency from the CURRENCY drop-down list in COLUMN \"H\""]
[]
[null,null,"Capture the applicable Currency, ROE and ROE Published Date on the \"Currency sheet\". "]
[null,null,"The adjustments for prevailing rates and the basis for future price adjustments will be determined at time of contracting. "]
[null,null,"Exchange rate variations may not be claimed for the local mark-up in the pricing structure"]
[]
[null,null,"NB: Provide details on the CONTRACT PRICE ADJUSTMENT in Column O for Solution Implementation and Column AI for the Maintenance phase. "]
[null,null,"Provide Cash-Flow projections for the Solution Implementation phase"]
[null,null,"Provide the Detailed Resource plan for the Implementation phase in TABLE 1: RESOURCES FOR IMPLEMENTATION"]
[]
[null,null,"All Prices must be exclusive of VAT"]
[]
[]
[]
[null,null," ",{"$nulls":6},"SOLUTION IMPLEMENTATION"]
[null,"Item Number","Category","Description","Total Estimated Quantity","Unit charge","CURRENCY",null,null,"Unit Price in Nominated Currency","Unit Price in ZAR","Total [Nominated Currency]","Total in ZAR",null,"CONTRACT PRICE ADJUSTMENT"]
[null,1,"Solution Implementation \n(Applicable Stages)","Infrastructure Provisioning",1,"sum",{"$f":"IF(H29=\"\",\"\",IF(H29=\"ZAR\",\"Local\",\"Foreign\"))","v":"Local"},"ZAR",{"$f":"IF(G29=\"\",\"\",IF(G29=\"Foreign\",VLOOKUP(H29,Currency!$E$20:$F$33,2,FALSE),1))","v":{"v":1,"d":"1.00"}},0,{"$f":"J29*$I29","v":0},{"$f":"J29*$E29","v":0},{"$f":"H56*I29","v":0}]
[{"$nulls":3},"Infrastructure Configuration",1,"sum",{"$f":"IF(H30=\"\",\"\",IF(H30=\"ZAR\",\"Local\",\"Foreign\"))","v":"Local"},"ZAR",{"$f":"IF(G30=\"\",\"\",IF(G30=\"Foreign\",VLOOKUP(H30,Currency!$E$20:$F$33,2,FALSE),1))","v":{"v":1,"d":"1.00"}},{"$nulls":3},{"$f":"H62*I30","v":0}]
{"$rows_left_out":119}
{"sheet":"NTCSA_License","index":3,"n_rows":174,"n_cols":30,"rows_kept":174,"merged":[[1,1,1,7],[25,1,25,8],[27,1,32,1],[36,1,36,11],[37,8,37,11],[37,12,37,15],[37,16,37,19],[37,20,37,23],[37,24,37,27],[38,5,38,7],[39,0,40,0],[41,0,42,0],[59,1,59,11],[60,8,60,11],[60,12,60,15],[60,16,60,19],[60,20,60,23],[60,24,60,27],[61,5,61,7],[82,1,82,11],[83,8,83,11],[83,12,83,15],[83,16,83,19],[83,20,83,23],[83,24,83,27],[84,5,84,7],[105,1,105,11],[106,8,106,11],[106,12,106,15],[106,16,106,19],[106,20,106,23],[106,24,106,27],[107,5,107,7],[115,0,116,0],[117,0,118,0],[119,0,121,0],[122,0,131,0],[128,1,128,11],[129,8,129,11],[129,12,129,15],[129,16,129,19],[129,20,129,23],[129,24,129,27],[130,5,130,7],[132,0,135,0],[136,0,137,0],[138,0,143,0],[144,0,145,0],[151,1,151,11],[152,8,152,11],[152,12,152,15],[152,16,152,19],[152,20,152,23],[152,24,152,27],[153,5,153,7],[155,0,158,0],[159,0,160,0],[161,0,166,0],[167,0,168,0]]}
[]
[null,{"$f":"EH_Summary!B4","v":"VENDOR NAME"}]
[]
[]
[]
[null,"IMPORTANT NOTES"]
[null,"All cells highlighted in GREEN must be completed"]
[null,"Quoted prices MUST be in ZAR, EXCLUDING VAT and ESCALATIONS"]
[]
[null,"NTCSA Historian"]
[null,"Prices MUST be quoted based on the SCOPE provided"]
[null,"Select the currency from the CURRENCY drop-down list in COLUMN \"G\""]
[]
[null,"Capture the applicable Currency, ROE and ROE Published Date on the \"Currency sheet\". "]
[null,"The adjustments for prevailing rates and the basis for future price adjustments will be determined at time of contracting. "]
[null,"Exchange rate variations may not be claimed for the local mark-up in the pricing structure"]
[]
[null,"NB: PROVIDE THE REQUIRED SUBSCRIPTION LICENSES for the different Environments as per the TABLES below"]
[]
[null,"Provide Contract Price Adjustment Formula in COLUMN AD"]
[]
[null,"All Prices must be exclusive of VAT"]
[]
[]
[]
[null,"SUMMARY BASED ON 2 MILLION TAGS"]
[null,null,"ENVIRONMENT","DESCRIPTION","YEAR 1","YEAR 2","YEAR 3","YEAR 4","YEAR 5","TOTAL"]
[null,"ENTERPRISE HISTORIAN","PRODUCTION ENVIRONMENT","Subscription service",{"$f":"L55","v":0},{"$f":"P55","v":0},{"$f":"T55","v":0},{"$f":"X55","v":0},{"$f":"AB55","v":0},{"$f":"SUM(E28:I28)","v":0}]
[null,null,"PRE-PRODUCTION ENVIRONMENT","Subscription service",{"$f":"L78","v":0},{"$f":"P78","v":0},{"$f":"T78","v":0},{"$f":"X78","v":0},{"$f":"AB78","v":0},{"$f":"SUM(E29:I29)","v":0}]
[null,null,"DISASTER RECOVERY ENVIRONMENT","Subscription service",{"$f":"L101","v":0},{"$f":"P101","v":0},{"$f":"T101","v":0},{"$f":"X101","v":0},{"$f":"AB101","v":0},0]
{"$rows_left_out":145}
{"sheet":"NTCSA_Implement. and Support","index":4,"n_rows":148,"n_cols":35,"rows_kept":148,"merged":[[1,2,1,7],[26,6,26,8],[26,9,26,12],[27,6,27,8],[28,1,38,1],[28,2,38,2],[41,1,44,1],[41,2,44,2],[48,2,48,6],[50,2,55,2],[56,2,61,2],[62,2,67,2],[68,2,73,2],[74,2,79,2],[80,2,85,2],[86,2,97,2],[98,2,104,2],[105,2,110,2],[111,2,116,2],[117,2,122,2],[125,9,125,32],[126,5,126,7],[126,9,126,12],[126,14,126,17],[126,19,126,22],[126,24,126,27],[126,29,126,32],[127,5,127,7],[129,1,136,1],[129,2,136,2]]}
[]
[null,null,{"$f":"EH_Summary!B4","v":"VENDOR NAME"}]
[]
[]
[]
[null,null,"IMPORTANT NOTES"]
[null,null,"All cells highlighted in GREEN must be completed"]
[null,null,"Quoted prices MUST be in ZAR, EXCLUDING VAT and ESCALATIONS"]
[]
[null,null,"NTCSA Historian"]
[null,null,"Prices MUST be quoted based on the SCOPE provided"]
[null,null,"Estimated quantities are based on the required number of Licenses"]
[null,null,"Select the currency from the CURRENCY drop-down list in COLUMN \"H\""]
[]
[null,null,"Capture the applicable Currency, ROE and ROE Published Date on the \"Currency sheet\". "]
[null,null,"The adjustments for prevailing rates and the basis for future price adjustments will be determined at time of contracting. "]
[null,null,"Exchange rate variations may not be claimed for the local mark-up in the pricing structure"]
[]
[null,null,"NB: Provide details on the CONTRACT PRICE ADJUSTMENT in Column O for Solution Implementation and Column AI for the Maintenance phase. "]
[null,null,"Provide Cash-Flow projections for the Solution Implementation phase"]
[null,null,"Provide the Detailed Resource plan for the Implementation phase in TABLE 1: RESOURCES FOR IMPLEMENTATION"]
[]
[null,null,"All Prices must be exclusive of VAT"]
[]
[]
[]
[null,null," ",{"$nulls":6},"SOLUTION IMPLEMENTATION"]
[null,"Item Number","Category","Description","Total Estimated Quantity","Unit charge","CURRENCY",null,null,"Unit Price in Nominated Currency","Unit Price in ZAR","Total [Nominated Currency]","Total in ZAR",null,"CONTRACT PRICE ADJUSTMENT"]
[null,1,"Solution Implementation \n(Applicable Stages)","Infrastructure Provisioning",1,"sum",{"$f":"IF(H29=\"\",\"\",IF(H29=\"ZAR\",\"Local\",\"Foreign\"))","v":"Local"},"ZAR",{"$f":"IF(G29=\"\",\"\",IF(G29=\"Foreign\",VLOOKUP(H29,Currency!$E$20:$F$33,2,FALSE),1))","v":{"v":1,"d":"1.00"}},0,{"$f":"J29*$I29","v":0},{"$f":"J29*$E29","v":0},{"$f":"H56*I29","v":0}]
[{"$nulls":3},"Infrastructure Configuration",1,"sum","Local","ZAR",{"$f":"IF(G30=\"\",\"\",IF(G30=\"Foreign\",VLOOKUP(H30,Currency!$E$20:$F$33,2,FALSE),1))","v":{"v":1,"d":"1.00"}},{"$nulls":3},{"$f":"H62*I30","v":0}]
{"$rows_left_out":119}
{"sheet":"Currency","index":5,"n_rows":33,"n_cols":8,"rows_kept":33,"merged":[[1,1,1,5],[6,2,6,7],[7,1,9,1],[7,2,7,7],[7,15,7,20],[8,2,8,7],[9,2,9,7],[10,2,10,7],[11,2,11,7],[12,1,14,1],[12,2,12,7],[13,2,13,7],[14,2,14,7],[17,2,17,7]]}
[]
[null,{"$f":"Dx_License!B2:H2","v":"VENDOR NAME"}]
[]
[null,"EXCHANGE RATES FOR MULTIPLE CURRENCIES"]
[]
[null,"NOTES:"]
[null,1,"The table below needs to be completed if the Employer will be exposed to any currency fluctuation as stipulated in Secondary Clause X3.  For conversion of the foreign portions to Rand, please use the South African Reserve Bank's (SARB) exchange rate at 12:00 on the day of advertisement of the bid.  This is in terms of the Preferential Procurement Policy Framework Act (PPPFA) with which the Employer has to comply.\nNB: Tenderers must submit proof of the SARB rate(s) of exchange used  "]
[null,2,"The following URL (electronic route) is to be followed to access the relevant SARB rates on their web pages:\n"]
[null,null,"www.resbank.co.za"]
[null,null,"-  Select Research\n-  Then select Rates\n-  Click on \"Select historical exchange rates and other interest rates\"\n-  Clicking on the exchange rate in the following page opens the daily rates per currency and SA Rand"]
[null,3,"The Employer deals only in the currencies listed below unless other currencies are specifically approved for this tender.  Kindly notify the Employer of any currency that the tenderer intends to use, but is not stipulated in the table, to consider sanctioning such currency.  Sufficient time must be allowed for the assessment and to respond to such request.  The onus is on the tenderer to submit a bid with approved currencies"]
[null,4,"The format in which the exchange rate must be inserted in the table is:  1 (One) Foreign Currency = R Amount  (i.e. the Rand amount for one of each foreign currency applicable).  Exchange rates must be rounded to 4 decimals\n\nNB :  Only the USD/ZAR, GBP/ZAR and EUR/ZAR are published in this way on the SARB web pages above.  The Rand rate with the other currencies must be inverted (1/Foreign Currency Rate) in order to list it in the required format in the table below\n"]
[null,5,"All information in the table below must conform with all other equivalent information in the offer. "]
[null,null,"Payment in terms of Payment Method 2  is considered as a \"foreign payment\" although it will be effected in South African Rand. However, amounts for  \"F.O.R. Price-Goods supplied from Imported Items\", are NOT considered as \"foreign payments\""]
[null,null,"If more than one payment method apply for a currency, the Tenderer must request an additional row be inserted in the table in order to split the values and identify the relevant method.   "]
[]
[]
[null,null,"MULTIPLE CURRENCIES"]
[null,null,"No","Currency Description","Code","Exchange Rate Currency 1,00 =","Date Published","Source"]
[null,null,1,"Australian Dollar","AUD"]
[null,null,2,"Canadian Dollar","CAN"]
[null,null,3,"Swiss Franc","CHF"]
[null,null,4,"Danish Krone","DKK"]
[null,null,5,"European Currency","EUR"]
[null,null,6,"British Pound","GBP"]
[null,null,7,"Hong Kong Dollar","HKD"]
[null,null,8,"Japanese Yen","JPY"]
[null,null,9,"Norwegian Krone","NOK"]
[null,null,10,"New Zealand Dollar","NZD"]
[null,null,11,"Swedish Krone","SEK"]
{"$rows_left_out":3}