{"text_format":"3","workbook":"xlsx","n_sheets":15,"sheets":["ALL sites","Aucklandpark","EastLondon","Bloemfontein","Durban","Kimbely","Mahikeng","Nelspruit","Polokwane","Port Elizabeth","Seapoint","Thohoyandou","Hatfield","George","Mthatha"],"not_rendered":{"external_links":3,"defined_names":1},"read":"whole","date_system":"1900"}

{"sheet":"ALL sites","index":0,"n_rows":104,"n_cols":37,"rows_kept":104}
[null,"SLA","Province","LAT_DEG","LAT_MIN","LAT_SEC","LONG_DEG","LONG_MIN","LONG_SEC","DECIMAL LATITUDE","DECIMAL LONGITUDE","RSGR","SBC1","SBC2","SBC3",2000,"DTT1","DTT2","SAFM","LOBO","SEDI","EKHE","HOZI","METR","RAD5","RGHP","WEZI","WALA","LTUS","PHAL","MOTS","NENE","BELA","XKFM","Regional Site","outside sites","Probe site"]
["ALIWAL NORTH",{"$f":"VLOOKUP(A2,'[1]RSG Sites'!$A$2:$F$133,6,FALSE)","v":"Silver"},{"$f":"VLOOKUP(A2,[2]RAW!$C$2:$O$8276,13,FALSE)","v":"EC"},{"$f":"VLOOKUP(A2,[2]RAW!$C$2:$J$8276,3,FALSE)","v":-30},{"$f":"VLOOKUP(A2,[2]RAW!$C$2:$J$8276,4,FALSE)","v":-47},{"$f":"VLOOKUP(A2,[2]RAW!$C$2:$J$8276,5,FALSE)","v":-5},{"$f":"VLOOKUP(A2,[2]RAW!$C$2:$J$8276,6,FALSE)","v":26},{"$f":"VLOOKUP(A2,[2]RAW!$C$2:$J$8276,7,FALSE)","v":34},{"$f":"VLOOKUP(A2,[2]RAW!$C$2:$J$8276,8,FALSE)","v":0},{"$f":"VLOOKUP(A2,[3]RAW!$C$17:$BK$8270,60,FALSE)","v":-30.784722222222225},{"$f":"VLOOKUP(A2,[3]RAW!$C$17:$BK$8270,61,FALSE)","v":26.566666666666666},"x","x","x",null,null,"x","x","x","x","x",{"$nulls":13},"x",null,"Port Elizabeth"]
["AMANDA GLEN",{"$f":"VLOOKUP(A3,'[1]RSG Sites'!$A$2:$F$133,6,FALSE)","v":{"$error":"#N/A"}},{"$f":"VLOOKUP(A3,[2]RAW!$C$2:$O$8276,13,FALSE)","v":"WC"},{"$f":"VLOOKUP(A3,[2]RAW!$C$2:$J$8276,3,FALSE)","v":-33},{"$f":"VLOOKUP(A3,[2]RAW!$C$2:$J$8276,4,FALSE)","v":-51},{"$f":"VLOOKUP(A3,[2]RAW!$C$2:$J$8276,5,FALSE)","v":-18},{"$f":"VLOOKUP(A3,[2]RAW!$C$2:$J$8276,6,FALSE)","v":18},{"$f":"VLOOKUP(A3,[2]RAW!$C$2:$J$8276,7,FALSE)","v":40},{"$f":"VLOOKUP(A3,[2]RAW!$C$2:$J$8276,8,FALSE)","v":33},{"$f":"VLOOKUP(A3,[3]RAW!$C$17:$BK$8270,60,FALSE)","v":-33.855000000000004},{"$f":"VLOOKUP(A3,[3]RAW!$C$17:$BK$8270,61,FALSE)","v":18.675833333333333},null,"x","x","x",{"$nulls":19},"x",null,"Seapoint"]
["ANDRIESKRAAL",{"$f":"VLOOKUP(A4,'[1]RSG Sites'!$A$2:$F$133,6,FALSE)","v":"Bronze"},{"$f":"VLOOKUP(A4,[2]RAW!$C$2:$O$8276,13,FALSE)","v":"EC"},{"$f":"VLOOKUP(A4,[2]RAW!$C$2:$J$8276,3,FALSE)","v":-33},{"$f":"VLOOKUP(A4,[2]RAW!$C$2:$J$8276,4,FALSE)","v":-46},{"$f":"VLOOKUP(A4,[2]RAW!$C$2:$J$8276,5,FALSE)","v":-42},{"$f":"VLOOKUP(A4,[2]RAW!$C$2:$J$8276,6,FALSE)","v":24},{"$f":"VLOOKUP(A4,[2]RAW!$C$2:$J$8276,7,FALSE)","v":42},{"$f":"VLOOKUP(A4,[2]RAW!$C$2:$J$8276,8,FALSE)","v":35},{"$f":"VLOOKUP(A4,[3]RAW!$C$17:$BK$8270,60,FALSE)","v":-33.77833333333333},{"$f":"VLOOKUP(A4,[3]RAW!$C$17:$BK$8270,61,FALSE)","v":24.709722222222222},"x","x","x","x",null,"x",null,"x","x",{"$nulls":14},"x",null,"Port Elizabeth"]
["AURORA",{"$f":"VLOOKUP(A5,'[1]RSG Sites'!$A$2:$F$133,6,FALSE)","v":{"$error":"#N/A"}},{"$f":"VLOOKUP(A5,[2]RAW!$C$2:$O$8276,13,FALSE)","v":"WC"},{"$f":"VLOOKUP(A5,[2]RAW!$C$2:$J$8276,3,FALSE)","v":-33},{"$f":"VLOOKUP(A5,[2]RAW!$C$2:$J$8276,4,FALSE)","v":-49},{"$f":"VLOOKUP(A5,[2]RAW!$C$2:$J$8276,5,FALSE)","v":-39},{"$f":"VLOOKUP(A5,[2]RAW!$C$2:$J$8276,6,FALSE)","v":18},{"$f":"VLOOKUP(A5,[2]RAW!$C$2:$J$8276,7,FALSE)","v":38},{"$f":"VLOOKUP(A5,[2]RAW!$C$2:$J$8276,8,FALSE)","v":29},{"$f":"VLOOKUP(A5,[3]RAW!$C$17:$BK$8270,60,FALSE)","v":-33.8275},{"$f":"VLOOKUP(A5,[3]RAW!$C$17:$BK$8270,61,FALSE)","v":18.641388888888887},null,"x","x","x",null,"x","x",{"$nulls":16},"x",null,"Seapoint"]
["BEZ VALLEY",{"$f":"VLOOKUP(A6,'[1]RSG Sites'!$A$2:$F$133,6,FALSE)","v":{"$error":"#N/A"}},{"$f":"VLOOKUP(A6,[2]RAW!$C$2:$O$8276,13,FALSE)","v":"GP"},{"$f":"VLOOKUP(A6,[2]RAW!$C$2:$J$8276,3,FALSE)","v":-26},{"$f":"VLOOKUP(A6,[2]RAW!$C$2:$J$8276,4,FALSE)","v":-11},{"$f":"VLOOKUP(A6,[2]RAW!$C$2:$J$8276,5,FALSE)","v":-41},{"$f":"VLOOKUP(A6,[2]RAW!$C$2:$J$8276,6,FALSE)","v":28},{"$f":"VLOOKUP(A6,[2]RAW!$C$2:$J$8276,7,FALSE)","v":5},{"$f":"VLOOKUP(A6,[2]RAW!$C$2:$J$8276,8,FALSE)","v":0},{"$f":"VLOOKUP(A6,[3]RAW!$C$17:$BK$8270,60,FALSE)","v":-26.19472222222222},{"$f":"VLOOKUP(A6,[3]RAW!$C$17:$BK$8270,61,FALSE)","v":28.083333333333332},null,"x","x","x",null,"x","x",{"$nulls":16},"x",null,"Aucklandpark"]
["BLOEMFONTEIN",{"$f":"VLOOKUP(A7,'[1]RSG Sites'!$A$2:$F$133,6,FALSE)","v":"Silver"},{"$f":"VLOOKUP(A7,[2]RAW!$C$2:$O$8276,13,FALSE)","v":"FS"},{"$f":"VLOOKUP(A7,[2]RAW!$C$2:$J$8276,3,FALSE)","v":-29},{"$f":"VLOOKUP(A7,[2]RAW!$C$2:$J$8276,4,FALSE)","v":-6},{"$f":"VLOOKUP(A7,[2]RAW!$C$2:$J$8276,5,FALSE)","v":0},{"$f":"VLOOKUP(A7,[2]RAW!$C$2:$J$8276,6,FALSE)","v":26},{"$f":"VLOOKUP(A7,[2]RAW!$C$2:$J$8276,7,FALSE)","v":13},{"$f":"VLOOKUP(A7,[2]RAW!$C$2:$J$8276,8,FALSE)","v":0},{"$f":"VLOOKUP(A7,[3]RAW!$C$17:$BK$8270,60,FALSE)","v":-29.101111111111113},{"$f":"VLOOKUP(A7,[3]RAW!$C$17:$BK$8270,61,FALSE)","v":26.228888888888886},"x","x","x","x","x","x","x","x","x","x",null,null,"x","x",{"$nulls":9},"x",null,"Bloemfontein"]
["BLOUBERG",{"$f":"VLOOKUP(A8,'[1]RSG Sites'!$A$2:$F$133,6,FALSE)","v":"Bronze"},{"$f":"VLOOKUP(A8,[2]RAW!$C$2:$O$8276,13,FALSE)","v":"LP"},{"$f":"VLOOKUP(A8,[2]RAW!$C$2:$J$8276,3,FALSE)","v":-23},{"$f":"VLOOKUP(A8,[2]RAW!$C$2:$J$8276,4,FALSE)","v":-4},{"$f":"VLOOKUP(A8,[2]RAW!$C$2:$J$8276,5,FALSE)","v":-19},{"$f":"VLOOKUP(A8,[2]RAW!$C$2:$J$8276,6,FALSE)","v":28},{"$f":"VLOOKUP(A8,[2]RAW!$C$2:$J$8276,7,FALSE)","v":59},{"$f":"VLOOKUP(A8,[2]RAW!$C$2:$J$8276,8,FALSE)","v":12},{"$f":"VLOOKUP(A8,[3]RAW!$C$17:$BK$8270,60,FALSE)","v":-23.071944444444444},{"$f":"VLOOKUP(A8,[3]RAW!$C$17:$BK$8270,61,FALSE)","v":28.986666666666668},"x",{"$nulls":6},"x",{"$nulls":13},"x",null,"x",null,"Polokwane"]
["BUTTERWORTH",{"$f":"VLOOKUP(A9,'[1]RSG Sites'!$A$2:$F$133,6,FALSE)","v":"Silver"},{"$f":"VLOOKUP(A9,[2]RAW!$C$2:$O$8276,13,FALSE)","v":"EC"},{"$f":"VLOOKUP(A9,[2]RAW!$C$2:$J$8276,3,FALSE)","v":-32},{"$f":"VLOOKUP(A9,[2]RAW!$C$2:$J$8276,4,FALSE)","v":-16},{"$f":"VLOOKUP(A9,[2]RAW!$C$2:$J$8276,5,FALSE)","v":-35},{"$f":"VLOOKUP(A9,[2]RAW!$C$2:$J$8276,6,FALSE)","v":28},{"$f":"VLOOKUP(A9,[2]RAW!$C$2:$J$8276,7,FALSE)","v":12},{"$f":"VLOOKUP(A9,[2]RAW!$C$2:$J$8276,8,FALSE)","v":24},{"$f":"VLOOKUP(A9,[3]RAW!$C$17:$BK$8270,60,FALSE)","v":-32.27638888888889},{"$f":"VLOOKUP(A9,[3]RAW!$C$17:$BK$8270,61,FALSE)","v":28.206666666666667},"x","x","x","x","x","x","x","x","x",{"$nulls":14},"x",null,"Eastlondon"]
["CAPE TOWN",{"$f":"VLOOKUP(A10,'[1]RSG Sites'!$A$2:$F$133,6,FALSE)","v":"Platinum"},{"$f":"VLOOKUP(A10,[2]RAW!$C$2:$O$8276,13,FALSE)","v":"WC"},{"$f":"VLOOKUP(A10,[2]RAW!$C$2:$J$8276,3,FALSE)","v":-34},{"$f":"VLOOKUP(A10,[2]RAW!$C$2:$J$8276,4,FALSE)","v":-3},{"$f":"VLOOKUP(A10,[2]RAW!$C$2:$J$8276,5,FALSE)","v":-18},{"$f":"VLOOKUP(A10,[2]RAW!$C$2:$J$8276,6,FALSE)","v":18},{"$f":"VLOOKUP(A10,[2]RAW!$C$2:$J$8276,7,FALSE)","v":23},{"$f":"VLOOKUP(A10,[2]RAW!$C$2:$J$8276,8,FALSE)","v":11},{"$f":"VLOOKUP(A10,[3]RAW!$C$17:$BK$8270,60,FALSE)","v":-34.055},{"$f":"VLOOKUP(A10,[3]RAW!$C$17:$BK$8270,61,FALSE)","v":18.386388888888888},"x","x","x","x","x","x","x","x","x",{"$nulls":4},"x","x",{"$nulls":8},"x",null,"Seapoint"]
["CAROLINA",{"$f":"VLOOKUP(A11,'[1]RSG Sites'!$A$2:$F$133,6,FALSE)","v":"Silver"},{"$f":"VLOOKUP(A11,[2]RAW!$C$2:$O$8276,13,FALSE)","v":"MP"},{"$f":"VLOOKUP(A11,[2]RAW!$C$2:$J$8276,3,FALSE)","v":-26},{"$f":"VLOOKUP(A11,[2]RAW!$C$2:$J$8276,4,FALSE)","v":-10},{"$f":"VLOOKUP(A11,[2]RAW!$C$2:$J$8276,5,FALSE)","v":-37},{"$f":"VLOOKUP(A11,[2]RAW!$C$2:$J$8276,6,FALSE)","v":30},{"$f":"VLOOKUP(A11,[2]RAW!$C$2:$J$8276,7,FALSE)","v":37},{"$f":"VLOOKUP(A11,[2]RAW!$C$2:$J$8276,8,FALSE)","v":57},{"$f":"VLOOKUP(A11,[3]RAW!$C$17:$BK$8270,60,FALSE)","v":-26.176944444444445},{"$f":"VLOOKUP(A11,[3]RAW!$C$17:$BK$8270,61,FALSE)","v":30.6325},"x","x","x",null,null,"x","x","x",{"$nulls":3},"x",{"$nulls":4},"x",{"$nulls":6},"x",null,"Nelspruit"]
["CHRISTIANA",{"$f":"VLOOKUP(A12,'[1]RSG Sites'!$A$2:$F$133,6,FALSE)","v":"Silver"},{"$f":"VLOOKUP(A12,[2]RAW!$C$2:$O$8276,13,FALSE)","v":"NW"},{"$f":"VLOOKUP(A12,[2]RAW!$C$2:$J$8276,3,FALSE)","v":-27},{"$f":"VLOOKUP(A12,[2]RAW!$C$2:$J$8276,4,FALSE)","v":-53},{"$f":"VLOOKUP(A12,[2]RAW!$C$2:$J$8276,5,FALSE)","v":-3},{"$f":"VLOOKUP(A12,[2]RAW!$C$2:$J$8276,6,FALSE)","v":24},{"$f":"VLOOKUP(A12,[2]RAW!$C$2:$J$8276,7,FALSE)","v":55},{"$f":"VLOOKUP(A12,[2]RAW!$C$2:$J$8276,8,FALSE)","v":50},{"$f":"VLOOKUP(A12,[3]RAW!$C$17:$BK$8270,60,FALSE)","v":-27.884166666666665},{"$f":"VLOOKUP(A12,[3]RAW!$C$17:$BK$8270,61,FALSE)","v":24.930555555555557},"x","x","x","x",null,"x","x","x",{"$nulls":11},"x",{"$nulls":4},"x","Kimbely"]
["CLIFTON",{"$f":"VLOOKUP(A13,'[1]RSG Sites'!$A$2:$F$133,6,FALSE)","v":{"$error":"#N/A"}},{"$f":"VLOOKUP(A13,[2]RAW!$C$2:$O$8276,13,FALSE)","v":"WC"},{"$f":"VLOOKUP(A13,[2]RAW!$C$2:$J$8276,3,FALSE)","v":-33},{"$f":"VLOOKUP(A13,[2]RAW!$C$2:$J$8276,4,FALSE)","v":-56},{"$f":"VLOOKUP(A13,[2]RAW!$C$2:$J$8276,5,FALSE)","v":-31},{"$f":"VLOOKUP(A13,[2]RAW!$C$2:$J$8276,6,FALSE)","v":18},{"$f":"VLOOKUP(A13,[2]RAW!$C$2:$J$8276,7,FALSE)","v":22},{"$f":"VLOOKUP(A13,[2]RAW!$C$2:$J$8276,8,FALSE)","v":36},{"$f":"VLOOKUP(A13,[3]RAW!$C$17:$BK$8270,60,FALSE)","v":-33.94194444444444},{"$f":"VLOOKUP(A13,[3]RAW!$C$17:$BK$8270,61,FALSE)","v":18.37666666666667},null,"x","x","x",null,"x","x",{"$nulls":16},"x",null,"Seapoint"]
["DESPATCH",{"$f":"VLOOKUP(A14,'[1]RSG Sites'!$A$2:$F$133,6,FALSE)","v":{"$error":"#N/A"}},{"$f":"VLOOKUP(A14,[2]RAW!$C$2:$O$8276,13,FALSE)","v":"EC"},{"$f":"VLOOKUP(A14,[2]RAW!$C$2:$J$8276,3,FALSE)","v":-33},{"$f":"VLOOKUP(A14,[2]RAW!$C$2:$J$8276,4,FALSE)","v":-45},{"$f":"VLOOKUP(A14,[2]RAW!$C$2:$J$8276,5,FALSE)","v":-53},{"$f":"VLOOKUP(A14,[2]RAW!$C$2:$J$8276,6,FALSE)","v":25},{"$f":"VLOOKUP(A14,[2]RAW!$C$2:$J$8276,7,FALSE)","v":25},{"$f":"VLOOKUP(A14,[2]RAW!$C$2:$J$8276,8,FALSE)","v":29},{"$f":"VLOOKUP(A14,[3]RAW!$C$17:$BK$8270,60,FALSE)","v":-33.764722222222225},{"$f":"VLOOKUP(A14,[3]RAW!$C$17:$BK$8270,61,FALSE)","v":25.424722222222222},null,"x","x","x",null,"x","x",{"$nulls":16},"x",null,"Port Elizabeth"]
["DEWETSDORP",{"$f":"VLOOKUP(A15,'[1]RSG Sites'!$A$2:$F$133,6,FALSE)","v":{"$error":"#N/A"}},{"$f":"VLOOKUP(A15,[2]RAW!$C$2:$O$8276,13,FALSE)","v":"FS"},{"$f":"VLOOKUP(A15,[2]RAW!$C$2:$J$8276,3,FALSE)","v":-29},{"$f":"VLOOKUP(A15,[2]RAW!$C$2:$J$8276,4,FALSE)","v":-34},{"$f":"VLOOKUP(A15,[2]RAW!$C$2:$J$8276,5,FALSE)","v":-44},{"$f":"VLOOKUP(A15,[2]RAW!$C$2:$J$8276,6,FALSE)","v":26},{"$f":"VLOOKUP(A15,[2]RAW!$C$2:$J$8276,7,FALSE)","v":39},{"$f":"VLOOKUP(A15,[2]RAW!$C$2:$J$8276,8,FALSE)","v":37},{"$f":"VLOOKUP(A15,[3]RAW!$C$17:$BK$8270,60,FALSE)","v":-29.578888888888887},{"$f":"VLOOKUP(A15,[3]RAW!$C$17:$BK$8270,61,FALSE)","v":26.660277777777775},null,null,"x",null,null,"x",{"$nulls":17},"x",null,"Bloemfontein"]
["DOUGLAS",{"$f":"VLOOKUP(A16,'[1]RSG Sites'!$A$2:$F$133,6,FALSE)","v":"Silver"},{"$f":"VLOOKUP(A16,[2]RAW!$C$2:$O$8276,13,FALSE)","v":"NC"},{"$f":"VLOOKUP(A16,[2]RAW!$C$2:$J$8276,3,FALSE)","v":-29},{"$f":"VLOOKUP(A16,[2]RAW!$C$2:$J$8276,4,FALSE)","v":-4},{"$f":"VLOOKUP(A16,[2]RAW!$C$2:$J$8276,5,FALSE)","v":-9},{"$f":"VLOOKUP(A16,[2]RAW!$C$2:$J$8276,6,FALSE)","v":23},{"$f":"VLOOKUP(A16,[2]RAW!$C$2:$J$8276,7,FALSE)","v":31},{"$f":"VLOOKUP(A16,[2]RAW!$C$2:$J$8276,8,FALSE)","v":43},{"$f":"VLOOKUP(A16,[3]RAW!$C$17:$BK$8270,60,FALSE)","v":-29.069166666666668},{"$f":"VLOOKUP(A16,[3]RAW!$C$17:$BK$8270,61,FALSE)","v":23.52861111111111},"x",null,"x",null,null,"x",null,"x",{"$nulls":15},"x",null,"Kimbely"]
["DULLSTROOM",{"$f":"VLOOKUP(A17,'[1]RSG Sites'!$A$2:$F$133,6,FALSE)","v":"Silver"},{"$f":"VLOOKUP(A17,[2]RAW!$C$2:$O$8276,13,FALSE)","v":"MP"},{"$f":"VLOOKUP(A17,[2]RAW!$C$2:$J$8276,3,FALSE)","v":-25},{"$f":"VLOOKUP(A17,[2]RAW!$C$2:$J$8276,4,FALSE)","v":-34},{"$f":"VLOOKUP(A17,[2]RAW!$C$2:$J$8276,5,FALSE)","v":-21},{"$f":"VLOOKUP(A17,[2]RAW!$C$2:$J$8276,6,FALSE)","v":30},{"$f":"VLOOKUP(A17,[2]RAW!$C$2:$J$8276,7,FALSE)","v":11},{"$f":"VLOOKUP(A17,[2]RAW!$C$2:$J$8276,8,FALSE)","v":17},{"$f":"VLOOKUP(A17,[3]RAW!$C$17:$BK$8270,60,FALSE)","v":-25.572499999999998},{"$f":"VLOOKUP(A17,[3]RAW!$C$17:$BK$8270,61,FALSE)","v":30.188055555555557},"x","x","x",null,null,"x",null,"x",{"$nulls":3},"x",{"$nulls":3},"x","x",{"$nulls":4},"x",null,"x",null,"Nelspruit"]
["DURBAN",{"$f":"VLOOKUP(A18,'[1]RSG Sites'!$A$2:$F$133,6,FALSE)","v":"Platinum"},{"$f":"VLOOKUP(A18,[2]RAW!$C$2:$O$8276,13,FALSE)","v":"KN"},{"$f":"VLOOKUP(A18,[2]RAW!$C$2:$J$8276,3,FALSE)","v":-29},{"$f":"VLOOKUP(A18,[2]RAW!$C$2:$J$8276,4,FALSE)","v":-46},{"$f":"VLOOKUP(A18,[2]RAW!$C$2:$J$8276,5,FALSE)","v":0},{"$f":"VLOOKUP(A18,[2]RAW!$C$2:$J$8276,6,FALSE)","v":30},{"$f":"VLOOKUP(A18,[2]RAW!$C$2:$J$8276,7,FALSE)","v":40},{"$f":"VLOOKUP(A18,[2]RAW!$C$2:$J$8276,8,FALSE)","v":0},{"$f":"VLOOKUP(A18,[3]RAW!$C$17:$BK$8270,60,FALSE)","v":-29.77},{"$f":"VLOOKUP(A18,[3]RAW!$C$17:$BK$8270,61,FALSE)","v":30.716666666666665},"x","x","x","x","x","x","x","x","x",null,null,"x","x","x",{"$nulls":3},"x",{"$nulls":5},"x",null,"Durban"]
["DURBAN NORTH",{"$f":"VLOOKUP(A19,'[1]RSG Sites'!$A$2:$F$133,6,FALSE)","v":"Silver"},{"$f":"VLOOKUP(A19,[2]RAW!$C$2:$O$8276,13,FALSE)","v":"KN"},{"$f":"VLOOKUP(A19,[2]RAW!$C$2:$J$8276,3,FALSE)","v":-29},{"$f":"VLOOKUP(A19,[2]RAW!$C$2:$J$8276,4,FALSE)","v":-45},{"$f":"VLOOKUP(A19,[2]RAW!$C$2:$J$8276,5,FALSE)","v":-52},{"$f":"VLOOKUP(A19,[2]RAW!$C$2:$J$8276,6,FALSE)","v":31},{"$f":"VLOOKUP(A19,[2]RAW!$C$2:$J$8276,7,FALSE)","v":2},{"$f":"VLOOKUP(A19,[2]RAW!$C$2:$J$8276,8,FALSE)","v":24},{"$f":"VLOOKUP(A19,[3]RAW!$C$17:$BK$8270,60,FALSE)","v":-29.764444444444443},{"$f":"VLOOKUP(A19,[3]RAW!$C$17:$BK$8270,61,FALSE)","v":31.040000000000003},"x",{"$nulls":3},"x",null,null,"x",{"$nulls":3},"x","x","x",{"$nulls":3},"x",{"$nulls":5},"x",null,"Durban"]
["DZAMBA",{"$f":"VLOOKUP(A20,'[1]RSG Sites'!$A$2:$F$133,6,FALSE)","v":{"$error":"#N/A"}},{"$f":"VLOOKUP(A20,[2]RAW!$C$2:$O$8276,13,FALSE)","v":"LP"},{"$f":"VLOOKUP(A20,[2]RAW!$C$2:$J$8276,3,FALSE)","v":-22},{"$f":"VLOOKUP(A20,[2]RAW!$C$2:$J$8276,4,FALSE)","v":-49},{"$f":"VLOOKUP(A20,[2]RAW!$C$2:$J$8276,5,FALSE)","v":-5},{"$f":"VLOOKUP(A20,[2]RAW!$C$2:$J$8276,6,FALSE)","v":30},{"$f":"VLOOKUP(A20,[2]RAW!$C$2:$J$8276,7,FALSE)","v":18},{"$f":"VLOOKUP(A20,[2]RAW!$C$2:$J$8276,8,FALSE)","v":41},{"$f":"VLOOKUP(A20,[3]RAW!$C$17:$BK$8270,60,FALSE)","v":-22.818055555555556},{"$f":"VLOOKUP(A20,[3]RAW!$C$17:$BK$8270,61,FALSE)","v":30.31138888888889},null,"x","x",null,null,"x",{"$nulls":12},"x",{"$nulls":4},"x",null,"Thohoyandou"]
["EAST LONDON",{"$f":"VLOOKUP(A21,'[1]RSG Sites'!$A$2:$F$133,6,FALSE)","v":"Silver"},{"$f":"VLOOKUP(A21,[2]RAW!$C$2:$O$8276,13,FALSE)","v":"EC"},{"$f":"VLOOKUP(A21,[2]RAW!$C$2:$J$8276,3,FALSE)","v":-32},{"$f":"VLOOKUP(A21,[2]RAW!$C$2:$J$8276,4,FALSE)","v":-56},{"$f":"VLOOKUP(A21,[2]RAW!$C$2:$J$8276,5,FALSE)","v":-20},{"$f":"VLOOKUP(A21,[2]RAW!$C$2:$J$8276,6,FALSE)","v":27},{"$f":"VLOOKUP(A21,[2]RAW!$C$2:$J$8276,7,FALSE)","v":48},{"$f":"VLOOKUP(A21,[2]RAW!$C$2:$J$8276,8,FALSE)","v":56},{"$f":"VLOOKUP(A21,[3]RAW!$C$17:$BK$8270,60,FALSE)","v":-32.93888888888888},{"$f":"VLOOKUP(A21,[3]RAW!$C$17:$BK$8270,61,FALSE)","v":27.815555555555555},"x","x","x","x","x","x","x","x","x",null,null,"x","x","x",{"$nulls":9},"x",null,"Eastlondon"]
["ENZELSBERG",{"$f":"VLOOKUP(A22,'[1]RSG Sites'!$A$2:$F$133,6,FALSE)","v":"Silver"},{"$f":"VLOOKUP(A22,[2]RAW!$C$2:$O$8276,13,FALSE)","v":"NW"},{"$f":"VLOOKUP(A22,[2]RAW!$C$2:$J$8276,3,FALSE)","v":-25},{"$f":"VLOOKUP(A22,[2]RAW!$C$2:$J$8276,4,FALSE)","v":-25},{"$f":"VLOOKUP(A22,[2]RAW!$C$2:$J$8276,5,FALSE)","v":-7},{"$f":"VLOOKUP(A22,[2]RAW!$C$2:$J$8276,6,FALSE)","v":26},{"$f":"VLOOKUP(A22,[2]RAW!$C$2:$J$8276,7,FALSE)","v":13},{"$f":"VLOOKUP(A22,[2]RAW!$C$2:$J$8276,8,FALSE)","v":16},{"$f":"VLOOKUP(A22,[3]RAW!$C$17:$BK$8270,60,FALSE)","v":-25.41861111111111},{"$f":"VLOOKUP(A22,[3]RAW!$C$17:$BK$8270,61,FALSE)","v":26.22111111111111},"x","x","x","x",null,"x",null,"x",{"$nulls":11},"x",{"$nulls":3},"x",null,"Mahikeng"]
["FISHHOEK",{"$f":"VLOOKUP(A23,'[1]RSG Sites'!$A$2:$F$133,6,FALSE)","v":{"$error":"#N/A"}},{"$f":"VLOOKUP(A23,[2]RAW!$C$2:$O$8276,13,FALSE)","v":"WC"},{"$f":"VLOOKUP(A23,[2]RAW!$C$2:$J$8276,3,FALSE)","v":-34},{"$f":"VLOOKUP(A23,[2]RAW!$C$2:$J$8276,4,FALSE)","v":-8},{"$f":"VLOOKUP(A23,[2]RAW!$C$2:$J$8276,5,FALSE)","v":-59},{"$f":"VLOOKUP(A23,[2]RAW!$C$2:$J$8276,6,FALSE)","v":18},{"$f":"VLOOKUP(A23,[2]RAW!$C$2:$J$8276,7,FALSE)","v":26},{"$f":"VLOOKUP(A23,[2]RAW!$C$2:$J$8276,8,FALSE)","v":8},{"$f":"VLOOKUP(A23,[3]RAW!$C$17:$BK$8270,60,FALSE)","v":-34.14972222222222},{"$f":"VLOOKUP(A23,[3]RAW!$C$17:$BK$8270,61,FALSE)","v":18.435555555555556},null,"x","x","x",null,"x","x",{"$nulls":16},"x",null,"Seapoint"]
["FRANSCHHOEK",{"$f":"VLOOKUP(A24,'[1]RSG Sites'!$A$2:$F$133,6,FALSE)","v":"Silver"},{"$f":"VLOOKUP(A24,[2]RAW!$C$2:$O$8276,13,FALSE)","v":"WC"},{"$f":"VLOOKUP(A24,[2]RAW!$C$2:$J$8276,3,FALSE)","v":-33},{"$f":"VLOOKUP(A24,[2]RAW!$C$2:$J$8276,4,FALSE)","v":-54},{"$f":"VLOOKUP(A24,[2]RAW!$C$2:$J$8276,5,FALSE)","v":-26},{"$f":"VLOOKUP(A24,[2]RAW!$C$2:$J$8276,6,FALSE)","v":19},{"$f":"VLOOKUP(A24,[2]RAW!$C$2:$J$8276,7,FALSE)","v":4},{"$f":"VLOOKUP(A24,[2]RAW!$C$2:$J$8276,8,FALSE)","v":23},{"$f":"VLOOKUP(A24,[3]RAW!$C$17:$BK$8270,60,FALSE)","v":-33.907222222222224},{"$f":"VLOOKUP(A24,[3]RAW!$C$17:$BK$8270,61,FALSE)","v":19.073055555555555},"x","x","x","x","x","x","x","x","x",{"$nulls":5},"x",{"$nulls":8},"x",null,"Seapoint"]
["GABA",{"$f":"VLOOKUP(A25,'[1]RSG Sites'!$A$2:$F$133,6,FALSE)","v":{"$error":"#N/A"}},{"$f":"VLOOKUP(A25,[2]RAW!$C$2:$O$8276,13,FALSE)","v":"LP"},{"$f":"VLOOKUP(A25,[2]RAW!$C$2:$J$8276,3,FALSE)","v":-22},{"$f":"VLOOKUP(A25,[2]RAW!$C$2:$J$8276,4,FALSE)","v":-47},{"$f":"VLOOKUP(A25,[2]RAW!$C$2:$J$8276,5,FALSE)","v":-2},{"$f":"VLOOKUP(A25,[2]RAW!$C$2:$J$8276,6,FALSE)","v":30},{"$f":"VLOOKUP(A25,[2]RAW!$C$2:$J$8276,7,FALSE)","v":42},{"$f":"VLOOKUP(A25,[2]RAW!$C$2:$J$8276,8,FALSE)","v":25},{"$f":"VLOOKUP(A25,[3]RAW!$C$17:$BK$8270,60,FALSE)","v":-22.78388888888889},{"$f":"VLOOKUP(A25,[3]RAW!$C$17:$BK$8270,61,FALSE)","v":30.706944444444442},null,"x","x",null,null,"x",{"$nulls":12},"x",null,"x",null,null,"x",null,"Thohoyandou"]
["GEORGE",{"$f":"VLOOKUP(A26,'[1]RSG Sites'!$A$2:$F$133,6,FALSE)","v":"Gold"},{"$f":"VLOOKUP(A26,[2]RAW!$C$2:$O$8276,13,FALSE)","v":"WC"},{"$f":"VLOOKUP(A26,[2]RAW!$C$2:$J$8276,3,FALSE)","v":-33},{"$f":"VLOOKUP(A26,[2]RAW!$C$2:$J$8276,4,FALSE)","v":-55},{"$f":"VLOOKUP(A26,[2]RAW!$C$2:$J$8276,5,FALSE)","v":-38},{"$f":"VLOOKUP(A26,[2]RAW!$C$2:$J$8276,6,FALSE)","v":22},{"$f":"VLOOKUP(A26,[2]RAW!$C$2:$J$8276,7,FALSE)","v":27},{"$f":"VLOOKUP(A26,[2]RAW!$C$2:$J$8276,8,FALSE)","v":3},{"$f":"VLOOKUP(A26,[3]RAW!$C$17:$BK$8270,60,FALSE)","v":-33.92722222222222},{"$f":"VLOOKUP(A26,[3]RAW!$C$17:$BK$8270,61,FALSE)","v":22.450833333333332},"x","x","x","x","x","x","x","x","x",null,null,"x",null,"x",{"$nulls":9},"x",null,"George"]
["GRABOUW",{"$f":"VLOOKUP(A27,'[1]RSG Sites'!$A$2:$F$133,6,FALSE)","v":"Silver"},{"$f":"VLOOKUP(A27,[2]RAW!$C$2:$O$8276,13,FALSE)","v":"WC"},{"$f":"VLOOKUP(A27,[2]RAW!$C$2:$J$8276,3,FALSE)","v":-34},{"$f":"VLOOKUP(A27,[2]RAW!$C$2:$J$8276,4,FALSE)","v":-6},{"$f":"VLOOKUP(A27,[2]RAW!$C$2:$J$8276,5,FALSE)","v":-7},{"$f":"VLOOKUP(A27,[2]RAW!$C$2:$J$8276,6,FALSE)","v":18},{"$f":"VLOOKUP(A27,[2]RAW!$C$2:$J$8276,7,FALSE)","v":58},{"$f":"VLOOKUP(A27,[2]RAW!$C$2:$J$8276,8,FALSE)","v":0},{"$f":"VLOOKUP(A27,[3]RAW!$C$17:$BK$8270,60,FALSE)","v":-34.10194444444445},{"$f":"VLOOKUP(A27,[3]RAW!$C$17:$BK$8270,61,FALSE)","v":18.966666666666665},"x","x","x","x",null,"x","x","x",{"$nulls":15},"x",null,"Seapoint"]
["GRAHAMSTOWN",{"$f":"VLOOKUP(A28,'[1]RSG Sites'!$A$2:$F$133,6,FALSE)","v":"Gold"},{"$f":"VLOOKUP(A28,[2]RAW!$C$2:$O$8276,13,FALSE)","v":"EC"},{"$f":"VLOOKUP(A28,[2]RAW!$C$2:$J$8276,3,FALSE)","v":-33},{"$f":"VLOOKUP(A28,[2]RAW!$C$2:$J$8276,4,FALSE)","v":-19},{"$f":"VLOOKUP(A28,[2]RAW!$C$2:$J$8276,5,FALSE)","v":-42},{"$f":"VLOOKUP(A28,[2]RAW!$C$2:$J$8276,6,FALSE)","v":26},{"$f":"VLOOKUP(A28,[2]RAW!$C$2:$J$8276,7,FALSE)","v":30},{"$f":"VLOOKUP(A28,[2]RAW!$C$2:$J$8276,8,FALSE)","v":4},{"$f":"VLOOKUP(A28,[3]RAW!$C$17:$BK$8270,60,FALSE)","v":-33.2875},{"$f":"VLOOKUP(A28,[3]RAW!$C$17:$BK$8270,61,FALSE)","v":26.70861111111111},"x","x","x","x","x","x","x","x","x",{"$nulls":4},"x",{"$nulls":9},"x",null,"Port Elizabeth"]
["GROOT BRAKRIVIER",{"$f":"VLOOKUP(A29,'[1]RSG Sites'!$A$2:$F$133,6,FALSE)","v":{"$error":"#N/A"}},{"$f":"VLOOKUP(A29,[2]RAW!$C$2:$O$8276,13,FALSE)","v":"WC"},{"$f":"VLOOKUP(A29,[2]RAW!$C$2:$J$8276,3,FALSE)","v":-34},{"$f":"VLOOKUP(A29,[2]RAW!$C$2:$J$8276,4,FALSE)","v":-1},{"$f":"VLOOKUP(A29,[2]RAW!$C$2:$J$8276,5,FALSE)","v":-55},{"$f":"VLOOKUP(A29,[2]RAW!$C$2:$J$8276,6,FALSE)","v":22},{"$f":"VLOOKUP(A29,[2]RAW!$C$2:$J$8276,7,FALSE)","v":12},{"$f":"VLOOKUP(A29,[2]RAW!$C$2:$J$8276,8,FALSE)","v":57},{"$f":"VLOOKUP(A29,[3]RAW!$C$17:$BK$8270,60,FALSE)","v":-34.03194444444444},{"$f":"VLOOKUP(A29,[3]RAW!$C$17:$BK$8270,61,FALSE)","v":22.215833333333332},null,"x","x","x",null,"x",{"$nulls":17},"x",null,"George"]
["GROOT MARICO",{"$f":"VLOOKUP(A30,'[1]RSG Sites'!$A$2:$F$133,6,FALSE)","v":"Bronze"},{"$f":"VLOOKUP(A30,[2]RAW!$C$2:$O$8276,13,FALSE)","v":"NW"},{"$f":"VLOOKUP(A30,[2]RAW!$C$2:$J$8276,3,FALSE)","v":-25},{"$f":"VLOOKUP(A30,[2]RAW!$C$2:$J$8276,4,FALSE)","v":-37},{"$f":"VLOOKUP(A30,[2]RAW!$C$2:$J$8276,5,FALSE)","v":-11},{"$f":"VLOOKUP(A30,[2]RAW!$C$2:$J$8276,6,FALSE)","v":26},{"$f":"VLOOKUP(A30,[2]RAW!$C$2:$J$8276,7,FALSE)","v":26},{"$f":"VLOOKUP(A30,[2]RAW!$C$2:$J$8276,8,FALSE)","v":8},{"$f":"VLOOKUP(A30,[3]RAW!$C$17:$BK$8270,60,FALSE)","v":-25.619722222222222},{"$f":"VLOOKUP(A30,[3]RAW!$C$17:$BK$8270,61,FALSE)","v":26.435555555555556},"x",null,"x",null,null,"x",null,"x",{"$nulls":11},"x",{"$nulls":3},"x",null,"Mahikeng"]
["HAENERTSBURG",{"$f":"VLOOKUP(A31,'[1]RSG Sites'!$A$2:$F$133,6,FALSE)","v":{"$error":"#N/A"}},{"$f":"VLOOKUP(A31,[2]RAW!$C$2:$O$8276,13,FALSE)","v":"LP"},{"$f":"VLOOKUP(A31,[2]RAW!$C$2:$J$8276,3,FALSE)","v":-23},{"$f":"VLOOKUP(A31,[2]RAW!$C$2:$J$8276,4,FALSE)","v":-59},{"$f":"VLOOKUP(A31,[2]RAW!$C$2:$J$8276,5,FALSE)","v":-54},{"$f":"VLOOKUP(A31,[2]RAW!$C$2:$J$8276,6,FALSE)","v":29},{"$f":"VLOOKUP(A31,[2]RAW!$C$2:$J$8276,7,FALSE)","v":56},{"$f":"VLOOKUP(A31,[2]RAW!$C$2:$J$8276,8,FALSE)","v":48},{"$f":"VLOOKUP(A31,[3]RAW!$C$17:$BK$8270,60,FALSE)","v":-23.998333333333335},{"$f":"VLOOKUP(A31,[3]RAW!$C$17:$BK$8270,61,FALSE)","v":29.946666666666665},{"$nulls":21},"x",null,"x",null,"Polokwane"]
["HANKEY",{"$f":"VLOOKUP(A32,'[1]RSG Sites'!$A$2:$F$133,6,FALSE)","v":"Bronze"},{"$f":"VLOOKUP(A32,[2]RAW!$C$2:$O$8276,13,FALSE)","v":"EC"},{"$f":"VLOOKUP(A32,[2]RAW!$C$2:$J$8276,3,FALSE)","v":-33},{"$f":"VLOOKUP(A32,[2]RAW!$C$2:$J$8276,4,FALSE)","v":-49},{"$f":"VLOOKUP(A32,[2]RAW!$C$2:$J$8276,5,FALSE)","v":-52},{"$f":"VLOOKUP(A32,[2]RAW!$C$2:$J$8276,6,FALSE)","v":24},{"$f":"VLOOKUP(A32,[2]RAW!$C$2:$J$8276,7,FALSE)","v":52},{"$f":"VLOOKUP(A32,[2]RAW!$C$2:$J$8276,8,FALSE)","v":12},{"$f":"VLOOKUP(A32,[3]RAW!$C$17:$BK$8270,60,FALSE)","v":-33.83111111111111},{"$f":"VLOOKUP(A32,[3]RAW!$C$17:$BK$8270,61,FALSE)","v":24.87},"x","x","x","x",null,"x",null,"x","x",{"$nulls":14},"x",null,"Port Elizabeth"]
["HECTORSPRUIT",{"$f":"VLOOKUP(A33,'[1]RSG Sites'!$A$2:$F$133,6,FALSE)","v":{"$error":"#N/A"}},{"$f":"VLOOKUP(A33,[2]RAW!$C$2:$O$8276,13,FALSE)","v":"MP"},{"$f":"VLOOKUP(A33,[2]RAW!$C$2:$J$8276,3,FALSE)","v":-25},{"$f":"VLOOKUP(A33,[2]RAW!$C$2:$J$8276,4,FALSE)","v":-28},{"$f":"VLOOKUP(A33,[2]RAW!$C$2:$J$8276,5,FALSE)","v":-47},{"$f":"VLOOKUP(A33,[2]RAW!$C$2:$J$8276,6,FALSE)","v":31},{"$f":"VLOOKUP(A33,[2]RAW!$C$2:$J$8276,7,FALSE)","v":36},{"$f":"VLOOKUP(A33,[2]RAW!$C$2:$J$8276,8,FALSE)","v":20},{"$f":"VLOOKUP(A33,[3]RAW!$C$17:$BK$8270,60,FALSE)","v":-25.47972222222222},{"$f":"VLOOKUP(A33,[3]RAW!$C$17:$BK$8270,61,FALSE)","v":31.605555555555558},null,"x","x",null,null,"x",{"$nulls":10},"x",{"$nulls":6},"x",null,"Nelspruit"]
["HEIDELBERG",{"$f":"VLOOKUP(A34,'[1]RSG Sites'!$A$2:$F$133,6,FALSE)","v":"Silver"},{"$f":"VLOOKUP(A34,[2]RAW!$C$2:$O$8276,13,FALSE)","v":"GP"},{"$f":"VLOOKUP(A34,[2]RAW!$C$2:$J$8276,3,FALSE)","v":-26},{"$f":"VLOOKUP(A34,[2]RAW!$C$2:$J$8276,4,FALSE)","v":-29},{"$f":"VLOOKUP(A34,[2]RAW!$C$2:$J$8276,5,FALSE)","v":-19},{"$f":"VLOOKUP(A34,[2]RAW!$C$2:$J$8276,6,FALSE)","v":28},{"$f":"VLOOKUP(A34,[2]RAW!$C$2:$J$8276,7,FALSE)","v":20},{"$f":"VLOOKUP(A34,[2]RAW!$C$2:$J$8276,8,FALSE)","v":48},{"$f":"VLOOKUP(A34,[3]RAW!$C$17:$BK$8270,60,FALSE)","v":-26.488611111111112},{"$f":"VLOOKUP(A34,[3]RAW!$C$17:$BK$8270,61,FALSE)","v":28.346666666666664},"x","x","x","x","x","x","x","x",null,"x",null,"x",{"$nulls":11},"x",null,"Aucklandpark"]
["HELDERKRUIN",{"$f":"VLOOKUP(A35,'[1]RSG Sites'!$A$2:$F$133,6,FALSE)","v":{"$error":"#N/A"}},{"$f":"VLOOKUP(A35,[2]RAW!$C$2:$O$8276,13,FALSE)","v":"GP"},{"$f":"VLOOKUP(A35,[2]RAW!$C$2:$J$8276,3,FALSE)","v":-26},{"$f":"VLOOKUP(A35,[2]RAW!$C$2:$J$8276,4,FALSE)","v":-6},{"$f":"VLOOKUP(A35,[2]RAW!$C$2:$J$8276,5,FALSE)","v":-5},{"$f":"VLOOKUP(A35,[2]RAW!$C$2:$J$8276,6,FALSE)","v":27},{"$f":"VLOOKUP(A35,[2]RAW!$C$2:$J$8276,7,FALSE)","v":51},{"$f":"VLOOKUP(A35,[2]RAW!$C$2:$J$8276,8,FALSE)","v":27},{"$f":"VLOOKUP(A35,[3]RAW!$C$17:$BK$8270,60,FALSE)","v":-26.10138888888889},{"$f":"VLOOKUP(A35,[3]RAW!$C$17:$BK$8270,61,FALSE)","v":27.8575},null,"x","x",null,null,"x","x",{"$nulls":6},"x",{"$nulls":9},"x",null,"Aucklandpark"]
["HOLY CROSS",{"$f":"VLOOKUP(A36,'[1]RSG Sites'!$A$2:$F$133,6,FALSE)","v":{"$error":"#N/A"}},{"$f":"VLOOKUP(A36,[2]RAW!$C$2:$O$8276,13,FALSE)","v":"EC"},{"$f":"VLOOKUP(A36,[2]RAW!$C$2:$J$8276,3,FALSE)","v":-31},{"$f":"VLOOKUP(A36,[2]RAW!$C$2:$J$8276,4,FALSE)","v":-8},{"$f":"VLOOKUP(A36,[2]RAW!$C$2:$J$8276,5,FALSE)","v":-25},{"$f":"VLOOKUP(A36,[2]RAW!$C$2:$J$8276,6,FALSE)","v":29},{"$f":"VLOOKUP(A36,[2]RAW!$C$2:$J$8276,7,FALSE)","v":29},{"$f":"VLOOKUP(A36,[2]RAW!$C$2:$J$8276,8,FALSE)","v":27},{"$f":"VLOOKUP(A36,[3]RAW!$C$17:$BK$8270,60,FALSE)","v":-31.140277777777776},{"$f":"VLOOKUP(A36,[3]RAW!$C$17:$BK$8270,61,FALSE)","v":29.490833333333335},{"$nulls":5},"x",null,null,"x",{"$nulls":15},"x","Mthatha"]
["HOUT BAY",{"$f":"VLOOKUP(A37,'[1]RSG Sites'!$A$2:$F$133,6,FALSE)","v":"Silver"},{"$f":"VLOOKUP(A37,[2]RAW!$C$2:$O$8276,13,FALSE)","v":"WC"},{"$f":"VLOOKUP(A37,[2]RAW!$C$2:$J$8276,3,FALSE)","v":-34},{"$f":"VLOOKUP(A37,[2]RAW!$C$2:$J$8276,4,FALSE)","v":0},{"$f":"VLOOKUP(A37,[2]RAW!$C$2:$J$8276,5,FALSE)","v":-46},{"$f":"VLOOKUP(A37,[2]RAW!$C$2:$J$8276,6,FALSE)","v":18},{"$f":"VLOOKUP(A37,[2]RAW!$C$2:$J$8276,7,FALSE)","v":20},{"$f":"VLOOKUP(A37,[2]RAW!$C$2:$J$8276,8,FALSE)","v":51},{"$f":"VLOOKUP(A37,[3]RAW!$C$17:$BK$8270,60,FALSE)","v":-34.01277777777778},{"$f":"VLOOKUP(A37,[3]RAW!$C$17:$BK$8270,61,FALSE)","v":18.3475},"x","x","x","x","x","x","x","x",{"$nulls":5},"x","x",{"$nulls":8},"x",null,"Seapoint"]
["JAGERSFONTEIN",{"$f":"VLOOKUP(A38,'[1]RSG Sites'!$A$2:$F$133,6,FALSE)","v":{"$error":"#N/A"}},{"$f":"VLOOKUP(A38,[2]RAW!$C$2:$O$8276,13,FALSE)","v":"FS"},{"$f":"VLOOKUP(A38,[2]RAW!$C$2:$J$8276,3,FALSE)","v":-29},{"$f":"VLOOKUP(A38,[2]RAW!$C$2:$J$8276,4,FALSE)","v":-45},{"$f":"VLOOKUP(A38,[2]RAW!$C$2:$J$8276,5,FALSE)","v":-23},{"$f":"VLOOKUP(A38,[2]RAW!$C$2:$J$8276,6,FALSE)","v":25},{"$f":"VLOOKUP(A38,[2]RAW!$C$2:$J$8276,7,FALSE)","v":25},{"$f":"VLOOKUP(A38,[2]RAW!$C$2:$J$8276,8,FALSE)","v":47},{"$f":"VLOOKUP(A38,[3]RAW!$C$17:$BK$8270,60,FALSE)","v":-29.75638888888889},{"$f":"VLOOKUP(A38,[3]RAW!$C$17:$BK$8270,61,FALSE)","v":25.429722222222225},null,"x","x","x",{"$nulls":5},"x",{"$nulls":13},"x",null,"Bloemfontein"]
["JOHANNESBURG",{"$f":"VLOOKUP(A39,'[1]RSG Sites'!$A$2:$F$133,6,FALSE)","v":"Platinum"},{"$f":"VLOOKUP(A39,[2]RAW!$C$2:$O$8276,13,FALSE)","v":"GP"},{"$f":"VLOOKUP(A39,[2]RAW!$C$2:$J$8276,3,FALSE)","v":-26},{"$f":"VLOOKUP(A39,[2]RAW!$C$2:$J$8276,4,FALSE)","v":-11},{"$f":"VLOOKUP(A39,[2]RAW!$C$2:$J$8276,5,FALSE)","v":-31},{"$f":"VLOOKUP(A39,[2]RAW!$C$2:$J$8276,6,FALSE)","v":28},{"$f":"VLOOKUP(A39,[2]RAW!$C$2:$J$8276,7,FALSE)","v":0},{"$f":"VLOOKUP(A39,[2]RAW!$C$2:$J$8276,8,FALSE)","v":26},{"$f":"VLOOKUP(A39,[3]RAW!$C$17:$BK$8270,60,FALSE)","v":-26.191944444444445},{"$f":"VLOOKUP(A39,[3]RAW!$C$17:$BK$8270,61,FALSE)","v":28.00722222222222},"x","x","x","x","x","x","x","x","x","x",null,"x","x","x",null,"x",null,"x","x","x","x","x",null,"x",null,"Aucklandpark"]
["KAREEDOUW",{"$f":"VLOOKUP(A40,'[1]RSG Sites'!$A$2:$F$133,6,FALSE)","v":"Silver"},{"$f":"VLOOKUP(A40,[2]RAW!$C$2:$O$8276,13,FALSE)","v":"EC"},{"$f":"VLOOKUP(A40,[2]RAW!$C$2:$J$8276,3,FALSE)","v":-33},{"$f":"VLOOKUP(A40,[2]RAW!$C$2:$J$8276,4,FALSE)","v":-57},{"$f":"VLOOKUP(A40,[2]RAW!$C$2:$J$8276,5,FALSE)","v":-48},{"$f":"VLOOKUP(A40,[2]RAW!$C$2:$J$8276,6,FALSE)","v":24},{"$f":"VLOOKUP(A40,[2]RAW!$C$2:$J$8276,7,FALSE)","v":17},{"$f":"VLOOKUP(A40,[2]RAW!$C$2:$J$8276,8,FALSE)","v":15},{"$f":"VLOOKUP(A40,[3]RAW!$C$17:$BK$8270,60,FALSE)","v":-34.02472222222222},{"$f":"VLOOKUP(A40,[3]RAW!$C$17:$BK$8270,61,FALSE)","v":24.43},"x","x","x",null,null,"x",null,"x","x",{"$nulls":14},"x",null,"Port Elizabeth"]
["KIMBERLEY",{"$f":"VLOOKUP(A41,'[1]RSG Sites'!$A$2:$F$133,6,FALSE)","v":"Gold"},{"$f":"VLOOKUP(A41,[2]RAW!$C$2:$O$8276,13,FALSE)","v":"FS"},{"$f":"VLOOKUP(A41,[2]RAW!$C$2:$J$8276,3,FALSE)","v":-28},{"$f":"VLOOKUP(A41,[2]RAW!$C$2:$J$8276,4,FALSE)","v":-51},{"$f":"VLOOKUP(A41,[2]RAW!$C$2:$J$8276,5,FALSE)","v":0},{"$f":"VLOOKUP(A41,[2]RAW!$C$2:$J$8276,6,FALSE)","v":24},{"$f":"VLOOKUP(A41,[2]RAW!$C$2:$J$8276,7,FALSE)","v":54},{"$f":"VLOOKUP(A41,[2]RAW!$C$2:$J$8276,8,FALSE)","v":0},{"$f":"VLOOKUP(A41,[3]RAW!$C$17:$BK$8270,60,FALSE)","v":-28.854166666666668},{"$f":"VLOOKUP(A41,[3]RAW!$C$17:$BK$8270,61,FALSE)","v":24.904722222222222},"x","x","x","x","x","x","x","x","x","x",null,null,"x","x",{"$nulls":5},"x",{"$nulls":3},"x",null,"Kimbely"]
["KING WILLIAMS TOWN",{"$f":"VLOOKUP(A42,'[1]RSG Sites'!$A$2:$F$133,6,FALSE)","v":"Silver"},{"$f":"VLOOKUP(A42,[2]RAW!$C$2:$O$8276,13,FALSE)","v":"EC"},{"$f":"VLOOKUP(A42,[2]RAW!$C$2:$J$8276,3,FALSE)","v":-32},{"$f":"VLOOKUP(A42,[2]RAW!$C$2:$J$8276,4,FALSE)","v":-51},{"$f":"VLOOKUP(A42,[2]RAW!$C$2:$J$8276,5,FALSE)","v":-36},{"$f":"VLOOKUP(A42,[2]RAW!$C$2:$J$8276,6,FALSE)","v":27},{"$f":"VLOOKUP(A42,[2]RAW!$C$2:$J$8276,7,FALSE)","v":24},{"$f":"VLOOKUP(A42,[2]RAW!$C$2:$J$8276,8,FALSE)","v":50},{"$f":"VLOOKUP(A42,[3]RAW!$C$17:$BK$8270,60,FALSE)","v":-32.678888888888885},{"$f":"VLOOKUP(A42,[3]RAW!$C$17:$BK$8270,61,FALSE)","v":27.26},"x","x","x","x",null,"x","x","x","x",{"$nulls":13},"x","x",null,"Eastlondon"]
["KIRKWOOD",{"$f":"VLOOKUP(A43,'[1]RSG Sites'!$A$2:$F$133,6,FALSE)","v":{"$error":"#N/A"}},{"$f":"VLOOKUP(A43,[2]RAW!$C$2:$O$8276,13,FALSE)","v":"EC"},{"$f":"VLOOKUP(A43,[2]RAW!$C$2:$J$8276,3,FALSE)","v":-33},{"$f":"VLOOKUP(A43,[2]RAW!$C$2:$J$8276,4,FALSE)","v":-23},{"$f":"VLOOKUP(A43,[2]RAW!$C$2:$J$8276,5,FALSE)","v":-22},{"$f":"VLOOKUP(A43,[2]RAW!$C$2:$J$8276,6,FALSE)","v":25},{"$f":"VLOOKUP(A43,[2]RAW!$C$2:$J$8276,7,FALSE)","v":26},{"$f":"VLOOKUP(A43,[2]RAW!$C$2:$J$8276,8,FALSE)","v":53},{"$f":"VLOOKUP(A43,[3]RAW!$C$17:$BK$8270,60,FALSE)","v":-33.402499999999996},{"$f":"VLOOKUP(A43,[3]RAW!$C$17:$BK$8270,61,FALSE)","v":25.52472222222222},null,null,"x",null,null,"x",{"$nulls":17},"x",null,"Port Elizabeth"]
["KNYSNA",{"$f":"VLOOKUP(A44,'[1]RSG Sites'!$A$2:$F$133,6,FALSE)","v":"Silver"},{"$f":"VLOOKUP(A44,[2]RAW!$C$2:$O$8276,13,FALSE)","v":"WC"},{"$f":"VLOOKUP(A44,[2]RAW!$C$2:$J$8276,3,FALSE)","v":-34},{"$f":"VLOOKUP(A44,[2]RAW!$C$2:$J$8276,4,FALSE)","v":-4},{"$f":"VLOOKUP(A44,[2]RAW!$C$2:$J$8276,5,FALSE)","v":-38},{"$f":"VLOOKUP(A44,[2]RAW!$C$2:$J$8276,6,FALSE)","v":23},{"$f":"VLOOKUP(A44,[2]RAW!$C$2:$J$8276,7,FALSE)","v":2},{"$f":"VLOOKUP(A44,[2]RAW!$C$2:$J$8276,8,FALSE)","v":58},{"$f":"VLOOKUP(A44,[3]RAW!$C$17:$BK$8270,60,FALSE)","v":-34.07138888888889},{"$f":"VLOOKUP(A44,[3]RAW!$C$17:$BK$8270,61,FALSE)","v":23.041944444444447},"x","x","x","x","x","x","x","x","x",{"$nulls":6},"x",{"$nulls":7},"x",null,"George"]
["KOMGA",{"$f":"VLOOKUP(A45,'[1]RSG Sites'!$A$2:$F$133,6,FALSE)","v":{"$error":"#N/A"}},{"$f":"VLOOKUP(A45,[2]RAW!$C$2:$O$8276,13,FALSE)","v":"EC"},{"$f":"VLOOKUP(A45,[2]RAW!$C$2:$J$8276,3,FALSE)","v":-32},{"$f":"VLOOKUP(A45,[2]RAW!$C$2:$J$8276,4,FALSE)","v":-33},{"$f":"VLOOKUP(A45,[2]RAW!$C$2:$J$8276,5,FALSE)","v":-44},{"$f":"VLOOKUP(A45,[2]RAW!$C$2:$J$8276,6,FALSE)","v":27},{"$f":"VLOOKUP(A45,[2]RAW!$C$2:$J$8276,7,FALSE)","v":51},{"$f":"VLOOKUP(A45,[2]RAW!$C$2:$J$8276,8,FALSE)","v":45},{"$f":"VLOOKUP(A45,[3]RAW!$C$17:$BK$8270,60,FALSE)","v":-32.56222222222222},{"$f":"VLOOKUP(A45,[3]RAW!$C$17:$BK$8270,61,FALSE)","v":27.8625},{"$nulls":8},"x",{"$nulls":14},"x",null,"Eastlondon"]
["KWAGGAFONTEIN",{"$f":"VLOOKUP(A46,'[1]RSG Sites'!$A$2:$F$133,6,FALSE)","v":{"$error":"#N/A"}},{"$f":"VLOOKUP(A46,[2]RAW!$C$2:$O$8276,13,FALSE)","v":"MP"},{"$f":"VLOOKUP(A46,[2]RAW!$C$2:$J$8276,3,FALSE)","v":-25},{"$f":"VLOOKUP(A46,[2]RAW!$C$2:$J$8276,4,FALSE)","v":-14},{"$f":"VLOOKUP(A46,[2]RAW!$C$2:$J$8276,5,FALSE)","v":-37},{"$f":"VLOOKUP(A46,[2]RAW!$C$2:$J$8276,6,FALSE)","v":28},{"$f":"VLOOKUP(A46,[2]RAW!$C$2:$J$8276,7,FALSE)","v":57},{"$f":"VLOOKUP(A46,[2]RAW!$C$2:$J$8276,8,FALSE)","v":27},{"$f":"VLOOKUP(A46,[3]RAW!$C$17:$BK$8270,60,FALSE)","v":-25.24361111111111},{"$f":"VLOOKUP(A46,[3]RAW!$C$17:$BK$8270,61,FALSE)","v":28.9575},{"$nulls":15},"x",{"$nulls":5},"x",null,"x",null,"Hatfield"]
["KWAMHLANGA",{"$f":"VLOOKUP(A47,'[1]RSG Sites'!$A$2:$F$133,6,FALSE)","v":{"$error":"#N/A"}},{"$f":"VLOOKUP(A47,[2]RAW!$C$2:$O$8276,13,FALSE)","v":"MP"},{"$f":"VLOOKUP(A47,[2]RAW!$C$2:$J$8276,3,FALSE)","v":-25},{"$f":"VLOOKUP(A47,[2]RAW!$C$2:$J$8276,4,FALSE)","v":-26},{"$f":"VLOOKUP(A47,[2]RAW!$C$2:$J$8276,5,FALSE)","v":-22},{"$f":"VLOOKUP(A47,[2]RAW!$C$2:$J$8276,6,FALSE)","v":28},{"$f":"VLOOKUP(A47,[2]RAW!$C$2:$J$8276,7,FALSE)","v":30},{"$f":"VLOOKUP(A47,[2]RAW!$C$2:$J$8276,8,FALSE)","v":49},{"$f":"VLOOKUP(A47,[3]RAW!$C$17:$BK$8270,60,FALSE)","v":-25.439444444444444},{"$f":"VLOOKUP(A47,[3]RAW!$C$17:$BK$8270,61,FALSE)","v":28.51361111111111},{"$nulls":15},"x",{"$nulls":7},"x",null,"Hatfield"]
["LADYBRAND",{"$f":"VLOOKUP(A48,'[1]RSG Sites'!$A$2:$F$133,6,FALSE)","v":"Silver"},{"$f":"VLOOKUP(A48,[2]RAW!$C$2:$O$8276,13,FALSE)","v":"FS"},{"$f":"VLOOKUP(A48,[2]RAW!$C$2:$J$8276,3,FALSE)","v":-29},{"$f":"VLOOKUP(A48,[2]RAW!$C$2:$J$8276,4,FALSE)","v":-10},{"$f":"VLOOKUP(A48,[2]RAW!$C$2:$J$8276,5,FALSE)","v":-18},{"$f":"VLOOKUP(A48,[2]RAW!$C$2:$J$8276,6,FALSE)","v":27},{"$f":"VLOOKUP(A48,[2]RAW!$C$2:$J$8276,7,FALSE)","v":22},{"$f":"VLOOKUP(A48,[2]RAW!$C$2:$J$8276,8,FALSE)","v":42},{"$f":"VLOOKUP(A48,[3]RAW!$C$17:$BK$8270,60,FALSE)","v":-29.171666666666667},{"$f":"VLOOKUP(A48,[3]RAW!$C$17:$BK$8270,61,FALSE)","v":27.378333333333334},"x","x","x",null,null,"x","x","x",null,"x",{"$nulls":13},"x",null,"Bloemfontein"]
["LINMEYER",{"$f":"VLOOKUP(A49,'[1]RSG Sites'!$A$2:$F$133,6,FALSE)","v":{"$error":"#N/A"}},{"$f":"VLOOKUP(A49,[2]RAW!$C$2:$O$8276,13,FALSE)","v":"GP"},{"$f":"VLOOKUP(A49,[2]RAW!$C$2:$J$8276,3,FALSE)","v":-26},{"$f":"VLOOKUP(A49,[2]RAW!$C$2:$J$8276,4,FALSE)","v":-16},{"$f":"VLOOKUP(A49,[2]RAW!$C$2:$J$8276,5,FALSE)","v":-8},{"$f":"VLOOKUP(A49,[2]RAW!$C$2:$J$8276,6,FALSE)","v":28},{"$f":"VLOOKUP(A49,[2]RAW!$C$2:$J$8276,7,FALSE)","v":4},{"$f":"VLOOKUP(A49,[2]RAW!$C$2:$J$8276,8,FALSE)","v":16},{"$f":"VLOOKUP(A49,[3]RAW!$C$17:$BK$8270,60,FALSE)","v":-26.26888888888889},{"$f":"VLOOKUP(A49,[3]RAW!$C$17:$BK$8270,61,FALSE)","v":28.07111111111111},null,"x","x","x",null,"x","x",{"$nulls":16},"x",null,"Aucklandpark"]
["LOUIS TRICHARDT",{"$f":"VLOOKUP(A50,'[1]RSG Sites'!$A$2:$F$133,6,FALSE)","v":"Silver"},{"$f":"VLOOKUP(A50,[2]RAW!$C$2:$O$8276,13,FALSE)","v":"LP"},{"$f":"VLOOKUP(A50,[2]RAW!$C$2:$J$8276,3,FALSE)","v":-23},{"$f":"VLOOKUP(A50,[2]RAW!$C$2:$J$8276,4,FALSE)","v":0},{"$f":"VLOOKUP(A50,[2]RAW!$C$2:$J$8276,5,FALSE)","v":-2},{"$f":"VLOOKUP(A50,[2]RAW!$C$2:$J$8276,6,FALSE)","v":29},{"$f":"VLOOKUP(A50,[2]RAW!$C$2:$J$8276,7,FALSE)","v":45},{"$f":"VLOOKUP(A50,[2]RAW!$C$2:$J$8276,8,FALSE)","v":26},{"$f":"VLOOKUP(A50,[3]RAW!$C$17:$BK$8270,60,FALSE)","v":-23.000555555555554},{"$f":"VLOOKUP(A50,[3]RAW!$C$17:$BK$8270,61,FALSE)","v":29.75722222222222},"x","x","x","x","x","x","x","x",{"$nulls":10},"x",null,"x","x",null,"x",null,"Polokwane"]
["LYDENBURG",{"$f":"VLOOKUP(A51,'[1]RSG Sites'!$A$2:$F$133,6,FALSE)","v":"Bronze"},{"$f":"VLOOKUP(A51,[2]RAW!$C$2:$O$8276,13,FALSE)","v":"MP"},{"$f":"VLOOKUP(A51,[2]RAW!$C$2:$J$8276,3,FALSE)","v":-25},{"$f":"VLOOKUP(A51,[2]RAW!$C$2:$J$8276,4,FALSE)","v":-6},{"$f":"VLOOKUP(A51,[2]RAW!$C$2:$J$8276,5,FALSE)","v":-20},{"$f":"VLOOKUP(A51,[2]RAW!$C$2:$J$8276,6,FALSE)","v":30},{"$f":"VLOOKUP(A51,[2]RAW!$C$2:$J$8276,7,FALSE)","v":26},{"$f":"VLOOKUP(A51,[2]RAW!$C$2:$J$8276,8,FALSE)","v":3},{"$f":"VLOOKUP(A51,[3]RAW!$C$17:$BK$8270,60,FALSE)","v":-25.105555555555558},{"$f":"VLOOKUP(A51,[3]RAW!$C$17:$BK$8270,61,FALSE)","v":30.434166666666666},"x",null,"x",null,null,"x",null,"x",{"$nulls":8},"x",{"$nulls":6},"x",null,"Nelspruit"]
["MADIBOGO",{"$f":"VLOOKUP(A52,'[1]RSG Sites'!$A$2:$F$133,6,FALSE)","v":{"$error":"#N/A"}},{"$f":"VLOOKUP(A52,[2]RAW!$C$2:$O$8276,13,FALSE)","v":"NW"},{"$f":"VLOOKUP(A52,[2]RAW!$C$2:$J$8276,3,FALSE)","v":-26},{"$f":"VLOOKUP(A52,[2]RAW!$C$2:$J$8276,4,FALSE)","v":-27},{"$f":"VLOOKUP(A52,[2]RAW!$C$2:$J$8276,5,FALSE)","v":-28},{"$f":"VLOOKUP(A52,[2]RAW!$C$2:$J$8276,6,FALSE)","v":25},{"$f":"VLOOKUP(A52,[2]RAW!$C$2:$J$8276,7,FALSE)","v":15},{"$f":"VLOOKUP(A52,[2]RAW!$C$2:$J$8276,8,FALSE)","v":14},{"$f":"VLOOKUP(A52,[3]RAW!$C$17:$BK$8270,60,FALSE)","v":-26.45777777777778},{"$f":"VLOOKUP(A52,[3]RAW!$C$17:$BK$8270,61,FALSE)","v":25.253888888888888},null,"x","x",null,null,"x",{"$nulls":13},"x",{"$nulls":3},"x",null,"Mahikeng"]
["MALAMBA",{"$f":"VLOOKUP(A53,'[1]RSG Sites'!$A$2:$F$133,6,FALSE)","v":{"$error":"#N/A"}},{"$f":"VLOOKUP(A53,[2]RAW!$C$2:$O$8276,13,FALSE)","v":"LP"},{"$f":"VLOOKUP(A53,[2]RAW!$C$2:$J$8276,3,FALSE)","v":-22},{"$f":"VLOOKUP(A53,[2]RAW!$C$2:$J$8276,4,FALSE)","v":-53},{"$f":"VLOOKUP(A53,[2]RAW!$C$2:$J$8276,5,FALSE)","v":-56},{"$f":"VLOOKUP(A53,[2]RAW!$C$2:$J$8276,6,FALSE)","v":30},{"$f":"VLOOKUP(A53,[2]RAW!$C$2:$J$8276,7,FALSE)","v":15},{"$f":"VLOOKUP(A53,[2]RAW!$C$2:$J$8276,8,FALSE)","v":9},{"$f":"VLOOKUP(A53,[3]RAW!$C$17:$BK$8270,60,FALSE)","v":-22.898888888888887},{"$f":"VLOOKUP(A53,[3]RAW!$C$17:$BK$8270,61,FALSE)","v":30.2525},null,"x","x",null,null,"x",{"$nulls":12},"x",{"$nulls":4},"x",null,"Thohoyandou"]
["MATATIELE",{"$f":"VLOOKUP(A54,'[1]RSG Sites'!$A$2:$F$133,6,FALSE)","v":"Silver"},{"$f":"VLOOKUP(A54,[2]RAW!$C$2:$O$8276,13,FALSE)","v":"EC"},{"$f":"VLOOKUP(A54,[2]RAW!$C$2:$J$8276,3,FALSE)","v":-30},{"$f":"VLOOKUP(A54,[2]RAW!$C$2:$J$8276,4,FALSE)","v":-23},{"$f":"VLOOKUP(A54,[2]RAW!$C$2:$J$8276,5,FALSE)","v":-45},{"$f":"VLOOKUP(A54,[2]RAW!$C$2:$J$8276,6,FALSE)","v":28},{"$f":"VLOOKUP(A54,[2]RAW!$C$2:$J$8276,7,FALSE)","v":49},{"$f":"VLOOKUP(A54,[2]RAW!$C$2:$J$8276,8,FALSE)","v":19},{"$f":"VLOOKUP(A54,[3]RAW!$C$17:$BK$8270,60,FALSE)","v":-30.395833333333332},{"$f":"VLOOKUP(A54,[3]RAW!$C$17:$BK$8270,61,FALSE)","v":28.821944444444444},"x","x","x","x",null,"x","x","x",null,"x",{"$nulls":14},"x","Mthatha"]
["MENLO PARK",{"$f":"VLOOKUP(A55,'[1]RSG Sites'!$A$2:$F$133,6,FALSE)","v":"Silver"},{"$f":"VLOOKUP(A55,[2]RAW!$C$2:$O$8276,13,FALSE)","v":"GP"},{"$f":"VLOOKUP(A55,[2]RAW!$C$2:$J$8276,3,FALSE)","v":-25},{"$f":"VLOOKUP(A55,[2]RAW!$C$2:$J$8276,4,FALSE)","v":-46},{"$f":"VLOOKUP(A55,[2]RAW!$C$2:$J$8276,5,FALSE)","v":-16},{"$f":"VLOOKUP(A55,[2]RAW!$C$2:$J$8276,6,FALSE)","v":28},{"$f":"VLOOKUP(A55,[2]RAW!$C$2:$J$8276,7,FALSE)","v":16},{"$f":"VLOOKUP(A55,[2]RAW!$C$2:$J$8276,8,FALSE)","v":5},{"$f":"VLOOKUP(A55,[3]RAW!$C$17:$BK$8270,60,FALSE)","v":-25.77111111111111},{"$f":"VLOOKUP(A55,[3]RAW!$C$17:$BK$8270,61,FALSE)","v":28.268055555555556},"x","x","x","x","x","x","x","x",{"$nulls":11},"x",{"$nulls":3},"x",null,"Aucklandpark"]
["MIDDELBURG",{"$f":"VLOOKUP(A56,'[1]RSG Sites'!$A$2:$F$133,6,FALSE)","v":"Gold"},{"$f":"VLOOKUP(A56,[2]RAW!$C$2:$O$8276,13,FALSE)","v":"MP"},{"$f":"VLOOKUP(A56,[2]RAW!$C$2:$J$8276,3,FALSE)","v":-25},{"$f":"VLOOKUP(A56,[2]RAW!$C$2:$J$8276,4,FALSE)","v":-49},{"$f":"VLOOKUP(A56,[2]RAW!$C$2:$J$8276,5,FALSE)","v":-4},{"$f":"VLOOKUP(A56,[2]RAW!$C$2:$J$8276,6,FALSE)","v":29},{"$f":"VLOOKUP(A56,[2]RAW!$C$2:$J$8276,7,FALSE)","v":23},{"$f":"VLOOKUP(A56,[2]RAW!$C$2:$J$8276,8,FALSE)","v":24},{"$f":"VLOOKUP(A56,[3]RAW!$C$17:$BK$8270,60,FALSE)","v":-25.817777777777778},{"$f":"VLOOKUP(A56,[3]RAW!$C$17:$BK$8270,61,FALSE)","v":29.39},"x","x","x","x","x","x","x","x",{"$nulls":3},"x","x","x",null,"x","x",{"$nulls":4},"x",null,"x",null,"Hatfield"]
["MMABATHO",{"$f":"VLOOKUP(A57,'[1]RSG Sites'!$A$2:$F$133,6,FALSE)","v":{"$error":"#N/A"}},{"$f":"VLOOKUP(A57,[2]RAW!$C$2:$O$8276,13,FALSE)","v":"NW"},{"$f":"VLOOKUP(A57,[2]RAW!$C$2:$J$8276,3,FALSE)","v":-25},{"$f":"VLOOKUP(A57,[2]RAW!$C$2:$J$8276,4,FALSE)","v":-50},{"$f":"VLOOKUP(A57,[2]RAW!$C$2:$J$8276,5,FALSE)","v":-22},{"$f":"VLOOKUP(A57,[2]RAW!$C$2:$J$8276,6,FALSE)","v":25},{"$f":"VLOOKUP(A57,[2]RAW!$C$2:$J$8276,7,FALSE)","v":36},{"$f":"VLOOKUP(A57,[2]RAW!$C$2:$J$8276,8,FALSE)","v":46},{"$f":"VLOOKUP(A57,[3]RAW!$C$17:$BK$8270,60,FALSE)","v":-25.839444444444442},{"$f":"VLOOKUP(A57,[3]RAW!$C$17:$BK$8270,61,FALSE)","v":25.61277777777778},{"$nulls":8},"x","x",{"$nulls":9},"x",{"$nulls":3},"x",null,"Mahikeng"]
["MONDEOR",{"$f":"VLOOKUP(A58,'[1]RSG Sites'!$A$2:$F$133,6,FALSE)","v":{"$error":"#N/A"}},{"$f":"VLOOKUP(A58,[2]RAW!$C$2:$O$8276,13,FALSE)","v":"GP"},{"$f":"VLOOKUP(A58,[2]RAW!$C$2:$J$8276,3,FALSE)","v":-26},{"$f":"VLOOKUP(A58,[2]RAW!$C$2:$J$8276,4,FALSE)","v":-16},{"$f":"VLOOKUP(A58,[2]RAW!$C$2:$J$8276,5,FALSE)","v":-54},{"$f":"VLOOKUP(A58,[2]RAW!$C$2:$J$8276,6,FALSE)","v":27},{"$f":"VLOOKUP(A58,[2]RAW!$C$2:$J$8276,7,FALSE)","v":59},{"$f":"VLOOKUP(A58,[2]RAW!$C$2:$J$8276,8,FALSE)","v":37},{"$f":"VLOOKUP(A58,[3]RAW!$C$17:$BK$8270,60,FALSE)","v":-26.281666666666666},{"$f":"VLOOKUP(A58,[3]RAW!$C$17:$BK$8270,61,FALSE)","v":27.99361111111111},null,"x","x","x",null,"x","x",{"$nulls":16},"x",null,"Aucklandpark"]
["MOTSWEDI",{"$f":"VLOOKUP(A59,'[1]RSG Sites'!$A$2:$F$133,6,FALSE)","v":{"$error":"#N/A"}},{"$f":"VLOOKUP(A59,[2]RAW!$C$2:$O$8276,13,FALSE)","v":"NW"},{"$f":"VLOOKUP(A59,[2]RAW!$C$2:$J$8276,3,FALSE)","v":-25},{"$f":"VLOOKUP(A59,[2]RAW!$C$2:$J$8276,4,FALSE)","v":-16},{"$f":"VLOOKUP(A59,[2]RAW!$C$2:$J$8276,5,FALSE)","v":-55},{"$f":"VLOOKUP(A59,[2]RAW!$C$2:$J$8276,6,FALSE)","v":25},{"$f":"VLOOKUP(A59,[2]RAW!$C$2:$J$8276,7,FALSE)","v":52},{"$f":"VLOOKUP(A59,[2]RAW!$C$2:$J$8276,8,FALSE)","v":18},{"$f":"VLOOKUP(A59,[3]RAW!$C$17:$BK$8270,60,FALSE)","v":-25.281944444444445},{"$f":"VLOOKUP(A59,[3]RAW!$C$17:$BK$8270,61,FALSE)","v":25.871666666666666},null,"x","x",null,null,"x",{"$nulls":13},"x",{"$nulls":3},"x",null,"Mahikeng"]
["MOUNT AYLIFF",{"$f":"VLOOKUP(A60,'[1]RSG Sites'!$A$2:$F$133,6,FALSE)","v":"Silver"},{"$f":"VLOOKUP(A60,[2]RAW!$C$2:$O$8276,13,FALSE)","v":"EC"},{"$f":"VLOOKUP(A60,[2]RAW!$C$2:$J$8276,3,FALSE)","v":-30},{"$f":"VLOOKUP(A60,[2]RAW!$C$2:$J$8276,4,FALSE)","v":-50},{"$f":"VLOOKUP(A60,[2]RAW!$C$2:$J$8276,5,FALSE)","v":-11},{"$f":"VLOOKUP(A60,[2]RAW!$C$2:$J$8276,6,FALSE)","v":29},{"$f":"VLOOKUP(A60,[2]RAW!$C$2:$J$8276,7,FALSE)","v":23},{"$f":"VLOOKUP(A60,[2]RAW!$C$2:$J$8276,8,FALSE)","v":41},{"$f":"VLOOKUP(A60,[3]RAW!$C$17:$BK$8270,60,FALSE)","v":-30.836388888888887},{"$f":"VLOOKUP(A60,[3]RAW!$C$17:$BK$8270,61,FALSE)","v":29.39472222222222},"x","x","x","x","x","x","x","x","x",null,null,"x",{"$nulls":12},"x","Mthatha"]
["MULBARTON",{"$f":"VLOOKUP(A61,'[1]RSG Sites'!$A$2:$F$133,6,FALSE)","v":{"$error":"#N/A"}},{"$f":"VLOOKUP(A61,[2]RAW!$C$2:$O$8276,13,FALSE)","v":"GP"},{"$f":"VLOOKUP(A61,[2]RAW!$C$2:$J$8276,3,FALSE)","v":-26},{"$f":"VLOOKUP(A61,[2]RAW!$C$2:$J$8276,4,FALSE)","v":-17},{"$f":"VLOOKUP(A61,[2]RAW!$C$2:$J$8276,5,FALSE)","v":-38},{"$f":"VLOOKUP(A61,[2]RAW!$C$2:$J$8276,6,FALSE)","v":28},{"$f":"VLOOKUP(A61,[2]RAW!$C$2:$J$8276,7,FALSE)","v":3},{"$f":"VLOOKUP(A61,[2]RAW!$C$2:$J$8276,8,FALSE)","v":56},{"$f":"VLOOKUP(A61,[3]RAW!$C$17:$BK$8270,60,FALSE)","v":-26.29388888888889},{"$f":"VLOOKUP(A61,[3]RAW!$C$17:$BK$8270,61,FALSE)","v":28.065555555555555},null,"x","x","x",null,"x","x",{"$nulls":16},"x",null,"Aucklandpark"]
["NELSPRUIT",{"$f":"VLOOKUP(A62,'[1]RSG Sites'!$A$2:$F$133,6,FALSE)","v":"Gold"},{"$f":"VLOOKUP(A62,[2]RAW!$C$2:$O$8276,13,FALSE)","v":"MP"},{"$f":"VLOOKUP(A62,[2]RAW!$C$2:$J$8276,3,FALSE)","v":-25},{"$f":"VLOOKUP(A62,[2]RAW!$C$2:$J$8276,4,FALSE)","v":-30},{"$f":"VLOOKUP(A62,[2]RAW!$C$2:$J$8276,5,FALSE)","v":-57},{"$f":"VLOOKUP(A62,[2]RAW!$C$2:$J$8276,6,FALSE)","v":30},{"$f":"VLOOKUP(A62,[2]RAW!$C$2:$J$8276,7,FALSE)","v":46},{"$f":"VLOOKUP(A62,[2]RAW!$C$2:$J$8276,8,FALSE)","v":33},{"$f":"VLOOKUP(A62,[3]RAW!$C$17:$BK$8270,60,FALSE)","v":-25.515833333333333},{"$f":"VLOOKUP(A62,[3]RAW!$C$17:$BK$8270,61,FALSE)","v":30.77583333333333},"x","x","x","x","x","x","x","x",{"$nulls":4},"x","x",null,null,"x",{"$nulls":3},"x",null,null,"x",null,"Nelspruit"]
["OUDTSHOORN",{"$f":"VLOOKUP(A63,'[1]RSG Sites'!$A$2:$F$133,6,FALSE)","v":"Gold"},{"$f":"VLOOKUP(A63,[2]RAW!$C$2:$O$8276,13,FALSE)","v":"WC"},{"$f":"VLOOKUP(A63,[2]RAW!$C$2:$J$8276,3,FALSE)","v":-33},{"$f":"VLOOKUP(A63,[2]RAW!$C$2:$J$8276,4,FALSE)","v":-34},{"$f":"VLOOKUP(A63,[2]RAW!$C$2:$J$8276,5,FALSE)","v":-49},{"$f":"VLOOKUP(A63,[2]RAW!$C$2:$J$8276,6,FALSE)","v":22},{"$f":"VLOOKUP(A63,[2]RAW!$C$2:$J$8276,7,FALSE)","v":13},{"$f":"VLOOKUP(A63,[2]RAW!$C$2:$J$8276,8,FALSE)","v":35},{"$f":"VLOOKUP(A63,[3]RAW!$C$17:$BK$8270,60,FALSE)","v":-33.671388888888885},{"$f":"VLOOKUP(A63,[3]RAW!$C$17:$BK$8270,61,FALSE)","v":22.266944444444444},"x","x","x","x","x","x","x","x","x",{"$nulls":4},"x",{"$nulls":9},"x",null,"George"]
["OVERPORT",{"$f":"VLOOKUP(A64,'[1]RSG Sites'!$A$2:$F$133,6,FALSE)","v":{"$error":"#N/A"}},{"$f":"VLOOKUP(A64,[2]RAW!$C$2:$O$8276,13,FALSE)","v":"KN"},{"$f":"VLOOKUP(A64,[2]RAW!$C$2:$J$8276,3,FALSE)","v":-29},{"$f":"VLOOKUP(A64,[2]RAW!$C$2:$J$8276,4,FALSE)","v":-50},{"$f":"VLOOKUP(A64,[2]RAW!$C$2:$J$8276,5,FALSE)","v":-12},{"$f":"VLOOKUP(A64,[2]RAW!$C$2:$J$8276,6,FALSE)","v":30},{"$f":"VLOOKUP(A64,[2]RAW!$C$2:$J$8276,7,FALSE)","v":59},{"$f":"VLOOKUP(A64,[2]RAW!$C$2:$J$8276,8,FALSE)","v":44},{"$f":"VLOOKUP(A64,[3]RAW!$C$17:$BK$8270,60,FALSE)","v":-29.836666666666666},{"$f":"VLOOKUP(A64,[3]RAW!$C$17:$BK$8270,61,FALSE)","v":30.995555555555555},null,"x","x","x",null,"x","x",{"$nulls":16},"x",null,"Durban"]
["PAARL",{"$f":"VLOOKUP(A65,'[1]RSG Sites'!$A$2:$F$133,6,FALSE)","v":"Silver"},{"$f":"VLOOKUP(A65,[2]RAW!$C$2:$O$8276,13,FALSE)","v":"WC"},{"$f":"VLOOKUP(A65,[2]RAW!$C$2:$J$8276,3,FALSE)","v":-33},{"$f":"VLOOKUP(A65,[2]RAW!$C$2:$J$8276,4,FALSE)","v":-42},{"$f":"VLOOKUP(A65,[2]RAW!$C$2:$J$8276,5,FALSE)","v":-51},{"$f":"VLOOKUP(A65,[2]RAW!$C$2:$J$8276,6,FALSE)","v":18},{"$f":"VLOOKUP(A65,[2]RAW!$C$2:$J$8276,7,FALSE)","v":56},{"$f":"VLOOKUP(A65,[2]RAW!$C$2:$J$8276,8,FALSE)","v":23},{"$f":"VLOOKUP(A65,[3]RAW!$C$17:$BK$8270,60,FALSE)","v":-33.71416666666667},{"$f":"VLOOKUP(A65,[3]RAW!$C$17:$BK$8270,61,FALSE)","v":18.939722222222223},"x","x","x","x","x","x","x","x","x",{"$nulls":4},"x","x",{"$nulls":8},"x",null,"Seapoint"]
["PANKOP",{"$f":"VLOOKUP(A66,'[1]RSG Sites'!$A$2:$F$133,6,FALSE)","v":{"$error":"#N/A"}},{"$f":"VLOOKUP(A66,[2]RAW!$C$2:$O$8276,13,FALSE)","v":"MP"},{"$f":"VLOOKUP(A66,[2]RAW!$C$2:$J$8276,3,FALSE)","v":-25},{"$f":"VLOOKUP(A66,[2]RAW!$C$2:$J$8276,4,FALSE)","v":-9},{"$f":"VLOOKUP(A66,[2]RAW!$C$2:$J$8276,5,FALSE)","v":-44},{"$f":"VLOOKUP(A66,[2]RAW!$C$2:$J$8276,6,FALSE)","v":28},{"$f":"VLOOKUP(A66,[2]RAW!$C$2:$J$8276,7,FALSE)","v":24},{"$f":"VLOOKUP(A66,[2]RAW!$C$2:$J$8276,8,FALSE)","v":16},{"$f":"VLOOKUP(A66,[3]RAW!$C$17:$BK$8270,60,FALSE)","v":-25.16222222222222},{"$f":"VLOOKUP(A66,[3]RAW!$C$17:$BK$8270,61,FALSE)","v":28.404444444444444},{"$nulls":19},"x",{"$nulls":3},"x",null,"Hatfield"]
["PARSONS HILL",{"$f":"VLOOKUP(A67,'[1]RSG Sites'!$A$2:$F$133,6,FALSE)","v":"Bronze"},{"$f":"VLOOKUP(A67,[2]RAW!$C$2:$O$8276,13,FALSE)","v":"EC"},{"$f":"VLOOKUP(A67,[2]RAW!$C$2:$J$8276,3,FALSE)","v":-33},{"$f":"VLOOKUP(A67,[2]RAW!$C$2:$J$8276,4,FALSE)","v":-57},{"$f":"VLOOKUP(A67,[2]RAW!$C$2:$J$8276,5,FALSE)","v":-11},{"$f":"VLOOKUP(A67,[2]RAW!$C$2:$J$8276,6,FALSE)","v":25},{"$f":"VLOOKUP(A67,[2]RAW!$C$2:$J$8276,7,FALSE)","v":35},{"$f":"VLOOKUP(A67,[2]RAW!$C$2:$J$8276,8,FALSE)","v":19},{"$f":"VLOOKUP(A67,[3]RAW!$C$17:$BK$8270,60,FALSE)","v":-33.95305555555556},{"$f":"VLOOKUP(A67,[3]RAW!$C$17:$BK$8270,61,FALSE)","v":25.58861111111111},"x",{"$nulls":3},"x",null,null,"x","x",{"$nulls":3},"x",{"$nulls":10},"x",null,"Port Elizabeth"]
["PATENSIE",{"$f":"VLOOKUP(A68,'[1]RSG Sites'!$A$2:$F$133,6,FALSE)","v":"Bronze"},{"$f":"VLOOKUP(A68,[2]RAW!$C$2:$O$8276,13,FALSE)","v":"EC"},{"$f":"VLOOKUP(A68,[2]RAW!$C$2:$J$8276,3,FALSE)","v":-33},{"$f":"VLOOKUP(A68,[2]RAW!$C$2:$J$8276,4,FALSE)","v":-45},{"$f":"VLOOKUP(A68,[2]RAW!$C$2:$J$8276,5,FALSE)","v":-39},{"$f":"VLOOKUP(A68,[2]RAW!$C$2:$J$8276,6,FALSE)","v":24},{"$f":"VLOOKUP(A68,[2]RAW!$C$2:$J$8276,7,FALSE)","v":49},{"$f":"VLOOKUP(A68,[2]RAW!$C$2:$J$8276,8,FALSE)","v":37},{"$f":"VLOOKUP(A68,[3]RAW!$C$17:$BK$8270,60,FALSE)","v":-33.75972222222222},{"$f":"VLOOKUP(A68,[3]RAW!$C$17:$BK$8270,61,FALSE)","v":24.828333333333333},"x","x","x","x",null,"x",null,"x","x",{"$nulls":14},"x",null,"Port Elizabeth"]
["PAUL SAUER DAM",{"$f":"VLOOKUP(A69,'[1]RSG Sites'!$A$2:$F$133,6,FALSE)","v":"Bronze"},{"$f":"VLOOKUP(A69,[2]RAW!$C$2:$O$8276,13,FALSE)","v":"EC"},{"$f":"VLOOKUP(A69,[2]RAW!$C$2:$J$8276,3,FALSE)","v":-33},{"$f":"VLOOKUP(A69,[2]RAW!$C$2:$J$8276,4,FALSE)","v":-45},{"$f":"VLOOKUP(A69,[2]RAW!$C$2:$J$8276,5,FALSE)","v":-13},{"$f":"VLOOKUP(A69,[2]RAW!$C$2:$J$8276,6,FALSE)","v":24},{"$f":"VLOOKUP(A69,[2]RAW!$C$2:$J$8276,7,FALSE)","v":33},{"$f":"VLOOKUP(A69,[2]RAW!$C$2:$J$8276,8,FALSE)","v":43},{"$f":"VLOOKUP(A69,[3]RAW!$C$17:$BK$8270,60,FALSE)","v":-33.75361111111111},{"$f":"VLOOKUP(A69,[3]RAW!$C$17:$BK$8270,61,FALSE)","v":24.561944444444446},"x","x","x","x",null,"x",null,"x","x",{"$nulls":14},"x",null,"Port Elizabeth"]
["PIET PLESSIS",{"$f":"VLOOKUP(A70,'[1]RSG Sites'!$A$2:$F$133,6,FALSE)","v":"Silver"},{"$f":"VLOOKUP(A70,[2]RAW!$C$2:$O$8276,13,FALSE)","v":"NW"},{"$f":"VLOOKUP(A70,[2]RAW!$C$2:$J$8276,3,FALSE)","v":-26},{"$f":"VLOOKUP(A70,[2]RAW!$C$2:$J$8276,4,FALSE)","v":-14},{"$f":"VLOOKUP(A70,[2]RAW!$C$2:$J$8276,5,FALSE)","v":-56},{"$f":"VLOOKUP(A70,[2]RAW!$C$2:$J$8276,6,FALSE)","v":24},{"$f":"VLOOKUP(A70,[2]RAW!$C$2:$J$8276,7,FALSE)","v":49},{"$f":"VLOOKUP(A70,[2]RAW!$C$2:$J$8276,8,FALSE)","v":55},{"$f":"VLOOKUP(A70,[3]RAW!$C$17:$BK$8270,60,FALSE)","v":-26.24888888888889},{"$f":"VLOOKUP(A70,[3]RAW!$C$17:$BK$8270,61,FALSE)","v":24.831944444444446},"x","x","x",null,null,"x","x","x",{"$nulls":11},"x",{"$nulls":3},"x",null,"Mahikeng"]
["PIETERMARITZBURG",{"$f":"VLOOKUP(A71,'[1]RSG Sites'!$A$2:$F$133,6,FALSE)","v":"Silver"},{"$f":"VLOOKUP(A71,[2]RAW!$C$2:$O$8276,13,FALSE)","v":"KN"},{"$f":"VLOOKUP(A71,[2]RAW!$C$2:$J$8276,3,FALSE)","v":-29},{"$f":"VLOOKUP(A71,[2]RAW!$C$2:$J$8276,4,FALSE)","v":-34},{"$f":"VLOOKUP(A71,[2]RAW!$C$2:$J$8276,5,FALSE)","v":0},{"$f":"VLOOKUP(A71,[2]RAW!$C$2:$J$8276,6,FALSE)","v":30},{"$f":"VLOOKUP(A71,[2]RAW!$C$2:$J$8276,7,FALSE)","v":19},{"$f":"VLOOKUP(A71,[2]RAW!$C$2:$J$8276,8,FALSE)","v":0},{"$f":"VLOOKUP(A71,[3]RAW!$C$17:$BK$8270,60,FALSE)","v":-29.579722222222223},{"$f":"VLOOKUP(A71,[3]RAW!$C$17:$BK$8270,61,FALSE)","v":30.330277777777777},"x","x","x","x","x","x","x","x",{"$nulls":3},"x",null,"x",{"$nulls":3},"x",{"$nulls":5},"x",null,"Durban"]
["PLETTENBERG BAY",{"$f":"VLOOKUP(A72,'[1]RSG Sites'!$A$2:$F$133,6,FALSE)","v":"Silver"},{"$f":"VLOOKUP(A72,[2]RAW!$C$2:$O$8276,13,FALSE)","v":"WC"},{"$f":"VLOOKUP(A72,[2]RAW!$C$2:$J$8276,3,FALSE)","v":-34},{"$f":"VLOOKUP(A72,[2]RAW!$C$2:$J$8276,4,FALSE)","v":-3},{"$f":"VLOOKUP(A72,[2]RAW!$C$2:$J$8276,5,FALSE)","v":-34},{"$f":"VLOOKUP(A72,[2]RAW!$C$2:$J$8276,6,FALSE)","v":23},{"$f":"VLOOKUP(A72,[2]RAW!$C$2:$J$8276,7,FALSE)","v":22},{"$f":"VLOOKUP(A72,[2]RAW!$C$2:$J$8276,8,FALSE)","v":25},{"$f":"VLOOKUP(A72,[3]RAW!$C$17:$BK$8270,60,FALSE)","v":-34.059444444444445},{"$f":"VLOOKUP(A72,[3]RAW!$C$17:$BK$8270,61,FALSE)","v":23.37361111111111},"x","x","x","x",null,"x","x","x","x",{"$nulls":5},"x",{"$nulls":8},"x",null,"George"]
["PORT ELIZABETH",{"$f":"VLOOKUP(A73,'[1]RSG Sites'!$A$2:$F$133,6,FALSE)","v":"Gold"},{"$f":"VLOOKUP(A73,[2]RAW!$C$2:$O$8276,13,FALSE)","v":"EC"},{"$f":"VLOOKUP(A73,[2]RAW!$C$2:$J$8276,3,FALSE)","v":-33},{"$f":"VLOOKUP(A73,[2]RAW!$C$2:$J$8276,4,FALSE)","v":-56},{"$f":"VLOOKUP(A73,[2]RAW!$C$2:$J$8276,5,FALSE)","v":-10},{"$f":"VLOOKUP(A73,[2]RAW!$C$2:$J$8276,6,FALSE)","v":25},{"$f":"VLOOKUP(A73,[2]RAW!$C$2:$J$8276,7,FALSE)","v":26},{"$f":"VLOOKUP(A73,[2]RAW!$C$2:$J$8276,8,FALSE)","v":27},{"$f":"VLOOKUP(A73,[3]RAW!$C$17:$BK$8270,60,FALSE)","v":-33.93611111111111},{"$f":"VLOOKUP(A73,[3]RAW!$C$17:$BK$8270,61,FALSE)","v":25.440833333333334},"x","x","x","x","x","x","x","x","x",{"$nulls":3},"x","x",{"$nulls":3},"x",{"$nulls":5},"x",null,"Port Elizabeth"]
["PORT ELIZABETH CITY",{"$f":"VLOOKUP(A74,'[1]RSG Sites'!$A$2:$F$133,6,FALSE)","v":{"$error":"#N/A"}},{"$f":"VLOOKUP(A74,[2]RAW!$C$2:$O$8276,13,FALSE)","v":"EC"},{"$f":"VLOOKUP(A74,[2]RAW!$C$2:$J$8276,3,FALSE)","v":-33},{"$f":"VLOOKUP(A74,[2]RAW!$C$2:$J$8276,4,FALSE)","v":-55},{"$f":"VLOOKUP(A74,[2]RAW!$C$2:$J$8276,5,FALSE)","v":-28},{"$f":"VLOOKUP(A74,[2]RAW!$C$2:$J$8276,6,FALSE)","v":25},{"$f":"VLOOKUP(A74,[2]RAW!$C$2:$J$8276,7,FALSE)","v":35},{"$f":"VLOOKUP(A74,[2]RAW!$C$2:$J$8276,8,FALSE)","v":29},{"$f":"VLOOKUP(A74,[3]RAW!$C$17:$BK$8270,60,FALSE)","v":-33.92444444444444},{"$f":"VLOOKUP(A74,[3]RAW!$C$17:$BK$8270,61,FALSE)","v":25.591388888888886},null,"x","x","x",null,"x","x",{"$nulls":16},"x",null,"Port Elizabeth"]
["PORT ST JOHNS",{"$f":"VLOOKUP(A75,'[1]RSG Sites'!$A$2:$F$133,6,FALSE)","v":"Silver"},{"$f":"VLOOKUP(A75,[2]RAW!$C$2:$O$8276,13,FALSE)","v":"EC"},{"$f":"VLOOKUP(A75,[2]RAW!$C$2:$J$8276,3,FALSE)","v":-31},{"$f":"VLOOKUP(A75,[2]RAW!$C$2:$J$8276,4,FALSE)","v":-36},{"$f":"VLOOKUP(A75,[2]RAW!$C$2:$J$8276,5,FALSE)","v":-39},{"$f":"VLOOKUP(A75,[2]RAW!$C$2:$J$8276,6,FALSE)","v":29},{"$f":"VLOOKUP(A75,[2]RAW!$C$2:$J$8276,7,FALSE)","v":31},{"$f":"VLOOKUP(A75,[2]RAW!$C$2:$J$8276,8,FALSE)","v":39},{"$f":"VLOOKUP(A75,[3]RAW!$C$17:$BK$8270,60,FALSE)","v":-31.610833333333336},{"$f":"VLOOKUP(A75,[3]RAW!$C$17:$BK$8270,61,FALSE)","v":29.5275},"x","x","x","x","x","x","x","x","x",{"$nulls":15},"x","Mthatha"]
["POTGIETERSRUS",{"$f":"VLOOKUP(A76,'[1]RSG Sites'!$A$2:$F$133,6,FALSE)","v":"Platinum"},{"$f":"VLOOKUP(A76,[2]RAW!$C$2:$O$8276,13,FALSE)","v":"LP"},{"$f":"VLOOKUP(A76,[2]RAW!$C$2:$J$8276,3,FALSE)","v":-24},{"$f":"VLOOKUP(A76,[2]RAW!$C$2:$J$8276,4,FALSE)","v":-9},{"$f":"VLOOKUP(A76,[2]RAW!$C$2:$J$8276,5,FALSE)","v":-24},{"$f":"VLOOKUP(A76,[2]RAW!$C$2:$J$8276,6,FALSE)","v":29},{"$f":"VLOOKUP(A76,[2]RAW!$C$2:$J$8276,7,FALSE)","v":14},{"$f":"VLOOKUP(A76,[2]RAW!$C$2:$J$8276,8,FALSE)","v":10},{"$f":"VLOOKUP(A76,[3]RAW!$C$17:$BK$8270,60,FALSE)","v":-24.156666666666666},{"$f":"VLOOKUP(A76,[3]RAW!$C$17:$BK$8270,61,FALSE)","v":29.23611111111111},"x","x","x","x","x","x","x",{"$nulls":5},"x","x",null,"x",null,null,"x",null,"x","x",null,"x",null,"Polokwane"]
["PRETORIA",{"$f":"VLOOKUP(A77,'[1]RSG Sites'!$A$2:$F$133,6,FALSE)","v":"Platinum"},{"$f":"VLOOKUP(A77,[2]RAW!$C$2:$O$8276,13,FALSE)","v":"GP"},{"$f":"VLOOKUP(A77,[2]RAW!$C$2:$J$8276,3,FALSE)","v":-25},{"$f":"VLOOKUP(A77,[2]RAW!$C$2:$J$8276,4,FALSE)","v":-41},{"$f":"VLOOKUP(A77,[2]RAW!$C$2:$J$8276,5,FALSE)","v":-21},{"$f":"VLOOKUP(A77,[2]RAW!$C$2:$J$8276,6,FALSE)","v":27},{"$f":"VLOOKUP(A77,[2]RAW!$C$2:$J$8276,7,FALSE)","v":59},{"$f":"VLOOKUP(A77,[2]RAW!$C$2:$J$8276,8,FALSE)","v":2},{"$f":"VLOOKUP(A77,[3]RAW!$C$17:$BK$8270,60,FALSE)","v":-25.689166666666665},{"$f":"VLOOKUP(A77,[3]RAW!$C$17:$BK$8270,61,FALSE)","v":27.983888888888888},"x","x","x","x","x","x","x","x",{"$nulls":3},"x","x",null,null,"x","x",null,"x","x","x","x",null,"x",null,"Aucklandpark"]
["PRETORIA NORTH",{"$f":"VLOOKUP(A78,'[1]RSG Sites'!$A$2:$F$133,6,FALSE)","v":{"$error":"#N/A"}},{"$f":"VLOOKUP(A78,[2]RAW!$C$2:$O$8276,13,FALSE)","v":"GP"},{"$f":"VLOOKUP(A78,[2]RAW!$C$2:$J$8276,3,FALSE)","v":-25},{"$f":"VLOOKUP(A78,[2]RAW!$C$2:$J$8276,4,FALSE)","v":-41},{"$f":"VLOOKUP(A78,[2]RAW!$C$2:$J$8276,5,FALSE)","v":-29},{"$f":"VLOOKUP(A78,[2]RAW!$C$2:$J$8276,6,FALSE)","v":28},{"$f":"VLOOKUP(A78,[2]RAW!$C$2:$J$8276,7,FALSE)","v":10},{"$f":"VLOOKUP(A78,[2]RAW!$C$2:$J$8276,8,FALSE)","v":2},{"$f":"VLOOKUP(A78,[3]RAW!$C$17:$BK$8270,60,FALSE)","v":-25.691388888888888},{"$f":"VLOOKUP(A78,[3]RAW!$C$17:$BK$8270,61,FALSE)","v":28.16722222222222},null,"x","x","x",null,"x","x",{"$nulls":16},"x",null,"Aucklandpark"]
["PUNDA MARIA",{"$f":"VLOOKUP(A79,'[1]RSG Sites'!$A$2:$F$133,6,FALSE)","v":{"$error":"#N/A"}},{"$f":"VLOOKUP(A79,[2]RAW!$C$2:$O$8276,13,FALSE)","v":"LP"},{"$f":"VLOOKUP(A79,[2]RAW!$C$2:$J$8276,3,FALSE)","v":-22},{"$f":"VLOOKUP(A79,[2]RAW!$C$2:$J$8276,4,FALSE)","v":-43},{"$f":"VLOOKUP(A79,[2]RAW!$C$2:$J$8276,5,FALSE)","v":-28},{"$f":"VLOOKUP(A79,[2]RAW!$C$2:$J$8276,6,FALSE)","v":30},{"$f":"VLOOKUP(A79,[2]RAW!$C$2:$J$8276,7,FALSE)","v":59},{"$f":"VLOOKUP(A79,[2]RAW!$C$2:$J$8276,8,FALSE)","v":19},{"$f":"VLOOKUP(A79,[3]RAW!$C$17:$BK$8270,60,FALSE)","v":-22.724444444444444},{"$f":"VLOOKUP(A79,[3]RAW!$C$17:$BK$8270,61,FALSE)","v":30.988611111111112},{"$nulls":18},"x",null,"x",null,null,"x",null,"Thohoyandou"]
["RIVERSDALE",{"$f":"VLOOKUP(A80,'[1]RSG Sites'!$A$2:$F$133,6,FALSE)","v":"Silver"},{"$f":"VLOOKUP(A80,[2]RAW!$C$2:$O$8276,13,FALSE)","v":"WC"},{"$f":"VLOOKUP(A80,[2]RAW!$C$2:$J$8276,3,FALSE)","v":-34},{"$f":"VLOOKUP(A80,[2]RAW!$C$2:$J$8276,4,FALSE)","v":-5},{"$f":"VLOOKUP(A80,[2]RAW!$C$2:$J$8276,5,FALSE)","v":-58},{"$f":"VLOOKUP(A80,[2]RAW!$C$2:$J$8276,6,FALSE)","v":21},{"$f":"VLOOKUP(A80,[2]RAW!$C$2:$J$8276,7,FALSE)","v":15},{"$f":"VLOOKUP(A80,[2]RAW!$C$2:$J$8276,8,FALSE)","v":31},{"$f":"VLOOKUP(A80,[3]RAW!$C$17:$BK$8270,60,FALSE)","v":-34.01888888888889},{"$f":"VLOOKUP(A80,[3]RAW!$C$17:$BK$8270,61,FALSE)","v":21.1275},"x","x","x",{"$nulls":4},"x",{"$nulls":6},"x",{"$nulls":8},"x",null,"George"]
["RUSTENBURG",{"$f":"VLOOKUP(A81,'[1]RSG Sites'!$A$2:$F$133,6,FALSE)","v":"Silver"},{"$f":"VLOOKUP(A81,[2]RAW!$C$2:$O$8276,13,FALSE)","v":"NW"},{"$f":"VLOOKUP(A81,[2]RAW!$C$2:$J$8276,3,FALSE)","v":-25},{"$f":"VLOOKUP(A81,[2]RAW!$C$2:$J$8276,4,FALSE)","v":-36},{"$f":"VLOOKUP(A81,[2]RAW!$C$2:$J$8276,5,FALSE)","v":-59},{"$f":"VLOOKUP(A81,[2]RAW!$C$2:$J$8276,6,FALSE)","v":27},{"$f":"VLOOKUP(A81,[2]RAW!$C$2:$J$8276,7,FALSE)","v":7},{"$f":"VLOOKUP(A81,[2]RAW!$C$2:$J$8276,8,FALSE)","v":5},{"$f":"VLOOKUP(A81,[3]RAW!$C$17:$BK$8270,60,FALSE)","v":-25.616388888888892},{"$f":"VLOOKUP(A81,[3]RAW!$C$17:$BK$8270,61,FALSE)","v":27.118055555555557},"x","x","x","x","x","x","x","x",{"$nulls":4},"x",{"$nulls":6},"x",{"$nulls":3},"x",null,"Hatfield"]
["SABIE",{"$f":"VLOOKUP(A82,'[1]RSG Sites'!$A$2:$F$133,6,FALSE)","v":"Bronze"},{"$f":"VLOOKUP(A82,[2]RAW!$C$2:$O$8276,13,FALSE)","v":"MP"},{"$f":"VLOOKUP(A82,[2]RAW!$C$2:$J$8276,3,FALSE)","v":-25},{"$f":"VLOOKUP(A82,[2]RAW!$C$2:$J$8276,4,FALSE)","v":-7},{"$f":"VLOOKUP(A82,[2]RAW!$C$2:$J$8276,5,FALSE)","v":-46},{"$f":"VLOOKUP(A82,[2]RAW!$C$2:$J$8276,6,FALSE)","v":30},{"$f":"VLOOKUP(A82,[2]RAW!$C$2:$J$8276,7,FALSE)","v":45},{"$f":"VLOOKUP(A82,[2]RAW!$C$2:$J$8276,8,FALSE)","v":35},{"$f":"VLOOKUP(A82,[3]RAW!$C$17:$BK$8270,60,FALSE)","v":-25.129444444444445},{"$f":"VLOOKUP(A82,[3]RAW!$C$17:$BK$8270,61,FALSE)","v":30.759722222222223},"x","x","x",{"$nulls":3},"x","x",{"$nulls":8},"x",{"$nulls":6},"x",null,"Nelspruit"]
["SEA POINT",{"$f":"VLOOKUP(A83,'[1]RSG Sites'!$A$2:$F$133,6,FALSE)","v":"Bronze"},{"$f":"VLOOKUP(A83,[2]RAW!$C$2:$O$8276,13,FALSE)","v":"WC"},{"$f":"VLOOKUP(A83,[2]RAW!$C$2:$J$8276,3,FALSE)","v":-33},{"$f":"VLOOKUP(A83,[2]RAW!$C$2:$J$8276,4,FALSE)","v":-54},{"$f":"VLOOKUP(A83,[2]RAW!$C$2:$J$8276,5,FALSE)","v":-33},{"$f":"VLOOKUP(A83,[2]RAW!$C$2:$J$8276,6,FALSE)","v":18},{"$f":"VLOOKUP(A83,[2]RAW!$C$2:$J$8276,7,FALSE)","v":23},{"$f":"VLOOKUP(A83,[2]RAW!$C$2:$J$8276,8,FALSE)","v":51},{"$f":"VLOOKUP(A83,[3]RAW!$C$17:$BK$8270,60,FALSE)","v":-33.909166666666664},{"$f":"VLOOKUP(A83,[3]RAW!$C$17:$BK$8270,61,FALSE)","v":18.3975},"x","x","x","x","x","x","x","x","x",{"$nulls":3},"x","x","x",{"$nulls":8},"x",null,"Seapoint"]
["SIBASA",{"$f":"VLOOKUP(A84,'[1]RSG Sites'!$A$2:$F$133,6,FALSE)","v":{"$error":"#N/A"}},{"$f":"VLOOKUP(A84,[2]RAW!$C$2:$O$8276,13,FALSE)","v":"LP"},{"$f":"VLOOKUP(A84,[2]RAW!$C$2:$J$8276,3,FALSE)","v":-22},{"$f":"VLOOKUP(A84,[2]RAW!$C$2:$J$8276,4,FALSE)","v":-56},{"$f":"VLOOKUP(A84,[2]RAW!$C$2:$J$8276,5,FALSE)","v":-57},{"$f":"VLOOKUP(A84,[2]RAW!$C$2:$J$8276,6,FALSE)","v":30},{"$f":"VLOOKUP(A84,[2]RAW!$C$2:$J$8276,7,FALSE)","v":26},{"$f":"VLOOKUP(A84,[2]RAW!$C$2:$J$8276,8,FALSE)","v":54},{"$f":"VLOOKUP(A84,[3]RAW!$C$17:$BK$8270,60,FALSE)","v":-22.949166666666667},{"$f":"VLOOKUP(A84,[3]RAW!$C$17:$BK$8270,61,FALSE)","v":30.448333333333334},null,"x","x","x",null,"x","x",{"$nulls":11},"x",{"$nulls":4},"x",null,"Thohoyandou"]
["SIMONSTOWN",{"$f":"VLOOKUP(A85,'[1]RSG Sites'!$A$2:$F$133,6,FALSE)","v":"Silver"},{"$f":"VLOOKUP(A85,[2]RAW!$C$2:$O$8276,13,FALSE)","v":"WC"},{"$f":"VLOOKUP(A85,[2]RAW!$C$2:$J$8276,3,FALSE)","v":-34},{"$f":"VLOOKUP(A85,[2]RAW!$C$2:$J$8276,4,FALSE)","v":-11},{"$f":"VLOOKUP(A85,[2]RAW!$C$2:$J$8276,5,FALSE)","v":-55},{"$f":"VLOOKUP(A85,[2]RAW!$C$2:$J$8276,6,FALSE)","v":18},{"$f":"VLOOKUP(A85,[2]RAW!$C$2:$J$8276,7,FALSE)","v":25},{"$f":"VLOOKUP(A85,[2]RAW!$C$2:$J$8276,8,FALSE)","v":36},{"$f":"VLOOKUP(A85,[3]RAW!$C$17:$BK$8270,60,FALSE)","v":-34.198611111111106},{"$f":"VLOOKUP(A85,[3]RAW!$C$17:$BK$8270,61,FALSE)","v":18.42666666666667},"x","x","x","x","x","x","x","x",{"$nulls":5},"x","x",{"$nulls":8},"x",null,"Seapoint"]
["SPRINGFONTEIN",{"$f":"VLOOKUP(A86,'[1]RSG Sites'!$A$2:$F$133,6,FALSE)","v":"Silver"},{"$f":"VLOOKUP(A86,[2]RAW!$C$2:$O$8276,13,FALSE)","v":"FS"},{"$f":"VLOOKUP(A86,[2]RAW!$C$2:$J$8276,3,FALSE)","v":-30},{"$f":"VLOOKUP(A86,[2]RAW!$C$2:$J$8276,4,FALSE)","v":-16},{"$f":"VLOOKUP(A86,[2]RAW!$C$2:$J$8276,5,FALSE)","v":-14},{"$f":"VLOOKUP(A86,[2]RAW!$C$2:$J$8276,6,FALSE)","v":25},{"$f":"VLOOKUP(A86,[2]RAW!$C$2:$J$8276,7,FALSE)","v":46},{"$f":"VLOOKUP(A86,[2]RAW!$C$2:$J$8276,8,FALSE)","v":8},{"$f":"VLOOKUP(A86,[3]RAW!$C$17:$BK$8270,60,FALSE)","v":-30.270555555555553},{"$f":"VLOOKUP(A86,[3]RAW!$C$17:$BK$8270,61,FALSE)","v":25.76888888888889},"x",null,"x",null,"x","x",null,"x","x","x",{"$nulls":13},"x",null,"Bloemfontein"]
["STELLENBOSCH",{"$f":"VLOOKUP(A87,'[1]RSG Sites'!$A$2:$F$133,6,FALSE)","v":"Bronze"},{"$f":"VLOOKUP(A87,[2]RAW!$C$2:$O$8276,13,FALSE)","v":"WC"},{"$f":"VLOOKUP(A87,[2]RAW!$C$2:$J$8276,3,FALSE)","v":-33},{"$f":"VLOOKUP(A87,[2]RAW!$C$2:$J$8276,4,FALSE)","v":-54},{"$f":"VLOOKUP(A87,[2]RAW!$C$2:$J$8276,5,FALSE)","v":-59},{"$f":"VLOOKUP(A87,[2]RAW!$C$2:$J$8276,6,FALSE)","v":18},{"$f":"VLOOKUP(A87,[2]RAW!$C$2:$J$8276,7,FALSE)","v":52},{"$f":"VLOOKUP(A87,[2]RAW!$C$2:$J$8276,8,FALSE)","v":10},{"$f":"VLOOKUP(A87,[3]RAW!$C$17:$BK$8270,60,FALSE)","v":-33.91638888888889},{"$f":"VLOOKUP(A87,[3]RAW!$C$17:$BK$8270,61,FALSE)","v":18.869444444444444},"x","x","x","x","x","x","x","x","x",{"$nulls":4},"x","x",{"$nulls":8},"x",null,"Seapoint"]
["SUNNYSIDE",{"$f":"VLOOKUP(A88,'[1]RSG Sites'!$A$2:$F$133,6,FALSE)","v":{"$error":"#N/A"}},{"$f":"VLOOKUP(A88,[2]RAW!$C$2:$O$8276,13,FALSE)","v":"GP"},{"$f":"VLOOKUP(A88,[2]RAW!$C$2:$J$8276,3,FALSE)","v":-25},{"$f":"VLOOKUP(A88,[2]RAW!$C$2:$J$8276,4,FALSE)","v":-45},{"$f":"VLOOKUP(A88,[2]RAW!$C$2:$J$8276,5,FALSE)","v":-58},{"$f":"VLOOKUP(A88,[2]RAW!$C$2:$J$8276,6,FALSE)","v":28},{"$f":"VLOOKUP(A88,[2]RAW!$C$2:$J$8276,7,FALSE)","v":12},{"$f":"VLOOKUP(A88,[2]RAW!$C$2:$J$8276,8,FALSE)","v":21},{"$f":"VLOOKUP(A88,[3]RAW!$C$17:$BK$8270,60,FALSE)","v":-25.766111111111112},{"$f":"VLOOKUP(A88,[3]RAW!$C$17:$BK$8270,61,FALSE)","v":28.20583333333333},null,"x","x","x",null,"x","x",{"$nulls":6},"x",{"$nulls":3},"x",{"$nulls":5},"x",null,"Aucklandpark"]
["SUURBERG",{"$f":"VLOOKUP(A89,'[1]RSG Sites'!$A$2:$F$133,6,FALSE)","v":"Silver"},{"$f":"VLOOKUP(A89,[2]RAW!$C$2:$O$8276,13,FALSE)","v":"EC"},{"$f":"VLOOKUP(A89,[2]RAW!$C$2:$J$8276,3,FALSE)","v":-33},{"$f":"VLOOKUP(A89,[2]RAW!$C$2:$J$8276,4,FALSE)","v":-14},{"$f":"VLOOKUP(A89,[2]RAW!$C$2:$J$8276,5,FALSE)","v":-55},{"$f":"VLOOKUP(A89,[2]RAW!$C$2:$J$8276,6,FALSE)","v":25},{"$f":"VLOOKUP(A89,[2]RAW!$C$2:$J$8276,7,FALSE)","v":34},{"$f":"VLOOKUP(A89,[2]RAW!$C$2:$J$8276,8,FALSE)","v":27},{"$f":"VLOOKUP(A89,[3]RAW!$C$17:$BK$8270,60,FALSE)","v":-33.24861111111111},{"$f":"VLOOKUP(A89,[3]RAW!$C$17:$BK$8270,61,FALSE)","v":25.574166666666667},"x","x","x","x",null,"x","x","x","x",{"$nulls":14},"x",null,"Port Elizabeth"]
["SWARTRUGGENS",{"$f":"VLOOKUP(A90,'[1]RSG Sites'!$A$2:$F$133,6,FALSE)","v":{"$error":"#N/A"}},{"$f":"VLOOKUP(A90,[2]RAW!$C$2:$O$8276,13,FALSE)","v":"NW"},{"$f":"VLOOKUP(A90,[2]RAW!$C$2:$J$8276,3,FALSE)","v":-25},{"$f":"VLOOKUP(A90,[2]RAW!$C$2:$J$8276,4,FALSE)","v":-40},{"$f":"VLOOKUP(A90,[2]RAW!$C$2:$J$8276,5,FALSE)","v":-59},{"$f":"VLOOKUP(A90,[2]RAW!$C$2:$J$8276,6,FALSE)","v":26},{"$f":"VLOOKUP(A90,[2]RAW!$C$2:$J$8276,7,FALSE)","v":48},{"$f":"VLOOKUP(A90,[2]RAW!$C$2:$J$8276,8,FALSE)","v":9},{"$f":"VLOOKUP(A90,[3]RAW!$C$17:$BK$8270,60,FALSE)","v":-25.68305555555556},{"$f":"VLOOKUP(A90,[3]RAW!$C$17:$BK$8270,61,FALSE)","v":26.802500000000002},null,null,"x",null,null,"x",{"$nulls":17},"x",null,"Mahikeng"]
["TABLE MOUNTAIN",{"$f":"VLOOKUP(A91,'[1]RSG Sites'!$A$2:$F$133,6,FALSE)","v":"Silver"},{"$f":"VLOOKUP(A91,[2]RAW!$C$2:$O$8276,13,FALSE)","v":"WC"},{"$f":"VLOOKUP(A91,[2]RAW!$C$2:$J$8276,3,FALSE)","v":-33},{"$f":"VLOOKUP(A91,[2]RAW!$C$2:$J$8276,4,FALSE)","v":-57},{"$f":"VLOOKUP(A91,[2]RAW!$C$2:$J$8276,5,FALSE)","v":-26},{"$f":"VLOOKUP(A91,[2]RAW!$C$2:$J$8276,6,FALSE)","v":18},{"$f":"VLOOKUP(A91,[2]RAW!$C$2:$J$8276,7,FALSE)","v":24},{"$f":"VLOOKUP(A91,[2]RAW!$C$2:$J$8276,8,FALSE)","v":11},{"$f":"VLOOKUP(A91,[3]RAW!$C$17:$BK$8270,60,FALSE)","v":-33.95722222222223},{"$f":"VLOOKUP(A91,[3]RAW!$C$17:$BK$8270,61,FALSE)","v":18.403055555555554},"x","x","x","x","x","x","x","x","x",{"$nulls":3},"x","x","x",{"$nulls":8},"x",null,"Seapoint"]
["THABA NCHU",{"$f":"VLOOKUP(A92,'[1]RSG Sites'!$A$2:$F$133,6,FALSE)","v":{"$error":"#N/A"}},{"$f":"VLOOKUP(A92,[2]RAW!$C$2:$O$8276,13,FALSE)","v":"FS"},{"$f":"VLOOKUP(A92,[2]RAW!$C$2:$J$8276,3,FALSE)","v":-29},{"$f":"VLOOKUP(A92,[2]RAW!$C$2:$J$8276,4,FALSE)","v":-15},{"$f":"VLOOKUP(A92,[2]RAW!$C$2:$J$8276,5,FALSE)","v":-24},{"$f":"VLOOKUP(A92,[2]RAW!$C$2:$J$8276,6,FALSE)","v":26},{"$f":"VLOOKUP(A92,[2]RAW!$C$2:$J$8276,7,FALSE)","v":45},{"$f":"VLOOKUP(A92,[2]RAW!$C$2:$J$8276,8,FALSE)","v":45},{"$f":"VLOOKUP(A92,[3]RAW!$C$17:$BK$8270,60,FALSE)","v":-29.256666666666668},{"$f":"VLOOKUP(A92,[3]RAW!$C$17:$BK$8270,61,FALSE)","v":26.7625},{"$nulls":9},"x",{"$nulls":9},"x",{"$nulls":3},"x",null,"Bloemfontein"]
["THE BLUFF",{"$f":"VLOOKUP(A93,'[1]RSG Sites'!$A$2:$F$133,6,FALSE)","v":"Silver"},{"$f":"VLOOKUP(A93,[2]RAW!$C$2:$O$8276,13,FALSE)","v":"KN"},{"$f":"VLOOKUP(A93,[2]RAW!$C$2:$J$8276,3,FALSE)","v":-29},{"$f":"VLOOKUP(A93,[2]RAW!$C$2:$J$8276,4,FALSE)","v":-54},{"$f":"VLOOKUP(A93,[2]RAW!$C$2:$J$8276,5,FALSE)","v":-42},{"$f":"VLOOKUP(A93,[2]RAW!$C$2:$J$8276,6,FALSE)","v":31},{"$f":"VLOOKUP(A93,[2]RAW!$C$2:$J$8276,7,FALSE)","v":0},{"$f":"VLOOKUP(A93,[2]RAW!$C$2:$J$8276,8,FALSE)","v":44},{"$f":"VLOOKUP(A93,[3]RAW!$C$17:$BK$8270,60,FALSE)","v":-29.911666666666665},{"$f":"VLOOKUP(A93,[3]RAW!$C$17:$BK$8270,61,FALSE)","v":31.01222222222222},"x","x","x","x","x","x","x","x",{"$nulls":3},"x",null,"x",{"$nulls":3},"x",{"$nulls":5},"x",null,"Durban"]
["THEUNISSEN",{"$f":"VLOOKUP(A94,'[1]RSG Sites'!$A$2:$F$133,6,FALSE)","v":"Silver"},{"$f":"VLOOKUP(A94,[2]RAW!$C$2:$O$8276,13,FALSE)","v":"FS"},{"$f":"VLOOKUP(A94,[2]RAW!$C$2:$J$8276,3,FALSE)","v":-28},{"$f":"VLOOKUP(A94,[2]RAW!$C$2:$J$8276,4,FALSE)","v":-11},{"$f":"VLOOKUP(A94,[2]RAW!$C$2:$J$8276,5,FALSE)","v":-55},{"$f":"VLOOKUP(A94,[2]RAW!$C$2:$J$8276,6,FALSE)","v":26},{"$f":"VLOOKUP(A94,[2]RAW!$C$2:$J$8276,7,FALSE)","v":34},{"$f":"VLOOKUP(A94,[2]RAW!$C$2:$J$8276,8,FALSE)","v":50},{"$f":"VLOOKUP(A94,[3]RAW!$C$17:$BK$8270,60,FALSE)","v":-28.198611111111113},{"$f":"VLOOKUP(A94,[3]RAW!$C$17:$BK$8270,61,FALSE)","v":26.580555555555556},"x","x","x","x","x","x","x","x","x","x",null,"x",null,"x",{"$nulls":5},"x",{"$nulls":3},"x",null,"Bloemfontein"]
["TSHAMAVUDZI",{"$f":"VLOOKUP(A95,'[1]RSG Sites'!$A$2:$F$133,6,FALSE)","v":{"$error":"#N/A"}},{"$f":"VLOOKUP(A95,[2]RAW!$C$2:$O$8276,13,FALSE)","v":"LP"},{"$f":"VLOOKUP(A95,[2]RAW!$C$2:$J$8276,3,FALSE)","v":-22},{"$f":"VLOOKUP(A95,[2]RAW!$C$2:$J$8276,4,FALSE)","v":-39},{"$f":"VLOOKUP(A95,[2]RAW!$C$2:$J$8276,5,FALSE)","v":-15},{"$f":"VLOOKUP(A95,[2]RAW!$C$2:$J$8276,6,FALSE)","v":30},{"$f":"VLOOKUP(A95,[2]RAW!$C$2:$J$8276,7,FALSE)","v":31},{"$f":"VLOOKUP(A95,[2]RAW!$C$2:$J$8276,8,FALSE)","v":42},{"$f":"VLOOKUP(A95,[3]RAW!$C$17:$BK$8270,60,FALSE)","v":-22.654166666666665},{"$f":"VLOOKUP(A95,[3]RAW!$C$17:$BK$8270,61,FALSE)","v":30.528333333333332},null,"x","x",null,null,"x",{"$nulls":12},"x",null,null,"x",null,"x",null,"Thohoyandou"]
["TYGERBERG",{"$f":"VLOOKUP(A96,'[1]RSG Sites'!$A$2:$F$133,6,FALSE)","v":"Gold"},{"$f":"VLOOKUP(A96,[2]RAW!$C$2:$O$8276,13,FALSE)","v":"WC"},{"$f":"VLOOKUP(A96,[2]RAW!$C$2:$J$8276,3,FALSE)","v":-33},{"$f":"VLOOKUP(A96,[2]RAW!$C$2:$J$8276,4,FALSE)","v":-52},{"$f":"VLOOKUP(A96,[2]RAW!$C$2:$J$8276,5,FALSE)","v":-31},{"$f":"VLOOKUP(A96,[2]RAW!$C$2:$J$8276,6,FALSE)","v":18},{"$f":"VLOOKUP(A96,[2]RAW!$C$2:$J$8276,7,FALSE)","v":35},{"$f":"VLOOKUP(A96,[2]RAW!$C$2:$J$8276,8,FALSE)","v":44},{"$f":"VLOOKUP(A96,[3]RAW!$C$17:$BK$8270,60,FALSE)","v":-33.875277777777775},{"$f":"VLOOKUP(A96,[3]RAW!$C$17:$BK$8270,61,FALSE)","v":18.595555555555553},"x","x","x","x","x","x","x","x",{"$nulls":4},"x","x","x",null,null,"x",{"$nulls":5},"x",null,"Seapoint"]
["TZANEEN",{"$f":"VLOOKUP(A97,'[1]RSG Sites'!$A$2:$F$133,6,FALSE)","v":"Silver"},{"$f":"VLOOKUP(A97,[2]RAW!$C$2:$O$8276,13,FALSE)","v":"LP"},{"$f":"VLOOKUP(A97,[2]RAW!$C$2:$J$8276,3,FALSE)","v":-23},{"$f":"VLOOKUP(A97,[2]RAW!$C$2:$J$8276,4,FALSE)","v":-47},{"$f":"VLOOKUP(A97,[2]RAW!$C$2:$J$8276,5,FALSE)","v":-6},{"$f":"VLOOKUP(A97,[2]RAW!$C$2:$J$8276,6,FALSE)","v":30},{"$f":"VLOOKUP(A97,[2]RAW!$C$2:$J$8276,7,FALSE)","v":0},{"$f":"VLOOKUP(A97,[2]RAW!$C$2:$J$8276,8,FALSE)","v":17},{"$f":"VLOOKUP(A97,[3]RAW!$C$17:$BK$8270,60,FALSE)","v":-23.785},{"$f":"VLOOKUP(A97,[3]RAW!$C$17:$BK$8270,61,FALSE)","v":30.004722222222224},"x","x","x","x","x","x","x","x",{"$nulls":10},"x",null,"x","x",null,"x",null,"Polokwane"]
["UMTATA",{"$f":"VLOOKUP(A98,'[1]RSG Sites'!$A$2:$F$133,6,FALSE)","v":{"$error":"#N/A"}},{"$f":"VLOOKUP(A98,[2]RAW!$C$2:$O$8276,13,FALSE)","v":"EC"},{"$f":"VLOOKUP(A98,[2]RAW!$C$2:$J$8276,3,FALSE)","v":-31},{"$f":"VLOOKUP(A98,[2]RAW!$C$2:$J$8276,4,FALSE)","v":-35},{"$f":"VLOOKUP(A98,[2]RAW!$C$2:$J$8276,5,FALSE)","v":-48},{"$f":"VLOOKUP(A98,[2]RAW!$C$2:$J$8276,6,FALSE)","v":28},{"$f":"VLOOKUP(A98,[2]RAW!$C$2:$J$8276,7,FALSE)","v":44},{"$f":"VLOOKUP(A98,[2]RAW!$C$2:$J$8276,8,FALSE)","v":36},{"$f":"VLOOKUP(A98,[3]RAW!$C$17:$BK$8270,60,FALSE)","v":-31.596666666666664},{"$f":"VLOOKUP(A98,[3]RAW!$C$17:$BK$8270,61,FALSE)","v":28.743333333333336},"x","x","x","x","x","x","x","x","x",null,null,"x",{"$nulls":12},"x","Mthatha"]
["UNIONDALE",{"$f":"VLOOKUP(A99,'[1]RSG Sites'!$A$2:$F$133,6,FALSE)","v":"Bronze"},{"$f":"VLOOKUP(A99,[2]RAW!$C$2:$O$8276,13,FALSE)","v":"WC"},{"$f":"VLOOKUP(A99,[2]RAW!$C$2:$J$8276,3,FALSE)","v":-33},{"$f":"VLOOKUP(A99,[2]RAW!$C$2:$J$8276,4,FALSE)","v":-43},{"$f":"VLOOKUP(A99,[2]RAW!$C$2:$J$8276,5,FALSE)","v":-24},{"$f":"VLOOKUP(A99,[2]RAW!$C$2:$J$8276,6,FALSE)","v":23},{"$f":"VLOOKUP(A99,[2]RAW!$C$2:$J$8276,7,FALSE)","v":3},{"$f":"VLOOKUP(A99,[2]RAW!$C$2:$J$8276,8,FALSE)","v":2},{"$f":"VLOOKUP(A99,[3]RAW!$C$17:$BK$8270,60,FALSE)","v":-33.723333333333336},{"$f":"VLOOKUP(A99,[3]RAW!$C$17:$BK$8270,61,FALSE)","v":23.050555555555555},"x",null,"x",null,null,"x",null,"x",{"$nulls":15},"x",null,"George"]
["UNIONDALE TOWN",{"$f":"VLOOKUP(A100,'[1]RSG Sites'!$A$2:$F$133,6,FALSE)","v":{"$error":"#N/A"}},{"$f":"VLOOKUP(A100,[2]RAW!$C$2:$O$8276,13,FALSE)","v":"WC"},{"$f":"VLOOKUP(A100,[2]RAW!$C$2:$J$8276,3,FALSE)","v":-33},{"$f":"VLOOKUP(A100,[2]RAW!$C$2:$J$8276,4,FALSE)","v":-38},{"$f":"VLOOKUP(A100,[2]RAW!$C$2:$J$8276,5,FALSE)","v":-49},{"$f":"VLOOKUP(A100,[2]RAW!$C$2:$J$8276,6,FALSE)","v":23},{"$f":"VLOOKUP(A100,[2]RAW!$C$2:$J$8276,7,FALSE)","v":7},{"$f":"VLOOKUP(A100,[2]RAW!$C$2:$J$8276,8,FALSE)","v":34},{"$f":"VLOOKUP(A100,[3]RAW!$C$17:$BK$8270,60,FALSE)","v":-33.64694444444444},{"$f":"VLOOKUP(A100,[3]RAW!$C$17:$BK$8270,61,FALSE)","v":23.12611111111111},null,null,"x",null,null,"x",{"$nulls":17},"x",null,"George"]
["VERULAM",{"$f":"VLOOKUP(A101,'[1]RSG Sites'!$A$2:$F$133,6,FALSE)","v":{"$error":"#N/A"}},{"$f":"VLOOKUP(A101,[2]RAW!$C$2:$O$8276,13,FALSE)","v":"KN"},{"$f":"VLOOKUP(A101,[2]RAW!$C$2:$J$8276,3,FALSE)","v":-29},{"$f":"VLOOKUP(A101,[2]RAW!$C$2:$J$8276,4,FALSE)","v":-38},{"$f":"VLOOKUP(A101,[2]RAW!$C$2:$J$8276,5,FALSE)","v":-25},{"$f":"VLOOKUP(A101,[2]RAW!$C$2:$J$8276,6,FALSE)","v":31},{"$f":"VLOOKUP(A101,[2]RAW!$C$2:$J$8276,7,FALSE)","v":2},{"$f":"VLOOKUP(A101,[2]RAW!$C$2:$J$8276,8,FALSE)","v":19},{"$f":"VLOOKUP(A101,[3]RAW!$C$17:$BK$8270,60,FALSE)","v":-29.640277777777776},{"$f":"VLOOKUP(A101,[3]RAW!$C$17:$BK$8270,61,FALSE)","v":31.038611111111113},null,"x","x","x",null,"x","x",{"$nulls":16},"x",null,"Durban"]
["WELGEDACHT",{"$f":"VLOOKUP(A102,'[1]RSG Sites'!$A$2:$F$133,6,FALSE)","v":{"$error":"#N/A"}},{"$f":"VLOOKUP(A102,[2]RAW!$C$2:$O$8276,13,FALSE)","v":"GP"},{"$f":"VLOOKUP(A102,[2]RAW!$C$2:$J$8276,3,FALSE)","v":-26},{"$f":"VLOOKUP(A102,[2]RAW!$C$2:$J$8276,4,FALSE)","v":-11},{"$f":"VLOOKUP(A102,[2]RAW!$C$2:$J$8276,5,FALSE)","v":-8},{"$f":"VLOOKUP(A102,[2]RAW!$C$2:$J$8276,6,FALSE)","v":28},{"$f":"VLOOKUP(A102,[2]RAW!$C$2:$J$8276,7,FALSE)","v":31},{"$f":"VLOOKUP(A102,[2]RAW!$C$2:$J$8276,8,FALSE)","v":16},{"$f":"VLOOKUP(A102,[3]RAW!$C$17:$BK$8270,60,FALSE)","v":-26.185555555555556},{"$f":"VLOOKUP(A102,[3]RAW!$C$17:$BK$8270,61,FALSE)","v":28.52111111111111},{"$nulls":16},"x",{"$nulls":6},"x",null,"Aucklandpark"]
["WELVERDIEND",{"$f":"VLOOKUP(A103,'[1]RSG Sites'!$A$2:$F$133,6,FALSE)","v":"Silver"},{"$f":"VLOOKUP(A103,[2]RAW!$C$2:$O$8276,13,FALSE)","v":"GP"},{"$f":"VLOOKUP(A103,[2]RAW!$C$2:$J$8276,3,FALSE)","v":-26},{"$f":"VLOOKUP(A103,[2]RAW!$C$2:$J$8276,4,FALSE)","v":-26},{"$f":"VLOOKUP(A103,[2]RAW!$C$2:$J$8276,5,FALSE)","v":-48},{"$f":"VLOOKUP(A103,[2]RAW!$C$2:$J$8276,6,FALSE)","v":27},{"$f":"VLOOKUP(A103,[2]RAW!$C$2:$J$8276,7,FALSE)","v":14},{"$f":"VLOOKUP(A103,[2]RAW!$C$2:$J$8276,8,FALSE)","v":53},{"$f":"VLOOKUP(A103,[3]RAW!$C$17:$BK$8270,60,FALSE)","v":-26.446666666666665},{"$f":"VLOOKUP(A103,[3]RAW!$C$17:$BK$8270,61,FALSE)","v":27.248055555555556},"x","x","x","x","x","x","x","x","x","x",null,"x",null,"x",{"$nulls":5},"x",{"$nulls":3},"x",null,"Aucklandpark"]
["ZEERUST",{"$f":"VLOOKUP(A104,'[1]RSG Sites'!$A$2:$F$133,6,FALSE)","v":"Silver"},{"$f":"VLOOKUP(A104,[2]RAW!$C$2:$O$8276,13,FALSE)","v":"NW"},{"$f":"VLOOKUP(A104,[2]RAW!$C$2:$J$8276,3,FALSE)","v":-25},{"$f":"VLOOKUP(A104,[2]RAW!$C$2:$J$8276,4,FALSE)","v":-51},{"$f":"VLOOKUP(A104,[2]RAW!$C$2:$J$8276,5,FALSE)","v":-37},{"$f":"VLOOKUP(A104,[2]RAW!$C$2:$J$8276,6,FALSE)","v":26},{"$f":"VLOOKUP(A104,[2]RAW!$C$2:$J$8276,7,FALSE)","v":2},{"$f":"VLOOKUP(A104,[2]RAW!$C$2:$J$8276,8,FALSE)","v":51},{"$f":"VLOOKUP(A104,[3]RAW!$C$17:$BK$8270,60,FALSE)","v":-25.860277777777778},{"$f":"VLOOKUP(A104,[3]RAW!$C$17:$BK$8270,61,FALSE)","v":26.047500000000003},"x","x","x","x","x","x","x","x",{"$nulls":11},"x",{"$nulls":3},"x",null,"Mahikeng"]

{"sheet":"Aucklandpark","index":1,"n_rows":14,"n_cols":37,"rows_kept":14}
[null,"SLA","Province","LAT_DEG","LAT_MIN","LAT_SEC","LONG_DEG","LONG_MIN","LONG_SEC","DECIMAL LATITUDE","DECIMAL LONGITUDE","RSGR","SBC1","SBC2","SBC3",2000,"DTT1","DTT2","SAFM","LOBO","SEDI","EKHE","HOZI","METR","RAD5","RGHP","WEZI","WALA","LTUS","PHAL","MOTS","NENE","BELA","XKFM","Regional Site","outside sites","Probe site"]
["BEZ VALLEY",{"$error":"#N/A"},"GP",-26,-11,-41,28,5,0,-26.19472222222222,28.083333333333332,null,"x","x","x",null,"x","x",{"$nulls":16},"x",null,"Aucklandpark"]
["HEIDELBERG","Silver","GP",-26,-29,-19,28,20,48,-26.488611111111112,28.346666666666664,"x","x","x","x","x","x","x","x",null,"x",null,"x",{"$nulls":11},"x",null,"Aucklandpark"]
["HELDERKRUIN",{"$error":"#N/A"},"GP",-26,-6,-5,27,51,27,-26.10138888888889,27.8575,"x","x","x",null,null,"x","x",{"$nulls":6},"x",{"$nulls":9},"x",null,"Aucklandpark"]
["JOHANNESBURG","Platinum","GP",-26,-11,-31,28,0,26,-26.191944444444445,28.00722222222222,"x","x","x","x","x","x","x","x","x","x",null,"x","x","x",null,"x",null,"x","x","x","x","x",null,"x",null,"Aucklandpark"]
["LINMEYER",{"$error":"#N/A"},"GP",-26,-16,-8,28,4,16,-26.26888888888889,28.07111111111111,null,"x","x","x",null,"x","x",{"$nulls":16},"x",null,"Aucklandpark"]
["MENLO PARK","Silver","GP",-25,-46,-16,28,16,5,-25.77111111111111,28.268055555555556,"x","x","x","x","x","x","x","x",{"$nulls":11},"x",{"$nulls":3},"x",null,"Aucklandpark"]
["MONDEOR",{"$error":"#N/A"},"GP",-26,-16,-54,27,59,37,-26.281666666666666,27.99361111111111,null,"x","x","x",null,"x","x",{"$nulls":16},"x",null,"Aucklandpark"]
["MULBARTON",{"$error":"#N/A"},"GP",-26,-17,-38,28,3,56,-26.29388888888889,28.065555555555555,null,"x","x","x",null,"x","x",{"$nulls":16},"x",null,"Aucklandpark"]
["PRETORIA","Platinum","GP",-25,-41,-21,27,59,2,-25.689166666666665,27.983888888888888,"x","x","x","x","x","x","x","x",{"$nulls":3},"x","x",null,null,"x","x",null,"x","x","x","x",null,"x",null,"Aucklandpark"]
["PRETORIA NORTH",{"$error":"#N/A"},"GP",-25,-41,-29,28,10,2,-25.691388888888888,28.16722222222222,null,"x","x","x",null,"x","x",{"$nulls":16},"x",null,"Aucklandpark"]
["SUNNYSIDE",{"$error":"#N/A"},"GP",-25,-45,-58,28,12,21,-25.766111111111112,28.20583333333333,null,"x","x","x",null,"x","x",{"$nulls":6},"x",{"$nulls":3},"x",{"$nulls":5},"x",null,"Aucklandpark"]
["WELGEDACHT",{"$error":"#N/A"},"GP",-26,-11,-8,28,31,16,-26.185555555555556,28.52111111111111,{"$nulls":16},"x",{"$nulls":6},"x",null,"Aucklandpark"]
["WELVERDIEND","Silver","GP",-26,-26,-48,27,14,53,-26.446666666666665,27.248055555555556,"x","x","x","x","x","x","x","x","x","x",null,"x",null,"x",{"$nulls":5},"x",{"$nulls":3},"x",null,"Aucklandpark"]

{"sheet":"EastLondon","index":2,"n_rows":5,"n_cols":37,"rows_kept":5}
[null,"SLA","Province","LAT_DEG","LAT_MIN","LAT_SEC","LONG_DEG","LONG_MIN","LONG_SEC","DECIMAL LATITUDE","DECIMAL LONGITUDE","RSGR","SBC1","SBC2","SBC3",2000,"DTT1","DTT2","SAFM","LOBO","SEDI","EKHE","HOZI","METR","RAD5","RGHP","WEZI","WALA","LTUS","PHAL","MOTS","NENE","BELA","XKFM","Regional Site","outside sites","Probe site"]
["BUTTERWORTH","Silver","EC",-32,-16,-35,28,12,24,-32.27638888888889,28.206666666666667,"x","x","x","x","x","x","x","x","x",{"$nulls":14},"x",null,"EastLondon"]
["EAST LONDON","Silver","EC",-32,-56,-20,27,48,56,-32.93888888888888,27.815555555555555,"x","x","x","x","x","x","x","x","x",null,null,"x","x","x",{"$nulls":9},"x",null,"EastLondon"]
["KING WILLIAMS TOWN","Silver","EC",-32,-51,-36,27,24,50,-32.86,27.413888888888888,"x","x","x","x",null,"x","x","x","x",{"$nulls":13},"x","x",null,"EastLondon"]
["KOMGA",{"$error":"#N/A"},"EC",-32,-33,-44,27,51,45,-32.56222222222222,27.8625,{"$nulls":8},"x",{"$nulls":14},"x",null,"EastLondon"]

{"sheet":"Bloemfontein","index":3,"n_rows":8,"n_cols":37,"rows_kept":8}
[null,"SLA","Province","LAT_DEG","LAT_MIN","LAT_SEC","LONG_DEG","LONG_MIN","LONG_SEC","DECIMAL LATITUDE","DECIMAL LONGITUDE","RSGR","SBC1","SBC2","SBC3",2000,"DTT1","DTT2","SAFM","LOBO","SEDI","EKHE","HOZI","METR","RAD5","RGHP","WEZI","WALA","LTUS","PHAL","MOTS","NENE","BELA","XKFM","Regional Site","outside sites","Probe site"]
["BLOEMFONTEIN","Silver","FS",-29,-6,0,26,13,0,-29.1,26.216666666666665,"x","x","x","x","x","x","x","x","x","x",null,null,"x","x",{"$nulls":9},"x",null,"Bloemfontein"]
["DEWETSDORP",{"$error":"#N/A"},"FS",-29,-34,-44,26,39,37,-29.578888888888887,26.660277777777775,null,null,"x",null,null,"x",{"$nulls":17},"x",null,"Bloemfontein"]
["JAGERSFONTEIN",{"$error":"#N/A"},"FS",-29,-45,-23,25,25,47,-29.75638888888889,25.429722222222225,null,"x","x","x",{"$nulls":5},"x",{"$nulls":13},"x",null,"Bloemfontein"]
["LADYBRAND","Silver","FS",-29,-10,-18,27,22,42,-29.171666666666667,27.378333333333334,"x","x","x",null,null,"x","x","x",null,"x",{"$nulls":13},"x",null,"Bloemfontein"]
["SPRINGFONTEIN","Silver","FS",-30,-16,-14,25,46,8,-30.270555555555553,25.76888888888889,"x",null,"x",null,"x","x",null,"x","x","x",{"$nulls":13},"x",null,"Bloemfontein"]
["THABA NCHU",{"$error":"#N/A"},"FS",-29,-15,-24,26,45,45,-29.256666666666668,26.7625,{"$nulls":9},"x",{"$nulls":9},"x",{"$nulls":3},"x",null,"Bloemfontein"]
["THEUNISSEN","Silver","FS",-28,-11,-55,26,34,50,-28.198611111111113,26.580555555555556,"x","x","x","x","x","x","x","x","x","x",null,"x",null,"x",{"$nulls":5},"x",{"$nulls":3},"x",null,"Bloemfontein"]

{"sheet":"Durban","index":4,"n_rows":7,"n_cols":37,"rows_kept":7}
[null,"SLA ","Province ","LAT_DEG ","LAT_MIN ","LAT_SEC","LONG_DEG","LONG_MIN","LONG_SEC","DECIMAL LATITUDE","DECIMAL LONGITUDE","RSGR","SBC1","SBC2","SBC3",2000,"DTT1","DTT2","SAFM","LOBO","SEDI","EKHE","HOZI","METR","RAD5","RGHP","WEZI","WALA","LTUS","PHAL","MOTS","NENE","BELA","XKFM","Regional Site","outside sites","Probe site"]
["DURBAN","Platinum","KN",-29,-46,0,30,40,0,-29.766666666666666,30.666666666666668,"x","x","x","x","x","x","x","x","x",null,null,"x","x","x",{"$nulls":3},"x",{"$nulls":5},"x",null,"Durban"]
["DURBAN NORTH","Silver","KN",-29,-45,-52,31,2,24,-29.764444444444443,31.040000000000003,"x",{"$nulls":3},"x",null,null,"x",{"$nulls":3},"x","x","x",{"$nulls":3},"x",{"$nulls":5},"x",null,"Durban"]
["OVERPORT",{"$error":"#N/A"},"KN",-29,-50,-12,30,59,44,-29.836666666666666,30.995555555555555,null,"x","x","x",null,"x","x",{"$nulls":16},"x",null,"Durban"]
["PIETERMARITZBURG","Silver","KN",-29,-34,0,30,19,0,-29.566666666666666,30.316666666666666,"x","x","x","x","x","x","x","x",{"$nulls":3},"x",null,"x",{"$nulls":3},"x",{"$nulls":5},"x",null,"Durban"]
["THE BLUFF","Silver","KN",-29,-54,-42,31,0,44,-29.911666666666665,31.01222222222222,"x","x","x","x","x","x","x","x",{"$nulls":3},"x",null,"x",{"$nulls":3},"x",{"$nulls":5},"x",null,"Durban"]
["VERULAM",{"$error":"#N/A"},"KN",-29,-38,-25,31,2,19,-29.640277777777776,31.038611111111113,null,"x","x","x",null,"x","x",{"$nulls":16},"x",null,"Durban"]

{"sheet":"Kimbely","index":5,"n_rows":4,"n_cols":37,"rows_kept":4}
[null,"SLA","Province","LAT_DEG","LAT_MIN","LAT_SEC","LONG_DEG","LONG_MIN","LONG_SEC","DECIMAL LATITUDE","DECIMAL LONGITUDE","RSGR","SBC1","SBC2","SBC3",2000,"DTT1","DTT2","SAFM","LOBO","SEDI","EKHE","HOZI","METR","RAD5","RGHP","WEZI","WALA","LTUS","PHAL","MOTS","NENE","BELA","XKFM","Regional Site","outside sites","Probe site"]
["KIMBERLEY","Gold","FS",-28,-51,0,24,54,0,-28.85,24.9,"x","x","x","x","x","x","x","x","x","x",null,null,"x","x",{"$nulls":5},"x",{"$nulls":3},"x",null,"Kimbely"]
["DOUGLAS","Silver","NC",-29,-4,-9,23,31,43,-29.069166666666668,23.52861111111111,"x",null,"x",null,null,"x",null,"x",{"$nulls":15},"x",null,"Kimbely"]
["CHRISTIANA",{"$f":"VLOOKUP(A4,'[1]RSG Sites'!$A$2:$F$133,6,FALSE)","v":"Silver"},{"$f":"VLOOKUP(A4,[2]RAW!$C$2:$O$8276,13,FALSE)","v":"NW"},{"$f":"VLOOKUP(A4,[2]RAW!$C$2:$J$8276,3,FALSE)","v":-27},{"$f":"VLOOKUP(A4,[2]RAW!$C$2:$J$8276,4,FALSE)","v":-53},{"$f":"VLOOKUP(A4,[2]RAW!$C$2:$J$8276,5,FALSE)","v":-3},{"$f":"VLOOKUP(A4,[2]RAW!$C$2:$J$8276,6,FALSE)","v":24},{"$f":"VLOOKUP(A4,[2]RAW!$C$2:$J$8276,7,FALSE)","v":55},{"$f":"VLOOKUP(A4,[2]RAW!$C$2:$J$8276,8,FALSE)","v":50},{"$f":"VLOOKUP(A4,[3]RAW!$C$17:$BK$8270,60,FALSE)","v":-27.884166666666665},{"$f":"VLOOKUP(A4,[3]RAW!$C$17:$BK$8270,61,FALSE)","v":24.930555555555557},"x","x","x","x",null,"x","x","x",{"$nulls":11},"x",{"$nulls":4},"x","Kimbely"]

{"sheet":"Mahikeng","index":6,"n_rows":9,"n_cols":37,"rows_kept":9}
[null,"SLA","Province","LAT_DEG","LAT_MIN","LAT_SEC","LONG_DEG","LONG_MIN","LONG_SEC","DECIMAL LATITUDE","DECIMAL LONGITUDE","RSGR","SBC1","SBC2","SBC3",2000,"DTT1","DTT2","SAFM","LOBO","SEDI","EKHE","HOZI","METR","RAD5","RGHP","WEZI","WALA","LTUS","PHAL","MOTS","NENE","BELA","XKFM","Regional Site","outside sites","Probe site"]
["ENZELSBERG","Silver","NW",-25,-25,-7,26,13,16,-25.41861111111111,26.22111111111111,"x","x","x","x",null,"x",null,"x",{"$nulls":11},"x",{"$nulls":3},"x",null,"Mahikeng"]
["GROOT MARICO","Bronze","NW",-25,-37,-11,26,26,8,-25.619722222222222,26.435555555555556,"x",null,"x",null,null,"x",null,"x",{"$nulls":11},"x",{"$nulls":3},"x",null,"Mahikeng"]
["MADIBOGO",{"$error":"#N/A"},"NW",-26,-27,-28,25,15,14,-26.45777777777778,25.253888888888888,null,"x","x",null,null,"x",{"$nulls":13},"x",{"$nulls":3},"x",null,"Mahikeng"]
["MMABATHO",{"$error":"#N/A"},"NW",-25,-50,-22,25,36,46,-25.839444444444442,25.61277777777778,{"$nulls":8},"x","x",{"$nulls":9},"x",{"$nulls":3},"x",null,"Mahikeng"]
["MOTSWEDI",{"$error":"#N/A"},"NW",-25,-16,-55,25,52,18,-25.281944444444445,25.871666666666666,null,"x","x",null,null,"x",{"$nulls":13},"x",{"$nulls":3},"x",null,"Mahikeng"]
["PIET PLESSIS","Silver","NW",-26,-14,-56,24,49,55,-26.24888888888889,24.831944444444446,"x","x","x",null,null,"x","x","x",{"$nulls":11},"x",{"$nulls":3},"x",null,"Mahikeng"]
["SWARTRUGGENS",{"$error":"#N/A"},"NW",-25,-40,-59,26,48,9,-25.68305555555556,26.802500000000002,null,null,"x",null,null,"x",{"$nulls":17},"x",null,"Mahikeng"]
["ZEERUST","Silver","NW",-25,-51,-37,26,2,51,-25.860277777777778,26.047500000000003,"x","x","x","x","x","x","x","x",{"$nulls":11},"x",{"$nulls":3},"x",null,"Mahikeng"]

{"sheet":"Nelspruit","index":7,"n_rows":7,"n_cols":37,"rows_kept":7}
[null,"SLA","Province","LAT_DEG","LAT_MIN","LAT_SEC","LONG_DEG","LONG_MIN","LONG_SEC","DECIMAL LATITUDE","DECIMAL LONGITUDE","RSGR","SBC1","SBC2","SBC3",2000,"DTT1","DTT2","SAFM","LOBO","SEDI","EKHE","HOZI","METR","RAD5","RGHP","WEZI","WALA","LTUS","PHAL","MOTS","NENE","BELA","XKFM","Regional Site","outside sites","Probe site"]
["CAROLINA","Silver","MP",-26,-10,-37,30,37,57,-26.176944444444445,30.6325,"x","x","x",null,null,"x","x","x",{"$nulls":3},"x",{"$nulls":4},"x",{"$nulls":6},"x",null,"Nelspruit"]
["DULLSTROOM","Silver","MP",-25,-34,-21,30,11,17,-25.572499999999998,30.188055555555557,"x","x","x",null,null,"x",null,"x",{"$nulls":3},"x",{"$nulls":3},"x","x",{"$nulls":4},"x",null,"x",null,"Nelspruit"]
["HECTORSPRUIT",{"$error":"#N/A"},"MP",-25,-28,-47,31,36,20,-25.47972222222222,31.605555555555558,null,"x","x",null,null,"x",{"$nulls":10},"x",{"$nulls":6},"x",null,"Nelspruit"]
["LYDENBURG","Bronze","MP",-25,-6,-20,30,26,3,-25.105555555555558,30.434166666666666,"x",null,"x",null,null,"x",null,"x",{"$nulls":8},"x",{"$nulls":6},"x",null,"Nelspruit"]
["NELSPRUIT","Gold","MP",-25,-30,-57,30,46,33,-25.515833333333333,30.77583333333333,"x","x","x","x","x","x","x","x",{"$nulls":4},"x","x",null,null,"x",{"$nulls":3},"x",null,null,"x",null,"Nelspruit"]
["SABIE","Bronze","MP",-25,-7,-46,30,45,35,-25.129444444444445,30.759722222222223,"x","x","x",{"$nulls":3},"x","x",{"$nulls":8},"x",{"$nulls":6},"x",null,"Nelspruit"]

{"sheet":"Polokwane","index":8,"n_rows":6,"n_cols":37,"rows_kept":6}
[null,"SLA","Province","LAT_DEG","LAT_MIN","LAT_SEC","LONG_DEG","LONG_MIN","LONG_SEC","DECIMAL LATITUDE","DECIMAL LONGITUDE","RSGR","SBC1","SBC2","SBC3",2000,"DTT1","DTT2","SAFM","LOBO","SEDI","EKHE","HOZI","METR","RAD5","RGHP","WEZI","WALA","LTUS","PHAL","MOTS","NENE","BELA","XKFM","Regional Site","outside sites","Probe site"]
["BLOUBERG","Bronze","LP",-23,-4,-19,28,59,12,-23.071944444444444,28.986666666666668,"x",{"$nulls":6},"x",{"$nulls":13},"x",null,"x",null,"Polokwane"]
["HAENERTSBURG",{"$error":"#N/A"},"LP",-23,-59,-54,29,56,48,-23.998333333333335,29.946666666666665,{"$nulls":21},"x",null,"x",null,"Polokwane"]
["LOUIS TRICHARDT","Silver","LP",-23,0,-2,29,45,26,-23.000555555555554,29.75722222222222,"x","x","x","x","x","x","x","x",{"$nulls":10},"x",null,"x","x",null,"x",null,"Polokwane"]
["POTGIETERSRUS","Platinum","LP",-24,-9,-24,29,14,10,-24.156666666666666,29.23611111111111,"x","x","x","x","x","x","x",{"$nulls":5},"x","x",null,"x",null,null,"x",null,"x","x",null,"x",null,"Polokwane"]
["TZANEEN","Silver","LP",-23,-47,-6,30,0,17,-23.785,30.004722222222224,"x","x","x","x","x","x","x","x",{"$nulls":10},"x",null,"x","x",null,"x",null,"Polokwane"]

{"sheet":"Port Elizabeth","index":9,"n_rows":14,"n_cols":37,"rows_kept":14}
[null,"SLA","Province","LAT_DEG","LAT_MIN","LAT_SEC","LONG_DEG","LONG_MIN","LONG_SEC","DECIMAL LATITUDE","DECIMAL LONGITUDE","RSGR","SBC1","SBC2","SBC3",2000,"DTT1","DTT2","SAFM","LOBO","SEDI","EKHE","HOZI","METR","RAD5","RGHP","WEZI","WALA","LTUS","PHAL","MOTS","NENE","BELA","XKFM","Regional Site","outside sites","Probe site"]
["ALIWAL NORTH","Silver","EC",-30,-47,-5,26,34,0,-30.784722222222225,26.566666666666666,"x","x","x",null,null,"x","x","x","x","x",{"$nulls":13},"x",null,"Port Elizabeth"]
["ANDRIESKRAAL","Bronze","EC",-33,-46,-42,24,42,35,-33.77833333333333,24.709722222222222,"x","x","x","x",null,"x",null,"x","x",{"$nulls":14},"x",null,"Port Elizabeth"]
["DESPATCH",{"$error":"#N/A"},"EC",-33,-45,-53,25,25,29,-33.764722222222225,25.424722222222222,null,"x","x","x",null,"x","x",{"$nulls":16},"x",null,"Port Elizabeth"]
["GRAHAMSTOWN","Gold","EC",-33,-19,-42,26,30,4,-33.32833333333333,26.50111111111111,"x","x","x","x","x","x","x","x","x",{"$nulls":4},"x",{"$nulls":9},"x",null,"Port Elizabeth"]
["HANKEY","Bronze","EC",-33,-49,-52,24,52,12,-33.83111111111111,24.87,"x","x","x","x",null,"x",null,"x","x",{"$nulls":14},"x",null,"Port Elizabeth"]
["KIRKWOOD",{"$error":"#N/A"},"EC",-33,-23,-22,25,26,53,-33.38944444444444,25.448055555555555,null,null,"x",null,null,"x",{"$nulls":17},"x",null,"Port Elizabeth"]
["PARSONS HILL","Bronze","EC",-33,-57,-11,25,35,19,-33.95305555555556,25.58861111111111,"x",{"$nulls":3},"x",null,null,"x","x",{"$nulls":3},"x",{"$nulls":10},"x",null,"Port Elizabeth"]
["PATENSIE","Bronze","EC",-33,-45,-39,24,49,37,-33.76083333333333,24.826944444444443,"x","x","x","x",null,"x",null,"x","x",{"$nulls":14},"x",null,"Port Elizabeth"]
["PAUL SAUER DAM","Bronze","EC",-33,-45,-13,24,33,43,-33.75361111111111,24.561944444444446,"x","x","x","x",null,"x",null,"x","x",{"$nulls":14},"x",null,"Port Elizabeth"]
["PORT ELIZABETH","Gold","EC",-33,-56,-10,25,26,27,-33.93611111111111,25.440833333333334,"x","x","x","x","x","x","x","x","x",{"$nulls":3},"x","x",{"$nulls":3},"x",{"$nulls":5},"x",null,"Port Elizabeth"]
["PORT ELIZABETH CITY",{"$error":"#N/A"},"EC",-33,-55,-28,25,35,29,-33.92444444444444,25.591388888888886,null,"x","x","x",null,"x","x",{"$nulls":16},"x",null,"Port Elizabeth"]
["SUURBERG","Silver","EC",-33,-14,-55,25,34,27,-33.24861111111111,25.574166666666667,"x","x","x","x",null,"x","x","x","x",{"$nulls":14},"x",null,"Port Elizabeth"]
["KAREEDOUW",{"$f":"VLOOKUP(A14,'[1]RSG Sites'!$A$2:$F$133,6,FALSE)","v":"Silver"},{"$f":"VLOOKUP(A14,[2]RAW!$C$2:$O$8276,13,FALSE)","v":"EC"},{"$f":"VLOOKUP(A14,[2]RAW!$C$2:$J$8276,3,FALSE)","v":-33},{"$f":"VLOOKUP(A14,[2]RAW!$C$2:$J$8276,4,FALSE)","v":-57},{"$f":"VLOOKUP(A14,[2]RAW!$C$2:$J$8276,5,FALSE)","v":-48},{"$f":"VLOOKUP(A14,[2]RAW!$C$2:$J$8276,6,FALSE)","v":24},{"$f":"VLOOKUP(A14,[2]RAW!$C$2:$J$8276,7,FALSE)","v":17},{"$f":"VLOOKUP(A14,[2]RAW!$C$2:$J$8276,8,FALSE)","v":15},{"$f":"VLOOKUP(A14,[3]RAW!$C$17:$BK$8270,60,FALSE)","v":-34.02472222222222},{"$f":"VLOOKUP(A14,[3]RAW!$C$17:$BK$8270,61,FALSE)","v":24.43},"x","x","x",null,null,"x",null,"x","x",{"$nulls":14},"x",null,"Port Elizabeth"]

{"sheet":"Seapoint","index":10,"n_rows":15,"n_cols":37,"rows_kept":15}
[null,"SLA","Province","LAT_DEG","LAT_MIN","LAT_SEC","LONG_DEG","LONG_MIN","LONG_SEC","DECIMAL LATITUDE","DECIMAL LONGITUDE","RSGR","SBC1","SBC2","SBC3",2000,"DTT1","DTT2","SAFM","LOBO","SEDI","EKHE","HOZI","METR","RAD5","RGHP","WEZI","WALA","LTUS","PHAL","MOTS","NENE","BELA","XKFM","Regional Site","outside sites","Probe site"]
["AMANDA GLEN",{"$error":"#N/A"},"WC",-33,-51,-18,18,40,33,-33.855000000000004,18.675833333333333,null,"x","x","x",{"$nulls":19},"x",null,"Seapoint"]
["AURORA",{"$error":"#N/A"},"WC",-33,-49,-39,18,38,29,-33.8275,18.641388888888887,null,"x","x","x",null,"x","x",{"$nulls":16},"x",null,"Seapoint"]
["CAPE TOWN","Platinum","WC",-34,-3,-18,18,23,11,-34.055,18.386388888888888,"x","x","x","x","x","x","x","x","x",{"$nulls":4},"x","x",{"$nulls":8},"x",null,"Seapoint"]
["CLIFTON",{"$error":"#N/A"},"WC",-33,-56,-31,18,22,36,-33.94194444444444,18.37666666666667,null,"x","x","x",null,"x","x",{"$nulls":16},"x",null,"Seapoint"]
["FISHHOEK",{"$error":"#N/A"},"WC",-34,-8,-59,18,26,8,-34.14972222222222,18.435555555555556,null,"x","x","x",null,"x","x",{"$nulls":16},"x",null,"Seapoint"]
["FRANSCHHOEK","Silver","WC",-33,-54,-26,19,4,23,-33.907222222222224,19.073055555555555,"x","x","x","x","x","x","x","x","x",{"$nulls":5},"x",{"$nulls":8},"x",null,"Seapoint"]
["GRABOUW","Silver","WC",-34,-6,-7,18,58,0,-34.10194444444445,18.966666666666665,"x","x","x","x",null,"x","x","x",{"$nulls":15},"x",null,"Seapoint"]
["PAARL","Silver","WC",-33,-42,-51,18,56,23,-33.71416666666667,18.939722222222223,"x","x","x","x","x","x","x","x","x",{"$nulls":4},"x","x",{"$nulls":8},"x",null,"Seapoint"]
["SEA POINT","Bronze","WC",-33,-54,-33,18,23,51,-33.909166666666664,18.3975,"x","x","x","x","x","x","x","x","x",{"$nulls":3},"x","x","x",{"$nulls":8},"x",null,"Seapoint"]
["SIMONSTOWN","Silver","WC",-34,-11,-55,18,25,36,-34.198611111111106,18.42666666666667,"x","x","x","x","x","x","x","x",{"$nulls":5},"x","x",{"$nulls":8},"x",null,"Seapoint"]
["STELLENBOSCH","Bronze","WC",-33,-54,-59,18,52,10,-33.91638888888889,18.869444444444444,"x","x","x","x","x","x","x","x","x",{"$nulls":4},"x","x",{"$nulls":8},"x",null,"Seapoint"]
["TABLE MOUNTAIN","Silver","WC",-33,-57,-26,18,24,11,-33.95722222222223,18.403055555555554,"x","x","x","x","x","x","x","x","x",{"$nulls":3},"x","x","x",{"$nulls":8},"x",null,"Seapoint"]
["TYGERBERG","Gold","WC",-33,-52,-31,18,35,44,-33.875277777777775,18.595555555555553,"x","x","x","x","x","x","x","x",{"$nulls":4},"x","x","x",null,null,"x",{"$nulls":5},"x",null,"Seapoint"]
["HOUT BAY",{"$f":"VLOOKUP(A15,'[1]RSG Sites'!$A$2:$F$133,6,FALSE)","v":"Silver"},{"$f":"VLOOKUP(A15,[2]RAW!$C$2:$O$8276,13,FALSE)","v":"WC"},{"$f":"VLOOKUP(A15,[2]RAW!$C$2:$J$8276,3,FALSE)","v":-34},{"$f":"VLOOKUP(A15,[2]RAW!$C$2:$J$8276,4,FALSE)","v":0},{"$f":"VLOOKUP(A15,[2]RAW!$C$2:$J$8276,5,FALSE)","v":-46},{"$f":"VLOOKUP(A15,[2]RAW!$C$2:$J$8276,6,FALSE)","v":18},{"$f":"VLOOKUP(A15,[2]RAW!$C$2:$J$8276,7,FALSE)","v":20},{"$f":"VLOOKUP(A15,[2]RAW!$C$2:$J$8276,8,FALSE)","v":51},{"$f":"VLOOKUP(A15,[3]RAW!$C$17:$BK$8270,60,FALSE)","v":-34.01277777777778},{"$f":"VLOOKUP(A15,[3]RAW!$C$17:$BK$8270,61,FALSE)","v":18.3475},"x","x","x","x","x","x","x","x",{"$nulls":5},"x","x",{"$nulls":8},"x",null,"Seapoint"]

{"sheet":"Thohoyandou","index":11,"n_rows":7,"n_cols":37,"rows_kept":7}
[null,"SLA","Province","LAT_DEG","LAT_MIN","LAT_SEC","LONG_DEG","LONG_MIN","LONG_SEC","DECIMAL LATITUDE","DECIMAL LONGITUDE","RSGR","SBC1","SBC2","SBC3",2000,"DTT1","DTT2","SAFM","LOBO","SEDI","EKHE","HOZI","METR","RAD5","RGHP","WEZI","WALA","LTUS","PHAL","MOTS","NENE","BELA","XKFM","Regional Site","outside sites","Probe site"]
["DZAMBA",{"$error":"#N/A"},"LP",-22,-49,-5,30,18,41,-22.818055555555556,30.31138888888889,null,"x","x",null,null,"x",{"$nulls":12},"x",{"$nulls":4},"x",null,"Thohoyandou"]
["GABA",{"$error":"#N/A"},"LP",-22,-47,-2,30,42,25,-22.78388888888889,30.706944444444442,null,"x","x",null,null,"x",{"$nulls":12},"x",null,"x",null,null,"x",null,"Thohoyandou"]
["MALAMBA",{"$error":"#N/A"},"LP",-22,-53,-56,30,15,9,-22.898888888888887,30.2525,null,"x","x",null,null,"x",{"$nulls":12},"x",{"$nulls":4},"x",null,"Thohoyandou"]
["PUNDA MARIA",{"$error":"#N/A"},"LP",-22,-43,-28,30,59,19,-22.724444444444444,30.988611111111112,{"$nulls":18},"x",null,"x",null,null,"x",null,"Thohoyandou"]
["SIBASA",{"$error":"#N/A"},"LP",-22,-56,-57,30,26,54,-22.949166666666667,30.448333333333334,null,"x","x","x",null,"x","x",{"$nulls":11},"x",{"$nulls":4},"x",null,"Thohoyandou"]
["TSHAMAVUDZI",{"$error":"#N/A"},"LP",-22,-39,-15,30,31,42,-22.654166666666665,30.528333333333332,null,"x","x",null,null,"x",{"$nulls":12},"x",null,null,"x",null,"x",null,"Thohoyandou"]

{"sheet":"Hatfield","index":12,"n_rows":6,"n_cols":37,"rows_kept":6}
[null,"SLA","Province","LAT_DEG","LAT_MIN","LAT_SEC","LONG_DEG","LONG_MIN","LONG_SEC","DECIMAL LATITUDE","DECIMAL LONGITUDE","RSGR","SBC1","SBC2","SBC3",2000,"DTT1","DTT2","SAFM","LOBO","SEDI","EKHE","HOZI","METR","RAD5","RGHP","WEZI","WALA","LTUS","PHAL","MOTS","NENE","BELA","XKFM","Regional Site","outside sites","Probe site"]
["KWAGGAFONTEIN",{"$f":"VLOOKUP(A2,'[1]RSG Sites'!$A$2:$F$133,6,FALSE)","v":{"$error":"#N/A"}},{"$f":"VLOOKUP(A2,[2]RAW!$C$2:$O$8276,13,FALSE)","v":"MP"},{"$f":"VLOOKUP(A2,[2]RAW!$C$2:$J$8276,3,FALSE)","v":-25},{"$f":"VLOOKUP(A2,[2]RAW!$C$2:$J$8276,4,FALSE)","v":-14},{"$f":"VLOOKUP(A2,[2]RAW!$C$2:$J$8276,5,FALSE)","v":-37},{"$f":"VLOOKUP(A2,[2]RAW!$C$2:$J$8276,6,FALSE)","v":28},{"$f":"VLOOKUP(A2,[2]RAW!$C$2:$J$8276,7,FALSE)","v":57},{"$f":"VLOOKUP(A2,[2]RAW!$C$2:$J$8276,8,FALSE)","v":27},{"$f":"VLOOKUP(A2,[3]RAW!$C$17:$BK$8270,60,FALSE)","v":-25.24361111111111},{"$f":"VLOOKUP(A2,[3]RAW!$C$17:$BK$8270,61,FALSE)","v":28.9575},{"$nulls":15},"x",{"$nulls":5},"x",null,"x",null,"Hatfield"]
["KWAMHLANGA",{"$f":"VLOOKUP(A3,'[1]RSG Sites'!$A$2:$F$133,6,FALSE)","v":{"$error":"#N/A"}},{"$f":"VLOOKUP(A3,[2]RAW!$C$2:$O$8276,13,FALSE)","v":"MP"},{"$f":"VLOOKUP(A3,[2]RAW!$C$2:$J$8276,3,FALSE)","v":-25},{"$f":"VLOOKUP(A3,[2]RAW!$C$2:$J$8276,4,FALSE)","v":-26},{"$f":"VLOOKUP(A3,[2]RAW!$C$2:$J$8276,5,FALSE)","v":-22},{"$f":"VLOOKUP(A3,[2]RAW!$C$2:$J$8276,6,FALSE)","v":28},{"$f":"VLOOKUP(A3,[2]RAW!$C$2:$J$8276,7,FALSE)","v":30},{"$f":"VLOOKUP(A3,[2]RAW!$C$2:$J$8276,8,FALSE)","v":49},{"$f":"VLOOKUP(A3,[3]RAW!$C$17:$BK$8270,60,FALSE)","v":-25.439444444444444},{"$f":"VLOOKUP(A3,[3]RAW!$C$17:$BK$8270,61,FALSE)","v":28.51361111111111},{"$nulls":15},"x",{"$nulls":7},"x",null,"Hatfield"]
["MIDDELBURG",{"$f":"VLOOKUP(A4,'[1]RSG Sites'!$A$2:$F$133,6,FALSE)","v":"Gold"},{"$f":"VLOOKUP(A4,[2]RAW!$C$2:$O$8276,13,FALSE)","v":"MP"},{"$f":"VLOOKUP(A4,[2]RAW!$C$2:$J$8276,3,FALSE)","v":-25},{"$f":"VLOOKUP(A4,[2]RAW!$C$2:$J$8276,4,FALSE)","v":-49},{"$f":"VLOOKUP(A4,[2]RAW!$C$2:$J$8276,5,FALSE)","v":-4},{"$f":"VLOOKUP(A4,[2]RAW!$C$2:$J$8276,6,FALSE)","v":29},{"$f":"VLOOKUP(A4,[2]RAW!$C$2:$J$8276,7,FALSE)","v":23},{"$f":"VLOOKUP(A4,[2]RAW!$C$2:$J$8276,8,FALSE)","v":24},{"$f":"VLOOKUP(A4,[3]RAW!$C$17:$BK$8270,60,FALSE)","v":-25.817777777777778},{"$f":"VLOOKUP(A4,[3]RAW!$C$17:$BK$8270,61,FALSE)","v":29.39},"x","x","x","x","x","x","x","x",{"$nulls":3},"x","x","x",null,"x","x",{"$nulls":4},"x",null,"x",null,"Hatfield"]
["PANKOP",{"$f":"VLOOKUP(A5,'[1]RSG Sites'!$A$2:$F$133,6,FALSE)","v":{"$error":"#N/A"}},{"$f":"VLOOKUP(A5,[2]RAW!$C$2:$O$8276,13,FALSE)","v":"MP"},{"$f":"VLOOKUP(A5,[2]RAW!$C$2:$J$8276,3,FALSE)","v":-25},{"$f":"VLOOKUP(A5,[2]RAW!$C$2:$J$8276,4,FALSE)","v":-9},{"$f":"VLOOKUP(A5,[2]RAW!$C$2:$J$8276,5,FALSE)","v":-44},{"$f":"VLOOKUP(A5,[2]RAW!$C$2:$J$8276,6,FALSE)","v":28},{"$f":"VLOOKUP(A5,[2]RAW!$C$2:$J$8276,7,FALSE)","v":24},{"$f":"VLOOKUP(A5,[2]RAW!$C$2:$J$8276,8,FALSE)","v":16},{"$f":"VLOOKUP(A5,[3]RAW!$C$17:$BK$8270,60,FALSE)","v":-25.16222222222222},{"$f":"VLOOKUP(A5,[3]RAW!$C$17:$BK$8270,61,FALSE)","v":28.404444444444444},{"$nulls":19},"x",{"$nulls":3},"x",null,"Hatfield"]
["RUSTENBURG",{"$f":"VLOOKUP(A6,'[1]RSG Sites'!$A$2:$F$133,6,FALSE)","v":"Silver"},{"$f":"VLOOKUP(A6,[2]RAW!$C$2:$O$8276,13,FALSE)","v":"NW"},{"$f":"VLOOKUP(A6,[2]RAW!$C$2:$J$8276,3,FALSE)","v":-25},{"$f":"VLOOKUP(A6,[2]RAW!$C$2:$J$8276,4,FALSE)","v":-36},{"$f":"VLOOKUP(A6,[2]RAW!$C$2:$J$8276,5,FALSE)","v":-59},{"$f":"VLOOKUP(A6,[2]RAW!$C$2:$J$8276,6,FALSE)","v":27},{"$f":"VLOOKUP(A6,[2]RAW!$C$2:$J$8276,7,FALSE)","v":7},{"$f":"VLOOKUP(A6,[2]RAW!$C$2:$J$8276,8,FALSE)","v":5},{"$f":"VLOOKUP(A6,[3]RAW!$C$17:$BK$8270,60,FALSE)","v":-25.616388888888892},{"$f":"VLOOKUP(A6,[3]RAW!$C$17:$BK$8270,61,FALSE)","v":27.118055555555557},"x","x","x","x","x","x","x","x",{"$nulls":4},"x",{"$nulls":6},"x",{"$nulls":3},"x",null,"Hatfield"]

{"sheet":"George","index":13,"n_rows":9,"n_cols":37,"rows_kept":9}
[null,"SLA","Province","LAT_DEG","LAT_MIN","LAT_SEC","LONG_DEG","LONG_MIN","LONG_SEC","DECIMAL LATITUDE","DECIMAL LONGITUDE","RSGR","SBC1","SBC2","SBC3",2000,"DTT1","DTT2","SAFM","LOBO","SEDI","EKHE","HOZI","METR","RAD5","RGHP","WEZI","WALA","LTUS","PHAL","MOTS","NENE","BELA","XKFM","Regional Site","outside sites","Probe site"]
["GEORGE",{"$f":"VLOOKUP(A2,'[1]RSG Sites'!$A$2:$F$133,6,FALSE)","v":"Gold"},{"$f":"VLOOKUP(A2,[2]RAW!$C$2:$O$8276,13,FALSE)","v":"WC"},{"$f":"VLOOKUP(A2,[2]RAW!$C$2:$J$8276,3,FALSE)","v":-33},{"$f":"VLOOKUP(A2,[2]RAW!$C$2:$J$8276,4,FALSE)","v":-55},{"$f":"VLOOKUP(A2,[2]RAW!$C$2:$J$8276,5,FALSE)","v":-38},{"$f":"VLOOKUP(A2,[2]RAW!$C$2:$J$8276,6,FALSE)","v":22},{"$f":"VLOOKUP(A2,[2]RAW!$C$2:$J$8276,7,FALSE)","v":27},{"$f":"VLOOKUP(A2,[2]RAW!$C$2:$J$8276,8,FALSE)","v":3},{"$f":"VLOOKUP(A2,[3]RAW!$C$17:$BK$8270,60,FALSE)","v":-33.92722222222222},{"$f":"VLOOKUP(A2,[3]RAW!$C$17:$BK$8270,61,FALSE)","v":22.450833333333332},"x","x","x","x","x","x","x","x","x",null,null,"x",null,"x",{"$nulls":9},"x",null,"George"]
["GROOT BRAKRIVIER",{"$f":"VLOOKUP(A3,'[1]RSG Sites'!$A$2:$F$133,6,FALSE)","v":{"$error":"#N/A"}},{"$f":"VLOOKUP(A3,[2]RAW!$C$2:$O$8276,13,FALSE)","v":"WC"},{"$f":"VLOOKUP(A3,[2]RAW!$C$2:$J$8276,3,FALSE)","v":-34},{"$f":"VLOOKUP(A3,[2]RAW!$C$2:$J$8276,4,FALSE)","v":-1},{"$f":"VLOOKUP(A3,[2]RAW!$C$2:$J$8276,5,FALSE)","v":-55},{"$f":"VLOOKUP(A3,[2]RAW!$C$2:$J$8276,6,FALSE)","v":22},{"$f":"VLOOKUP(A3,[2]RAW!$C$2:$J$8276,7,FALSE)","v":12},{"$f":"VLOOKUP(A3,[2]RAW!$C$2:$J$8276,8,FALSE)","v":57},{"$f":"VLOOKUP(A3,[3]RAW!$C$17:$BK$8270,60,FALSE)","v":-34.03194444444444},{"$f":"VLOOKUP(A3,[3]RAW!$C$17:$BK$8270,61,FALSE)","v":22.215833333333332},null,"x","x","x",null,"x",{"$nulls":17},"x",null,"George"]
["KNYSNA",{"$f":"VLOOKUP(A4,'[1]RSG Sites'!$A$2:$F$133,6,FALSE)","v":"Silver"},{"$f":"VLOOKUP(A4,[2]RAW!$C$2:$O$8276,13,FALSE)","v":"WC"},{"$f":"VLOOKUP(A4,[2]RAW!$C$2:$J$8276,3,FALSE)","v":-34},{"$f":"VLOOKUP(A4,[2]RAW!$C$2:$J$8276,4,FALSE)","v":-4},{"$f":"VLOOKUP(A4,[2]RAW!$C$2:$J$8276,5,FALSE)","v":-38},{"$f":"VLOOKUP(A4,[2]RAW!$C$2:$J$8276,6,FALSE)","v":23},{"$f":"VLOOKUP(A4,[2]RAW!$C$2:$J$8276,7,FALSE)","v":2},{"$f":"VLOOKUP(A4,[2]RAW!$C$2:$J$8276,8,FALSE)","v":58},{"$f":"VLOOKUP(A4,[3]RAW!$C$17:$BK$8270,60,FALSE)","v":-34.07138888888889},{"$f":"VLOOKUP(A4,[3]RAW!$C$17:$BK$8270,61,FALSE)","v":23.041944444444447},"x","x","x","x","x","x","x","x","x",{"$nulls":6},"x",{"$nulls":7},"x",null,"George"]
["OUDTSHOORN",{"$f":"VLOOKUP(A5,'[1]RSG Sites'!$A$2:$F$133,6,FALSE)","v":"Gold"},{"$f":"VLOOKUP(A5,[2]RAW!$C$2:$O$8276,13,FALSE)","v":"WC"},{"$f":"VLOOKUP(A5,[2]RAW!$C$2:$J$8276,3,FALSE)","v":-33},{"$f":"VLOOKUP(A5,[2]RAW!$C$2:$J$8276,4,FALSE)","v":-34},{"$f":"VLOOKUP(A5,[2]RAW!$C$2:$J$8276,5,FALSE)","v":-49},{"$f":"VLOOKUP(A5,[2]RAW!$C$2:$J$8276,6,FALSE)","v":22},{"$f":"VLOOKUP(A5,[2]RAW!$C$2:$J$8276,7,FALSE)","v":13},{"$f":"VLOOKUP(A5,[2]RAW!$C$2:$J$8276,8,FALSE)","v":35},{"$f":"VLOOKUP(A5,[3]RAW!$C$17:$BK$8270,60,FALSE)","v":-33.671388888888885},{"$f":"VLOOKUP(A5,[3]RAW!$C$17:$BK$8270,61,FALSE)","v":22.266944444444444},"x","x","x","x","x","x","x","x","x",{"$nulls":4},"x",{"$nulls":9},"x",null,"George"]
["PLETTENBERG BAY",{"$f":"VLOOKUP(A6,'[1]RSG Sites'!$A$2:$F$133,6,FALSE)","v":"Silver"},{"$f":"VLOOKUP(A6,[2]RAW!$C$2:$O$8276,13,FALSE)","v":"WC"},{"$f":"VLOOKUP(A6,[2]RAW!$C$2:$J$8276,3,FALSE)","v":-34},{"$f":"VLOOKUP(A6,[2]RAW!$C$2:$J$8276,4,FALSE)","v":-3},{"$f":"VLOOKUP(A6,[2]RAW!$C$2:$J$8276,5,FALSE)","v":-34},{"$f":"VLOOKUP(A6,[2]RAW!$C$2:$J$8276,6,FALSE)","v":23},{"$f":"VLOOKUP(A6,[2]RAW!$C$2:$J$8276,7,FALSE)","v":22},{"$f":"VLOOKUP(A6,[2]RAW!$C$2:$J$8276,8,FALSE)","v":25},{"$f":"VLOOKUP(A6,[3]RAW!$C$17:$BK$8270,60,FALSE)","v":-34.059444444444445},{"$f":"VLOOKUP(A6,[3]RAW!$C$17:$BK$8270,61,FALSE)","v":23.37361111111111},"x","x","x","x",null,"x","x","x","x",{"$nulls":5},"x",{"$nulls":8},"x",null,"George"]
["RIVERSDALE",{"$f":"VLOOKUP(A7,'[1]RSG Sites'!$A$2:$F$133,6,FALSE)","v":"Silver"},{"$f":"VLOOKUP(A7,[2]RAW!$C$2:$O$8276,13,FALSE)","v":"WC"},{"$f":"VLOOKUP(A7,[2]RAW!$C$2:$J$8276,3,FALSE)","v":-34},{"$f":"VLOOKUP(A7,[2]RAW!$C$2:$J$8276,4,FALSE)","v":-5},{"$f":"VLOOKUP(A7,[2]RAW!$C$2:$J$8276,5,FALSE)","v":-58},{"$f":"VLOOKUP(A7,[2]RAW!$C$2:$J$8276,6,FALSE)","v":21},{"$f":"VLOOKUP(A7,[2]RAW!$C$2:$J$8276,7,FALSE)","v":15},{"$f":"VLOOKUP(A7,[2]RAW!$C$2:$J$8276,8,FALSE)","v":31},{"$f":"VLOOKUP(A7,[3]RAW!$C$17:$BK$8270,60,FALSE)","v":-34.01888888888889},{"$f":"VLOOKUP(A7,[3]RAW!$C$17:$BK$8270,61,FALSE)","v":21.1275},"x","x","x",{"$nulls":4},"x",{"$nulls":6},"x",{"$nulls":8},"x",null,"George"]
["UNIONDALE",{"$f":"VLOOKUP(A8,'[1]RSG Sites'!$A$2:$F$133,6,FALSE)","v":"Bronze"},{"$f":"VLOOKUP(A8,[2]RAW!$C$2:$O$8276,13,FALSE)","v":"WC"},{"$f":"VLOOKUP(A8,[2]RAW!$C$2:$J$8276,3,FALSE)","v":-33},{"$f":"VLOOKUP(A8,[2]RAW!$C$2:$J$8276,4,FALSE)","v":-43},{"$f":"VLOOKUP(A8,[2]RAW!$C$2:$J$8276,5,FALSE)","v":-24},{"$f":"VLOOKUP(A8,[2]RAW!$C$2:$J$8276,6,FALSE)","v":23},{"$f":"VLOOKUP(A8,[2]RAW!$C$2:$J$8276,7,FALSE)","v":3},{"$f":"VLOOKUP(A8,[2]RAW!$C$2:$J$8276,8,FALSE)","v":2},{"$f":"VLOOKUP(A8,[3]RAW!$C$17:$BK$8270,60,FALSE)","v":-33.723333333333336},{"$f":"VLOOKUP(A8,[3]RAW!$C$17:$BK$8270,61,FALSE)","v":23.050555555555555},"x",null,"x",null,null,"x",null,"x",{"$nulls":15},"x",null,"George"]
["UNIONDALE TOWN",{"$f":"VLOOKUP(A9,'[1]RSG Sites'!$A$2:$F$133,6,FALSE)","v":{"$error":"#N/A"}},{"$f":"VLOOKUP(A9,[2]RAW!$C$2:$O$8276,13,FALSE)","v":"WC"},{"$f":"VLOOKUP(A9,[2]RAW!$C$2:$J$8276,3,FALSE)","v":-33},{"$f":"VLOOKUP(A9,[2]RAW!$C$2:$J$8276,4,FALSE)","v":-38},{"$f":"VLOOKUP(A9,[2]RAW!$C$2:$J$8276,5,FALSE)","v":-49},{"$f":"VLOOKUP(A9,[2]RAW!$C$2:$J$8276,6,FALSE)","v":23},{"$f":"VLOOKUP(A9,[2]RAW!$C$2:$J$8276,7,FALSE)","v":7},{"$f":"VLOOKUP(A9,[2]RAW!$C$2:$J$8276,8,FALSE)","v":34},{"$f":"VLOOKUP(A9,[3]RAW!$C$17:$BK$8270,60,FALSE)","v":-33.64694444444444},{"$f":"VLOOKUP(A9,[3]RAW!$C$17:$BK$8270,61,FALSE)","v":23.12611111111111},null,null,"x",null,null,"x",{"$nulls":17},"x",null,"George"]

{"sheet":"Mthatha","index":14,"n_rows":6,"n_cols":37,"rows_kept":6}
[null,"SLA","Province","LAT_DEG","LAT_MIN","LAT_SEC","LONG_DEG","LONG_MIN","LONG_SEC","DECIMAL LATITUDE","DECIMAL LONGITUDE","RSGR","SBC1","SBC2","SBC3",2000,"DTT1","DTT2","SAFM","LOBO","SEDI","EKHE","HOZI","METR","RAD5","RGHP","WEZI","WALA","LTUS","PHAL","MOTS","NENE","BELA","XKFM","Regional Site","outside sites","Probe site"]
["PORT ST JOHNS",{"$f":"VLOOKUP(A2,'[1]RSG Sites'!$A$2:$F$133,6,FALSE)","v":"Silver"},{"$f":"VLOOKUP(A2,[2]RAW!$C$2:$O$8276,13,FALSE)","v":"EC"},{"$f":"VLOOKUP(A2,[2]RAW!$C$2:$J$8276,3,FALSE)","v":-31},{"$f":"VLOOKUP(A2,[2]RAW!$C$2:$J$8276,4,FALSE)","v":-36},{"$f":"VLOOKUP(A2,[2]RAW!$C$2:$J$8276,5,FALSE)","v":-39},{"$f":"VLOOKUP(A2,[2]RAW!$C$2:$J$8276,6,FALSE)","v":29},{"$f":"VLOOKUP(A2,[2]RAW!$C$2:$J$8276,7,FALSE)","v":31},{"$f":"VLOOKUP(A2,[2]RAW!$C$2:$J$8276,8,FALSE)","v":39},{"$f":"VLOOKUP(A2,[3]RAW!$C$17:$BK$8270,60,FALSE)","v":-31.610833333333336},{"$f":"VLOOKUP(A2,[3]RAW!$C$17:$BK$8270,61,FALSE)","v":29.5275},"x","x","x","x","x","x","x","x","x",{"$nulls":15},"x","Mthatha"]
["HOLY CROSS",{"$error":"#N/A"},"EC",-31,-8,-25,29,29,27,-31.140277777777776,29.490833333333335,{"$nulls":5},"x",null,null,"x",{"$nulls":15},"x","Mthatha"]
["MATATIELE","Silver","EC",-30,-23,-45,28,49,19,-30.395833333333332,28.821944444444444,"x","x","x","x",null,"x","x","x",null,"x",{"$nulls":14},"x","Mthatha"]
["MOUNT AYLIFF","Silver","EC",-30,-50,-11,29,23,41,-30.836388888888887,29.39472222222222,"x","x","x","x","x","x","x","x","x",null,null,"x",{"$nulls":12},"x","Mthatha"]
["Mthatha",{"$f":"VLOOKUP(A6,'[1]RSG Sites'!$A$2:$F$133,6,FALSE)","v":{"$error":"#N/A"}},{"$f":"VLOOKUP(A6,[2]RAW!$C$2:$O$8276,13,FALSE)","v":{"$error":"#N/A"}},{"$f":"VLOOKUP(A6,[2]RAW!$C$2:$J$8276,3,FALSE)","v":{"$error":"#N/A"}},{"$f":"VLOOKUP(A6,[2]RAW!$C$2:$J$8276,4,FALSE)","v":{"$error":"#N/A"}},{"$f":"VLOOKUP(A6,[2]RAW!$C$2:$J$8276,5,FALSE)","v":{"$error":"#N/A"}},{"$f":"VLOOKUP(A6,[2]RAW!$C$2:$J$8276,6,FALSE)","v":{"$error":"#N/A"}},{"$f":"VLOOKUP(A6,[2]RAW!$C$2:$J$8276,7,FALSE)","v":{"$error":"#N/A"}},{"$f":"VLOOKUP(A6,[2]RAW!$C$2:$J$8276,8,FALSE)","v":{"$error":"#N/A"}},{"$f":"VLOOKUP(A6,[3]RAW!$C$17:$BK$8270,60,FALSE)","v":{"$error":"#N/A"}},{"$f":"VLOOKUP(A6,[3]RAW!$C$17:$BK$8270,61,FALSE)","v":{"$error":"#N/A"}},"x","x","x","x","x","x","x","x","x",null,null,"x",{"$nulls":12},"x","Mthatha"]