{"text_format":"3","workbook":"xlsx","n_sheets":37,"sheets":["Sheet1","Earthworks","Kerbs","Layerworks","NMT and Stormwater","Section 001","Section 002","Section 101","Section 102","Section 103","Section 104","Section 105","Section B107","Section 201","Section 202","Section 203","Section 501","Section 502","Section 503","Section 504","Section 505","Section 601","Section 602","Section 603","Section 604","Section 605","Section 606","Section 607","Section 608","Section 609","Section 610","Section 612","Section 613","Section 903","Summary","Sheet2","Master Section"],"not_rendered":{"defined_names":38,"comments":7},"read":"whole","date_system":"1900"}

{"sheet":"Sheet1","index":0,"n_rows":18,"n_cols":16,"rows_kept":18,"hidden":true}
[]
[]
[null,null,601,null,602,603,604,605,606,607,608,609,610,611,612,613]
["LENGTH",144.211]
["WIDTH",6,8,7.4,6.8,null,7.4,6.2,6.1]
["THICKNESS",0.15,{"$nulls":6},0.03]
[]
["QTY",null,{"$f":"B4*C5*B6","v":173.0532},{"$f":"D5*$B$6*$B$4","v":160.07421000000002},{"$f":"E5*$B$6*$B$4","v":147.09522},{"$f":"F5*$B$6*$B$4","v":0},{"$f":"G5*$B$6*$B$4","v":160.07421000000002},{"$f":"H5*$B$4","v":894.1082000000001},{"$f":"I5*$B$4*I6","v":26.390613},null,null,{"$f":"B4*2","v":288.422}]
[]
[null,null,601,null,602,603,604,605,606,607,608,609,610,611,612,613]
["LENGTH",3875.296]
["WIDTH",5.5,7.5,6.9,6.3,null,6.9,5.7,5.6]
["THICKNESS",0.15,{"$nulls":6},0.03]
[]
["QTY",null,{"$f":"$B$11*C12*$B$13","v":4359.708},{"$f":"$B$11*D12*$B$13","v":4010.9313599999996},{"$f":"$B$11*E12*$B$13","v":3662.15472},{"$f":"$B$11*F12*$B$13","v":0},4010.9313599999996,{"$f":"$B$11*H12","v":22089.1872},{"$f":"$B$11*I12*I13","v":651.049728},0,0,{"$f":"B11*2","v":7750.592}]
[]
[]
["Total",null,{"$f":"(C8+C15)*1.15","v":5212.67538},{"$f":"(D8+D15)*1.15","v":4796.656405499999},{"$f":"(E8+E15)*1.05","v":3999.712437},{"$f":"F8+F15*1.15","v":0},{"$f":"(G8+G15)*1.15","v":4796.656405499999},{"$f":"(H8+H15)*1.15","v":26430.789709999997},{"$f":"(I8+I15)*1.15*2.4","v":1869.7353411599997},0,0,9201.602799999999,0,0,0,0]

{"sheet":"Earthworks","index":1,"n_rows":27,"n_cols":12,"rows_kept":27,"hidden":true,"merged":[[0,0,0,11]]}
["EARTHWORKS VOLUMES"]
["Road","Length","Total Cut m³","Total Fill m³","Cut Available m³","Excess Cut m³","Fill Shortfall m³","Top Soil to Strip m³","Banks Giving m²","Top Soil Cover m","Fill Slope Finishing m²","Cut Slope Finishing m²"]
[" MOTSEDU STREET",664.188,624.405,46.424,624.405,577.981,0,0,367.224,0,527.635,330.444]
[" MOSINO STREET",557.717,513.238,63.278,513.238,449.96,0,0,284.613,0,563.62,224.488]
[" MONATO STREET",677.043,775.53,31.649,775.53,743.881,0,0,300.256,0,362.737,274.084]
[" ISUNDU STREET",772.647,832.185,117.923,832.185,714.262,0,0,422.436,0,983.662,302.767]
{"$rows_empty":20}
[" Total",{"$f":"SUM(B3:B26)","v":2671.595},{"$f":"SUM(C3:C26)","v":2745.358},259.274,2745.358,2486.084,{"$f":"SUM(G4:G15)","v":0},0,{"$f":"SUM(I3:I26)","v":1374.529},{"$f":"SUM(J4:J15)","v":0},{"$f":"SUM(K3:K26)","v":2437.6540000000005},{"$f":"SUM(L3:L26)","v":1131.7830000000001}]

{"sheet":"Kerbs","index":2,"n_rows":3,"n_cols":5,"rows_kept":3,"hidden":true}
["Kerb","Description","R Range 0-4","R Range 4-20","R Range > 20"]
[" Figure 8c","Total Length (m)",0,294.067,5045.604]
[" Figure 8c","Volume (m3)",0,13.895,238.405]

{"sheet":"Layerworks","index":3,"n_rows":6,"n_cols":5,"rows_kept":6,"hidden":true}
["Description","Cut Prep m²","Fill Prep m²","Cut Vol m³","Fill Vol m³"]
["150mm C4 COMPACTED TO 97%",17006.617,0.01,2549.744,1.304]
["150mm G2 COMPACTED TO 86%",16171.99,30.378,2393.395,37.431]
["150mm ROADBED COMPCTD 93%",17808.464,0,2671.27,0]
["30mm HMA",15304.015,910.323,449.455,37.68]
["Total",66291.086,940.711,8063.864,76.415]

{"sheet":"NMT and Stormwater","index":4,"n_rows":13,"n_cols":5,"rows_kept":13,"hidden":true,"merged":[[0,0,0,2]]}
["NMT 2.2M WIDE"]
["150mm C4"]
["150mm Rip and Recompact"]
["Fig 12 kerb"]
[]
[]
[]
["Soshanguve Stormwater"]
["Description/pipe size","Length",null,"Type","No."]
["1050mm",186.23,null,"KI",47]
["900mm",223.83,null,"MH",13]
["750mm",1450,null,null,{"$f":"E10+E11","v":60}]
["600mm",1230]

{"sheet":"Section 001","index":5,"n_rows":68,"n_cols":6,"rows_kept":68,"merged":[[39,0,39,4],[41,0,41,3],[41,4,41,5],[42,0,42,3],[42,4,42,5],[45,0,45,4],[65,0,65,4],[67,0,67,3],[67,4,67,5],[68,0,68,3],[68,4,68,5]]}
["ITEM","DESCRIPTION","UNIT","QTY","RATE","AMOUNT"]
[]
["SERIES 0","GENERAL"]
[]
["Section 001","General Requirements and Charges"]
[]
["001.01","Preliminary and General Charges"]
[]
["001.01.01","Fixed charges ","lump sum",1,null,{"$f":"IF(TRIM(D9)=\"rate only\",\"ro\",IF(OR(ISBLANK(D9),ISBLANK(E9)),\" \",D9*E9))","v":" "}]
[]
["001.01.02","Time-related charges","Months",12,null,{"$f":"IF(TRIM(D11)=\"rate only\",\"ro\",IF(OR(ISBLANK(D11),ISBLANK(E11)),\" \",D11*E11))","v":" "}]
[]
["001.02","Locating Existing Services","lump sum",1,null,{"$f":"IF(TRIM(D13)=\"rate only\",\"ro\",IF(OR(ISBLANK(D13),ISBLANK(E13)),\" \",D13*E13))","v":" "}]
[]
["LI 001.03","Excavate by hand to expose existing "]
[null,"services and backfill","m³",{"$f":"762.82/2","v":{"v":381.41,"d":"381"}},null,{"$f":"IF(TRIM(D16)=\"rate only\",\"ro\",IF(OR(ISBLANK(D16),ISBLANK(E16)),\" \",D16*E16))","v":" "}]
[]
["B001","Relocating of existing services","lump sum",1,null,{"$f":"IF(TRIM(D18)=\"rate only\",\"ro\",IF(OR(ISBLANK(D18),ISBLANK(E18)),\" \",D18*E18))","v":" "}]
[]
["001.04","Compliance with the Occupational"]
[null,"Health and Safety Act and applicable"]
[null,"regulations"]
[]
["001.04.01","Provision of a Health and Safety Plan","lump sum",1,null,{"$f":"IF(TRIM(D24)=\"rate only\",\"ro\",IF(OR(ISBLANK(D24),ISBLANK(E24)),\" \",D24*E24))","v":" "}]
[]
["001.04.02","Provision of a Health and Safety File","lump sum",1,null,{"$f":"IF(TRIM(D26)=\"rate only\",\"ro\",IF(OR(ISBLANK(D26),ISBLANK(E26)),\" \",D26*E26))","v":" "}]
[]
["001.04.04","Provision of a safety officer-"]
[]
["001.04.04.02","Full time","pm",12,null,{"$f":"IF(TRIM(D30)=\"rate only\",\"ro\",IF(OR(ISBLANK(D30),ISBLANK(E30)),\" \",D30*E30))","v":" "}]
[]
["001.04.05","Health and safety training","lump sum",1,null,{"$f":"E32*D32","v":{"v":0,"d":"R 0.00"}}]
[]
["B001.04.06","Acredited (CETA) Training"]
[]
["B001.04.06,01","Acredited Training for Labourers","Prov sum",1,{"v":200000,"d":"R 200,000.00"},{"$f":"E36*D36","v":{"v":200000,"d":"R 200,000.00"}}]
[]
["B001.04.06.02","Percentage on item B001.04.06 for","%",{"$f":"F36","v":{"v":200000,"d":"R200,000.00"}}]
[]
["TOTAL CARRIED FORWARD"]
[]
["Signature of person authorised to sign the tender:",{"$nulls":3},"Date"]
[]
[]
["ITEM","DESCRIPTION","UNIT","QTY","RATE","AMOUNT"]
["TOTAL BROUGHT FORWARD",{"$nulls":4},{"$f":"F40","v":{"v":0,"d":"R 0.00"}}]
[]
["001.04.06","Provision of personal protective"]
[null,"clothing and equipment","lump sum",1,null,{"$f":"E49*D49","v":{"v":0,"d":"0.00"}}]
[]
["001.04.07","Provision of safety fences, signs and"]
[null,"barricades","lump sum",1,null,{"$f":"E52*D52","v":{"v":0,"d":"0.00"}}]
[]
["B001.05","Community liaison officer"]
[]
["B001.05.01","Monthly Wage","month",12,{"v":16928,"d":"16,928.00"},{"$f":"E56*D56","v":{"v":203136,"d":"203,136.00"}}]
[]
["B001.05.02","Percentage on item B001.05.01 for"]
[null,"charges and profit","%",{"$f":"F56","v":{"v":203136,"d":"R203,136.00"}},null,{"$f":"IF(TRIM(D59)=\"rate only\",\"ro\",IF(OR(ISBLANK(D59),ISBLANK(E59)),\" \",D59*E59))","v":" "}]
[]
[]
["B001.06","Contract Notice Board","no",2,null,{"$f":"IF(TRIM(D62)=\"rate only\",\"ro\",IF(OR(ISBLANK(D62),ISBLANK(E62)),\" \",D62*E62))","v":" "}]
[null,"(See Drawing STD-001)"]
[]
[]
["TOTAL CARRIED TO SUMMARY"]
[]
["Signature of person authorised to sign the tender:",{"$nulls":3},"Date"]

{"sheet":"Section 002","index":6,"n_rows":26,"n_cols":6,"rows_kept":26,"merged":[[23,0,23,4],[25,0,25,3],[25,4,25,5],[26,0,26,3],[26,4,26,5]]}
["ITEM","DESCRIPTION","UNIT","QTY","RATE","AMOUNT"]
[]
["SERIES 0","GENERAL"]
[]
["Section 002","Engineer's Accommodation"]
[]
["002.01","Services"]
[]
["002.01.01","Services for offices and laboratories","lump sum",1,null,{"$f":"IF(TRIM(D9)=\"rate only\",\"ro\",IF(OR(ISBLANK(D9),ISBLANK(E9)),\" \",D9*E9))","v":" "}]
[]
["002.01.02","Services for cooking and ablution","lump sum",1,null,{"$f":"IF(TRIM(D11)=\"rate only\",\"ro\",IF(OR(ISBLANK(D11),ISBLANK(E11)),\" \",D11*E11))","v":" "}]
[null,"facilities on Site for the Engineers site"]
[null,"staff"]
[]
["LI 002.02","Treatment and maintenance of areas"]
[null,"surrounding offices","lump sum",1,null,{"$f":"IF(TRIM(D16)=\"rate only\",\"ro\",IF(OR(ISBLANK(D16),ISBLANK(E16)),\" \",D16*E16))","v":" "}]
[]
["002.03","Office and laboratory accommodation","lump sum",1,null,{"$f":"IF(TRIM(D18)=\"rate only\",\"ro\",IF(OR(ISBLANK(D18),ISBLANK(E18)),\" \",D18*E18))","v":" "}]
[]
["002.04","Provision of survey equipment and"]
[null,"assistants","lump sum",1,null,{"$f":"IF(TRIM(D21)=\"rate only\",\"ro\",IF(OR(ISBLANK(D21),ISBLANK(E21)),\" \",D21*E21))","v":" "}]
[]
[]
["TOTAL CARRIED TO SUMMARY",{"$nulls":4},{"$f":"SUM(F2:F23)","v":{"v":0,"d":"R 0.00"}}]
[]
["Signature of person authorised to sign the tender:",{"$nulls":3},"Date"]

{"sheet":"Section 101","index":7,"n_rows":59,"n_cols":6,"rows_kept":59,"merged":[[25,0,25,4],[27,0,27,3],[27,4,27,5],[28,0,28,3],[28,4,28,5],[31,0,31,4],[56,0,56,4],[58,0,58,3],[58,4,58,5],[59,0,59,3],[59,4,59,5]]}
["ITEM","DESCRIPTION","UNIT","QTY","RATE","AMOUNT"]
[]
["SERIES 1","ANCILLARY WORK"]
[]
["Section 101","Site Clearing and Grubbing"]
[]
["101.01","Clearing and grubbing"]
[]
["101.01.01","Areas"]
[]
["LI 101.01.01.01","Clear and grub","m²",{"$f":"1435*10","v":{"v":14350,"d":"14,350"}},null,{"$f":"IF(TRIM(D11)=\"rate only\",\"ro\",IF(OR(ISBLANK(D11),ISBLANK(E11)),\" \",D11*E11))","v":" "}]
[]
["101.02","Cutting and removing large trees"]
[null,"with a girth -"]
[]
["LI 101.02.01","exceeding 1m and up to and","no",1,null,{"$f":"IF(TRIM(D16)=\"rate only\",\"ro\",IF(OR(ISBLANK(D16),ISBLANK(E16)),\" \",D16*E16))","v":" "}]
[null,"including 2m"]
[]
["101.03","Grubbing and the removal of the"]
[null,"stumps and roots of large trees with"]
[null,"girth -"]
[]
["LI 101.03.01","exceeding 1m and up to and","no",1,null,{"$f":"IF(TRIM(D23)=\"rate only\",\"ro\",IF(OR(ISBLANK(D23),ISBLANK(E23)),\" \",D23*E23))","v":" "}]
[null,"including 2m"]
[]
["TOTAL CARRIED FORWARD",{"$nulls":4},{"$f":"SUM(F2:F25)","v":{"v":0,"d":"R 0.00"}}]
[]
["Signature of person authorised to sign the tender:",{"$nulls":3},"Date"]
[]
[]
["ITEM","DESCRIPTION","UNIT","QTY","RATE","AMOUNT"]
["TOTAL BROUGHT FORWARD",{"$nulls":4},{"$f":"F26","v":{"v":0,"d":"R 0.00"}}]
[]
["101.04","Re-clearing of areas (only on the"]
[null,"written instructions of the Engineer)"]
[]
["101.04.01","Strips"]
[]
["LI 101.04.01.01","Width indicated","m",0,null,{"$f":"IF(TRIM(D39)=\"rate only\",\"ro\",IF(OR(ISBLANK(D39),ISBLANK(E39)),\" \",D39*E39))","v":" "}]
[]
["101.04.01.02","Etc for other widths","m","Rate Only",null,{"$f":"IF(TRIM(D41)=\"rate only\",\"ro\",IF(OR(ISBLANK(D41),ISBLANK(E41)),\" \",D41*E41))","v":"ro"}]
[]
[]
["LI 101.04.02","Areas not classified as strips","m²","Rate Only",null,{"$f":"IF(TRIM(D44)=\"rate only\",\"ro\",IF(OR(ISBLANK(D44),ISBLANK(E44)),\" \",D44*E44))","v":"ro"}]
[]
[]
["101.05","Removal and disposal of specific"]
[null,"elements"]
[]
["101.05.02.04","Concrete elements (unreinforced)","m³",5,null,{"$f":"IF(TRIM(D50)=\"rate only\",\"ro\",IF(OR(ISBLANK(D50),ISBLANK(E50)),\" \",D50*E50))","v":" "}]
[]
["101.05.02.05","Concrete elements (reinforced)","m³",50,null,{"$f":"IF(TRIM(D52)=\"rate only\",\"ro\",IF(OR(ISBLANK(D52),ISBLANK(E52)),\" \",D52*E52))","v":" "}]
[]
[]
["101.05.03","Asphalt surfacing","m²",{"$f":"(1435*8)","v":{"v":11480,"d":"11,480"}},null,{"$f":"IF(TRIM(D55)=\"rate only\",\"ro\",IF(OR(ISBLANK(D55),ISBLANK(E55)),\" \",D55*E55))","v":" "}]
[]
["TOTAL CARRIED TO SUMMARY",{"$nulls":4},{"$f":"SUM(F32:F56)","v":{"v":0,"d":"R 0.00"}}]
[]
["Signature of person authorised to sign the tender:",{"$nulls":3},"Date"]

{"sheet":"Section 102","index":8,"n_rows":72,"n_cols":6,"rows_kept":72,"merged":[[11,0,11,4],[13,0,13,3],[13,4,13,5],[14,0,14,3],[14,4,14,5],[17,0,17,4],[40,0,40,4],[42,0,42,3],[42,4,42,5],[43,0,43,3],[43,4,43,5],[46,0,46,4],[69,0,69,4],[71,0,71,3],[71,4,71,5],[72,0,72,3],[72,4,72,5]]}
["ITEM","DESCRIPTION","UNIT","QTY","RATE","AMOUNT"]
[]
["SERIES 1","ANCILLARY WORK"]
[]
["Section 102:","Accommodation of Traffic"]
[]
["102.02.1","Accommodation of traffic and ","m²",{"$f":"1300*7.4","v":{"v":9620,"d":"9,620"}}]
[null,"maintenance of Bypass"]
[]
["102.07","Existing roads used as bypasses","m²",{"$f":"D7","v":{"v":9620,"d":"9,620"}},null,{"$f":"IF(TRIM(D10)=\"rate only\",\"ro\",IF(OR(ISBLANK(D10),ISBLANK(E10)),\" \",D10*E10))","v":" "}]
[]
["TOTAL CARRIED FORWARD",{"$nulls":4},{"$f":"SUM(F5:F11)","v":{"v":0,"d":"R 0.00"}}]
[]
["Signature of person authorised to sign the tender:",{"$nulls":3},"Date"]
[]
[]
["ITEM","DESCRIPTION","UNIT","QTY","RATE","AMOUNT"]
["TOTAL BROUGHT FORWARD",{"$nulls":4},{"$f":"F12","v":{"v":0,"d":"R 0.00"}}]
[]
["102.14","Temporary traffic-control facilities"]
[]
["LI 102.14.01","Flagmen","Lump sum",1,null,{"$f":"IF(TRIM(D22)=\"rate only\",\"ro\",IF(OR(ISBLANK(D22),ISBLANK(E22)),\" \",D22*E22))","v":" "}]
[]
["102.14.02","Portable Stop and Go signs","no",2,null,{"$f":"IF(TRIM(D24)=\"rate only\",\"ro\",IF(OR(ISBLANK(D24),ISBLANK(E24)),\" \",D24*E24))","v":" "}]
[]
["102.14.03","Amber flashing lights","no",2,null,{"$f":"IF(TRIM(D26)=\"rate only\",\"ro\",IF(OR(ISBLANK(D26),ISBLANK(E26)),\" \",D26*E26))","v":" "}]
[]
["102.14.04","Road signs, TR-series, 1200mm in"]
[null,"diameter or 900mm x 675mm if"]
[null,"rectangular","no",15,null,{"$f":"IF(TRIM(D30)=\"rate only\",\"ro\",IF(OR(ISBLANK(D30),ISBLANK(E30)),\" \",D30*E30))","v":" "}]
[]
["102.14.05","Road signs, TW-series, 1524mm"]
[null,"sides","no",15,null,{"$f":"IF(TRIM(D33)=\"rate only\",\"ro\",IF(OR(ISBLANK(D33),ISBLANK(E33)),\" \",D33*E33))","v":" "}]
[]
["102.14.06","Road signs, TG-series","m²",15,null,{"$f":"IF(TRIM(D35)=\"rate only\",\"ro\",IF(OR(ISBLANK(D35),ISBLANK(E35)),\" \",D35*E35))","v":" "}]
[]
["102.14.07","Danger plates and delineators","no",{"$f":"1435/20","v":{"v":71.75,"d":"72"}},null,{"$f":"IF(TRIM(D37)=\"rate only\",\"ro\",IF(OR(ISBLANK(D37),ISBLANK(E37)),\" \",D37*E37))","v":" "}]
[]
[]
[]
["TOTAL CARRIED FORWARD",{"$nulls":4},{"$f":"SUM(F17:F40)","v":{"v":0,"d":"R 0.00"}}]
[]
["Signature of person authorised to sign the tender:",{"$nulls":3},"Date"]
[]
[]
["ITEM","DESCRIPTION","UNIT","QTY","RATE","AMOUNT"]
["TOTAL BROUGHT FORWARD",{"$nulls":4},{"$f":"F41","v":{"v":0,"d":"R 0.00"}}]
[]
["102.14.08","Moveable barricade / road sign"]
[null,"combination","no",5,null,{"$f":"IF(TRIM(D50)=\"rate only\",\"ro\",IF(OR(ISBLANK(D50),ISBLANK(E50)),\" \",D50*E50))","v":" "}]
[]
["102.14.09","Traffic cones","lump sum",1,null,{"$f":"IF(TRIM(D52)=\"rate only\",\"ro\",IF(OR(ISBLANK(D52),ISBLANK(E52)),\" \",D52*E52))","v":" "}]
[]
["102.14.10","Plastic New Jersey barrier","no",{"$f":"1435/30","v":{"v":47.833333333333336,"d":"48"}},null,{"$f":"IF(TRIM(D54)=\"rate only\",\"ro\",IF(OR(ISBLANK(D54),ISBLANK(E54)),\" \",D54*E54))","v":" "}]
[]
["102.15","Re-use or removal of traffic-control"]
[null,"facilities"]
[]
["102.15.01","Amber flicker lights","no",{"$f":"D26","v":2},null,{"$f":"IF(TRIM(D59)=\"rate only\",\"ro\",IF(OR(ISBLANK(D59),ISBLANK(E59)),\" \",D59*E59))","v":" "}]
[]
["102.15.02","Road signs, TR and TW series","no",15,null,{"$f":"IF(TRIM(D61)=\"rate only\",\"ro\",IF(OR(ISBLANK(D61),ISBLANK(E61)),\" \",D61*E61))","v":" "}]
[]
["102.15.03","Road signs, TG-series","no",15,null,{"$f":"IF(TRIM(D63)=\"rate only\",\"ro\",IF(OR(ISBLANK(D63),ISBLANK(E63)),\" \",D63*E63))","v":" "}]
[]
["102.15.04","Danger plates and delineators","no",{"$f":"1435/20","v":{"v":71.75,"d":"72"}},null,{"$f":"IF(TRIM(D65)=\"rate only\",\"ro\",IF(OR(ISBLANK(D65),ISBLANK(E65)),\" \",D65*E65))","v":" "}]
[]
["102.15.05","Plastic New Jersey barrier","no",48,null,{"$f":"IF(TRIM(D67)=\"rate only\",\"ro\",IF(OR(ISBLANK(D67),ISBLANK(E67)),\" \",D67*E67))","v":" "}]
[]
[]
["TOTAL CARRIED TO SUMMARY",{"$nulls":4},{"$f":"SUM(F47:F69)","v":{"v":0,"d":"R 0.00"}}]
[]
["Signature of person authorised to sign the tender:",{"$nulls":3},"Date"]

{"sheet":"Section 103","index":9,"n_rows":24,"n_cols":6,"rows_kept":24,"merged":[[21,0,21,4],[23,0,23,3],[23,4,23,5],[24,0,24,3],[24,4,24,5]]}
["ITEM","DESCRIPTION","UNIT","QTY","RATE","AMOUNT"]
[]
["SERIES 1","ANCILLARY WORK"]
[]
["Section 103","Overhaul"]
[]
["103.01","Overhaul on material hauled outside"]
[null,"the defined free-haul boundaries","m³.km",{"$f":"1235*20*0.3*5","v":{"v":37050,"d":"37,050"}},null,{"$f":"IF(TRIM(D8)=\"rate only\",\"ro\",IF(OR(ISBLANK(D8),ISBLANK(E8)),\" \",D8*E8))","v":" "}]
[null,"(Free-haul boundaries will be defined"]
[null,"as 1 km outside the indicated site "]
[null,"boundaries)"]
{"$rows_empty":10}
["TOTAL CARRIED TO SUMMARY",{"$nulls":4},{"$f":"SUM(F2:F21)","v":{"v":0,"d":"R 0.00"}}]
[]
["Signature of person authorised to sign the tender:",{"$nulls":3},"Date"]

{"sheet":"Section 104","index":10,"n_rows":52,"n_cols":6,"rows_kept":52,"merged":[[27,0,27,4],[29,0,29,3],[29,4,29,5],[30,0,30,3],[30,4,30,5],[33,0,33,4],[49,0,49,4],[51,0,51,3],[51,4,51,5],[52,0,52,3],[52,4,52,5]]}
["ITEM","DESCRIPTION","UNIT","QTY","RATE","AMOUNT"]
[]
["SERIES 1","ANCILLARY WORK"]
[]
["Section 104","Landscaping and Grassing"]
[]
["104.01","Trimming"]
[]
["LI 104.01.02","Hand trimming","m²",{"$f":"10*20*3","v":600},null,{"$f":"IF(TRIM(D9)=\"rate only\",\"ro\",IF(ISBLANK(E9),\" \",D9*E9))","v":" "}]
[]
[]
["104.03","Preparing areas for grassing and "]
[null,"ground covers"]
[]
["104.03.01","Scarifying","ha",{"$f":"D9/10000","v":0.06},null,{"$f":"IF(TRIM(D15)=\"rate only\",\"ro\",IF(ISBLANK(E15),\" \",D15*E15))","v":" "}]
[]
["104.03.02","Top soiling on the Site with -"]
[]
["104.03.02.02","Topsoil provided by the Contractor"]
[null,"from other sources (including all"]
[null,"haul)","m³",{"$f":"10*20*3*0.15","v":90},null,{"$f":"IF(TRIM(D21)=\"rate only\",\"ro\",IF(ISBLANK(E21),\" \",D21*E21))","v":" "}]
[]
["104.03.04","Supplying and applying chemical"]
[null,"fertilizers"]
[]
["104.03.04.04","2:3:2 (22)","t",0.5,null,{"$f":"IF(TRIM(D26)=\"rate only\",\"ro\",IF(ISBLANK(E26),\" \",D26*E26))","v":" "}]
[]
["TOTAL CARRIED FORWARD",{"$nulls":4},{"$f":"SUM(F2:F27)","v":{"v":0,"d":"R 0.00"}}]
[]
["Signature of person authorised to sign the tender:",{"$nulls":3},"Date"]
[]
[]
["ITEM","DESCRIPTION","UNIT","QTY","RATE","AMOUNT"]
["TOTAL BROUGHT FORWARD",{"$nulls":4},{"$f":"F28","v":{"v":0,"d":"R 0.00"}}]
[]
["104.04","Grassing"]
[]
["LI 104.04.01","Planting of grass ","ha",{"$f":"D15","v":0.06},null,{"$f":"IF(TRIM(D38)=\"rate only\",\"ro\",IF(ISBLANK(E38),\" \",D38*E38))","v":" "}]
[]
["104.08","Extra work for landscaping","Lump sum",1,null,{"$f":"IF(TRIM(D40)=\"rate only\",\"ro\",IF(ISBLANK(E40),\" \",D40*E40))","v":" "}]
{"$rows_empty":9}
["TOTAL CARRIED TO SUMMARY",{"$nulls":4},{"$f":"SUM(F33:F49)","v":{"v":0,"d":"R 0.00"}}]
[]
["Signature of person authorised to sign the tender:",{"$nulls":3},"Date"]

{"sheet":"Section 105","index":11,"n_rows":155,"n_cols":6,"rows_kept":155,"hidden":true,"merged":[[48,0,48,4],[50,0,50,3],[50,4,50,5],[51,0,51,3],[51,4,51,5],[54,0,54,4],[100,0,100,4],[102,0,102,3],[102,4,102,5],[103,0,103,3],[103,4,103,5],[106,0,106,4],[152,0,152,4],[154,0,154,3],[154,4,154,5],[155,0,155,3],[155,4,155,5]]}
["ITEM","DESCRIPTION","UNIT","QTY","RATE","AMOUNT"]
[]
["SERIES 1","ANCILLARY WORK"]
[]
["Section 105","Fencing"]
[]
["105.01","Supply and erection of new fencing"]
[null,"material"]
[]
["LI 105.01.01","Barbed wire (Single strand oval with"]
[null,"4 barbs, 3.15mm/2.5 line diameter,"]
[null,"1.90mm barb diameter, min 1050 Mpa"]
[null,"tensile strength, bright galvanized)","m","Rate Only",null,{"$f":"IF(TRIM(D13)=\"rate only\",\"ro\",IF(OR(ISBLANK(D13),ISBLANK(E13)),\" \",D13*E13))","v":"ro"}]
[]
["105.01.02","Smooth wire"]
[]
["LI 105.01.02.01","Mild-steel wire, 4.00mm diameter,"]
[null,"fully galvanised","m","Rate Only",null,{"$f":"IF(TRIM(D18)=\"rate only\",\"ro\",IF(ISBLANK(E18),\" \",D18*E18))","v":"ro"}]
[]
["LI 105.01.02.02","High strain wire, 2.24mm diameter,"]
[null,"fully galvanised","m","Rate Only",null,{"$f":"IF(TRIM(D21)=\"rate only\",\"ro\",IF(ISBLANK(E21),\" \",D21*E21))","v":"ro"}]
[]
[]
["105.01.03","Barbed tape security barriers"]
[]
["105.01.03.01","Concertina coil -"]
[]
["LI 105.01.03.01.01","Short barb, 900mm coil, galvanised","m","Rate Only",null,{"$f":"IF(TRIM(D28)=\"rate only\",\"ro\",IF(ISBLANK(E28),\" \",D28*E28))","v":"ro"}]
[]
["LI 105.01.03.01.02","Short barb, 730mm coil, galvanised","m","Rate Only",null,{"$f":"IF(TRIM(D30)=\"rate only\",\"ro\",IF(ISBLANK(E30),\" \",D30*E30))","v":"ro"}]
[]
["LI 105.01.03.01.03","Short barb, 450mm coil, galvanised","m","Rate Only",null,{"$f":"IF(TRIM(D32)=\"rate only\",\"ro\",IF(ISBLANK(E32),\" \",D32*E32))","v":"ro"}]
[]
["LI 105.01.03.01.04","Medium barb, 900mm coil, galvanised","m","Rate Only",null,{"$f":"IF(TRIM(D34)=\"rate only\",\"ro\",IF(ISBLANK(E34),\" \",D34*E34))","v":"ro"}]
[]
["LI 105.01.03.01.05","Medium barb, 730mm coil, galvanised","m","Rate Only",null,{"$f":"IF(TRIM(D36)=\"rate only\",\"ro\",IF(ISBLANK(E36),\" \",D36*E36))","v":"ro"}]
[]
["LI 105.01.03.01.06","Medium barb, 450mm coil, galvanised","m","Rate Only",null,{"$f":"IF(TRIM(D38)=\"rate only\",\"ro\",IF(ISBLANK(E38),\" \",D38*E38))","v":"ro"}]
[]
[]
["105.01.03.02","Flat wrap -"]
[]
["LI 105.01.03.02.01","Short barb, 900mm coil, galvanised","m","Rate Only",null,{"$f":"IF(TRIM(D43)=\"rate only\",\"ro\",IF(ISBLANK(E43),\" \",D43*E43))","v":"ro"}]
[]
["LI 105.01.03.02.02","Short barb, 730mm coil, galvanised","m","Rate Only",null,{"$f":"IF(TRIM(D45)=\"rate only\",\"ro\",IF(ISBLANK(E45),\" \",D45*E45))","v":"ro"}]
[]
["LI 105.01.03.02.03","Short barb, 450mm coil, galvanised","m","Rate Only",null,{"$f":"IF(TRIM(D47)=\"rate only\",\"ro\",IF(ISBLANK(E47),\" \",D47*E47))","v":"ro"}]
[]
["TOTAL CARRIED FORWARD",{"$nulls":4},{"$f":"SUM(F2:F48)","v":{"v":0,"d":"R 0.00"}}]
[]
["Signature of person authorised to sign the tender:",{"$nulls":3},"Date"]
[]
[]
["ITEM","DESCRIPTION","UNIT","QTY","RATE","AMOUNT"]
["TOTAL BROUGHT FORWARD",{"$nulls":4},{"$f":"F49","v":{"v":0,"d":"R 0.00"}}]
[]
["LI 105.01.03.02.04","Medium barb, 900mm coil, galvanised","m","Rate Only",null,{"$f":"IF(TRIM(D57)=\"rate only\",\"ro\",IF(ISBLANK(E57),\" \",D57*E57))","v":"ro"}]
[]
["LI 105.01.03.02.05","Medium barb, 730mm coil, galvanised","m","Rate Only",null,{"$f":"IF(TRIM(D59)=\"rate only\",\"ro\",IF(ISBLANK(E59),\" \",D59*E59))","v":"ro"}]
[]
["LI 105.01.03.02.06","Medium barb, 450mm coil, galvanised","m","Rate Only",null,{"$f":"IF(TRIM(D61)=\"rate only\",\"ro\",IF(ISBLANK(E61),\" \",D61*E61))","v":"ro"}]
[]
[]
["105.01.04","Diamond mesh"]
[]
["LI 105.01.04.01","37mm x 2.5mm","m²","Rate Only",null,{"$f":"IF(TRIM(D66)=\"rate only\",\"ro\",IF(ISBLANK(E66),\" \",D66*E66))","v":"ro"}]
[]
["LI 105.01.04.02","50mm x 2.5mm","m²","Rate Only",null,{"$f":"IF(TRIM(D68)=\"rate only\",\"ro\",IF(ISBLANK(E68),\" \",D68*E68))","v":"ro"}]
[]
["LI 105.01.04.03","64mm x 2.5mm","m²","Rate Only",null,{"$f":"IF(TRIM(D70)=\"rate only\",\"ro\",IF(ISBLANK(E70),\" \",D70*E70))","v":"ro"}]
[]
[]
["105.01.06","Corner, end, straining and gate posts,"]
[null,"including anchors"]
[null,"(See Drawing STD-014 Sheet 1 of 3)"]
[]
["105.01.06.01","Standard Post","no","Rate Only",null,{"$f":"IF(TRIM(D77)=\"rate only\",\"ro\",IF(ISBLANK(E77),\" \",D77*E77))","v":"ro"}]
[]
["LI 105.01.06.01.01","Straining Post","no","Rate Only",null,{"$f":"IF(TRIM(D79)=\"rate only\",\"ro\",IF(ISBLANK(E79),\" \",D79*E79))","v":"ro"}]
[]
["LI 105.01.06.01.02","Corner Post","no","Rate Only",null,{"$f":"IF(TRIM(D81)=\"rate only\",\"ro\",IF(ISBLANK(E81),\" \",D81*E81))","v":"ro"}]
[]
["LI 105.01.06.01.03","Gate Post (Double Leaf Gate)","no","Rate Only",null,{"$f":"IF(TRIM(D83)=\"rate only\",\"ro\",IF(ISBLANK(E83),\" \",D83*E83))","v":"ro"}]
[]
["LI 105.01.06.01.04","Gate Post (Single Leaf Gate)","no","Rate Only",null,{"$f":"IF(TRIM(D85)=\"rate only\",\"ro\",IF(ISBLANK(E85),\" \",D85*E85))","v":"ro"}]
[]
["LI 105.01.06.01.05","Gate Post (Pedestrian Gate)","no","Rate Only",null,{"$f":"IF(TRIM(D87)=\"rate only\",\"ro\",IF(ISBLANK(E87),\" \",D87*E87))","v":"ro"}]
[]
[]
["105.02","New gates"]
[null,"(See Drawing STD-014 Sheet 1 of 3)"]
[]
["LI 105.02.01","Single Leaf","no","Rate Only",null,{"$f":"IF(TRIM(D93)=\"rate only\",\"ro\",IF(ISBLANK(E93),\" \",D93*E93))","v":"ro"}]
[]
["LI 105.02.02","Double Leaf","no","Rate Only",null,{"$f":"IF(TRIM(D95)=\"rate only\",\"ro\",IF(ISBLANK(E95),\" \",D95*E95))","v":"ro"}]
[]
["LI 105.02.03","Pedistrian","no","Rate Only",null,{"$f":"IF(TRIM(D97)=\"rate only\",\"ro\",IF(ISBLANK(E97),\" \",D97*E97))","v":"ro"}]
[]
[]
[]
["TOTAL CARRIED FORWARD",{"$nulls":4},{"$f":"SUM(F55:F100)","v":{"v":0,"d":"R 0.00"}}]
[]
["Signature of person authorised to sign the tender:",{"$nulls":3},"Date"]
[]
[]
["ITEM","DESCRIPTION","UNIT","QTY","RATE","AMOUNT"]
["TOTAL BROUGHT FORWARD",{"$nulls":4},{"$f":"F101","v":{"v":0,"d":"R 0.00"}}]
[]
["105.03","Moving of existing fences and gates"]
[]
["105.03.01","Fences:"]
[]
["LI 105.03.01.01","Ordinary Fences","m","Rate Only",null,{"$f":"IF(TRIM(D113)=\"rate only\",\"ro\",IF(ISBLANK(E113),\" \",D113*E113))","v":"ro"}]
[]
["LI 105.03.01.02","Security Fences","m","Rate Only",null,{"$f":"IF(TRIM(D115)=\"rate only\",\"ro\",IF(ISBLANK(E115),\" \",D115*E115))","v":"ro"}]
[]
[]
["LI 105.03.02","Gates","no","Rate Only",null,{"$f":"IF(TRIM(D118)=\"rate only\",\"ro\",IF(ISBLANK(E118),\" \",D118*E118))","v":"ro"}]
[]
[]
["LI 105.04","Dismanteling of existing fences","m","Rate Only",null,{"$f":"IF(TRIM(D121)=\"rate only\",\"ro\",IF(ISBLANK(E121),\" \",D121*E121))","v":"ro"}]
[]
["105.06","Provision of temporary fencing"]
[]
["LI 105.06.01","Ordinary","m","Rate Only",null,{"$f":"IF(TRIM(D125)=\"rate only\",\"ro\",IF(ISBLANK(E125),\" \",D125*E125))","v":"ro"}]
[]
["LI 105.06.02","Security","m","Rate Only",null,{"$f":"IF(TRIM(D127)=\"rate only\",\"ro\",IF(ISBLANK(E127),\" \",D127*E127))","v":"ro"}]
[]
[]
["105.07","Ring bolts for anchoring fencing to"]
[null,"structures","no","Rate Only",null,{"$f":"IF(TRIM(D131)=\"rate only\",\"ro\",IF(ISBLANK(E131),\" \",D131*E131))","v":"ro"}]
{"$rows_empty":21}
["TOTAL CARRIED TO SUMMARY",{"$nulls":4},{"$f":"SUM(F107:F152)","v":{"v":0,"d":"R 0.00"}}]
[]
["Signature of person authorised to sign the tender:",{"$nulls":3},"Date"]

{"sheet":"Section B107","index":12,"n_rows":60,"n_cols":6,"rows_kept":60,"merged":[[39,0,39,4],[41,0,41,3],[41,4,41,5],[42,0,42,3],[42,4,42,5],[45,0,45,4],[57,0,57,4],[59,0,59,3],[59,4,59,5],[60,0,60,3],[60,4,60,5]]}
["ITEM","DESCRIPTION","UNIT","QTY","RATE","AMOUNT"]
[]
["SERIES 1","ANCILLARY WORK"]
[]
["Section B107","Dayworks"]
[]
["B107.01","Labour during normal working hours "]
[]
["B107.01.01","Unskilled labour","h",40,null,{"$f":"IF(TRIM(D9)=\"rate only\",\"ro\",IF(OR(ISBLANK(D9),ISBLANK(E9)),\" \",D9*E9))","v":" "}]
[]
["B107.01.02","Semi-skilled labour","h",40,null,{"$f":"IF(TRIM(D11)=\"rate only\",\"ro\",IF(ISBLANK(E11),\" \",D11*E11))","v":" "}]
[]
["B107.01.03","Skilled labour","h",40,null,{"$f":"IF(TRIM(D13)=\"rate only\",\"ro\",IF(ISBLANK(E13),\" \",D13*E13))","v":" "}]
[]
[]
["B107.02","Extra-over item B107.02 for charges"]
[null,"and overheads"]
[]
["B107.02.01","Unskilled labour","%",{"$f":"F9","v":" "},null,{"$f":"IF(TRIM(D19)=\"rate only\",\"ro\",IF(ISBLANK(E19),\" \",D19*E19))","v":" "}]
[]
["B107.02.02","Semi-skilled labour","%",{"$f":"F11","v":" "},null,{"$f":"IF(TRIM(D21)=\"rate only\",\"ro\",IF(ISBLANK(E21),\" \",D21*E21))","v":" "}]
[]
["B107.02.03","Skilled labour","%",{"$f":"F13","v":" "},null,{"$f":"IF(TRIM(D23)=\"rate only\",\"ro\",IF(ISBLANK(E23),\" \",D23*E23))","v":" "}]
[]
["B107.03","Construction Plant"]
[]
["B107.03.01","Tipper trucks"]
[]
["B107.03.01.01","6m³ capacity","h",40,null,{"$f":"IF(TRIM(D29)=\"rate only\",\"ro\",IF(ISBLANK(E29),\" \",D29*E29))","v":" "}]
[]
["B107.03.01.02","10m³ capacity","h",40,null,{"$f":"IF(TRIM(D31)=\"rate only\",\"ro\",IF(ISBLANK(E31),\" \",D31*E31))","v":" "}]
[]
["B107.03.02","Backhoe loaders (Mass 7 - 8 ton)","h",{"$f":"D29","v":40},null,{"$f":"IF(TRIM(D33)=\"rate only\",\"ro\",IF(ISBLANK(E33),\" \",D33*E33))","v":" "}]
[]
["B107.03.04","Tracked Excavator (Mass 18 - 22 ton,"]
[null,"Power 70 - 105 kW)","h",{"$f":"D29","v":40},null,{"$f":"IF(TRIM(D36)=\"rate only\",\"ro\",IF(ISBLANK(E36),\" \",D36*E36))","v":" "}]
[]
["B107.03.06","Grader (Mass 16 - 20 ton)","h",40,null,{"$f":"IF(TRIM(D38)=\"rate only\",\"ro\",IF(ISBLANK(E38),\" \",D38*E38))","v":" "}]
[]
["TOTAL CARRIED FORWARD",{"$nulls":4},{"$f":"SUM(F2:F39)","v":{"v":0,"d":"R 0.00"}}]
[]
["Signature of person authorised to sign the tender:",{"$nulls":3},"Date"]
[]
[]
["ITEM","DESCRIPTION","UNIT","QTY","RATE","AMOUNT"]
["TOTAL BROUGHT FORWARD",{"$nulls":4},{"$f":"F40","v":{"v":0,"d":"R 0.00"}}]
[]
["B107.03.09","Rollers"]
[]
["B107.03.09.01","Pneumatic Roller (14 - 21 ton)","h",{"$f":"D29","v":40},null,{"$f":"IF(TRIM(D50)=\"rate only\",\"ro\",IF(ISBLANK(E50),\" \",D50*E50))","v":" "}]
[]
["B107.03.09.03","Single drum vibratory padfoot roller"]
[null,"(10 - 14 ton)","h",38,null,{"$f":"IF(TRIM(D53)=\"rate only\",\"ro\",IF(ISBLANK(E53),\" \",D53*E53))","v":" "}]
[]
["B107.03.09.05","Single drum vibratory smooth roller"]
[null,"(10 - 14 ton)","h",38,null,{"$f":"IF(TRIM(D56)=\"rate only\",\"ro\",IF(ISBLANK(E56),\" \",D56*E56))","v":" "}]
[]
["TOTAL CARRIED TO SUMMARY",{"$nulls":4},{"$f":"SUM(F57:F57)","v":{"v":0,"d":"R 0.00"}}]
[]
["Signature of person authorised to sign the tender:",{"$nulls":3},"Date"]

{"sheet":"Section 201","index":13,"n_rows":30,"n_cols":6,"rows_kept":30,"merged":[[27,0,27,4],[29,0,29,3],[29,4,29,5],[30,0,30,3],[30,4,30,5]]}
["ITEM","DESCRIPTION","UNIT","QTY","RATE","AMOUNT"]
[]
["SERIES 2","EARTHWORKS"]
[]
["Section 201","General"]
[]
["201.02","Temporary stockpiling of material","m³",{"$f":"1235*8*0.3","v":{"v":2964,"d":"2,964"}},null,{"$f":"D7*E7","v":{"v":0,"d":"R 0.00"}}]
{"$rows_empty":20}
["TOTAL CARRIED TO SUMMARY",{"$nulls":4},{"$f":"SUM(F2:F27)","v":{"v":0,"d":"R 0.00"}}]
[]
["Signature of person authorised to sign the tender:",{"$nulls":3},"Date"]

{"sheet":"Section 202","index":14,"n_rows":96,"n_cols":6,"rows_kept":96,"merged":[[15,0,15,4],[17,0,17,3],[17,4,17,5],[18,0,18,3],[18,4,18,5],[21,0,21,4],[54,0,54,4],[56,0,56,3],[56,4,56,5],[57,0,57,3],[57,4,57,5],[60,0,60,4],[93,0,93,4],[95,0,95,3],[95,4,95,5],[96,0,96,3],[96,4,96,5]]}
["ITEM","DESCRIPTION","UNIT","QTY","RATE","AMOUNT"]
[]
["SERIES 2","EARTHWORKS"]
[]
["Section 202","Trenching"]
[]
["202.01","Trench excavation"]
[]
["202.01.02","Over 1,0 m and up to 2,0 m wide"]
[]
["202.01.02.02","Over 1,0m deep and up to 1,5m deep","m³",216,null,{"$f":"IF(TRIM(D11)=\"rate only\",\"ro\",IF(ISBLANK(E11),\" \",D11*E11))","v":" "}]
[]
["202.01.02.03","Over 1,5m deep and up to 2,0m deep","m³",{"$f":"761.58*1.5*2+70*10*2","v":{"v":3684.7400000000002,"d":"3,685"}},null,{"$f":"IF(TRIM(D13)=\"rate only\",\"ro\",IF(ISBLANK(E13),\" \",D13*E13))","v":" "}]
[]
[]
["TOTAL CARRIED FORWARD",{"$nulls":4},{"$f":"SUM(F2:F15)","v":{"v":0,"d":"R 0.00"}}]
[]
["Signature of person authorised to sign the tender:",{"$nulls":3},"Date"]
[]
[]
["ITEM","DESCRIPTION","UNIT","QTY","RATE","AMOUNT"]
["TOTAL BROUGHT FORWARD",{"$nulls":4},{"$f":"F16","v":{"v":0,"d":"R 0.00"}}]
[]
["202.02","Extra over items 202.01, 202.03 and"]
[null,"202.09 for excavating in -"]
[]
["202.02.01","Intermediate material","m³",{"$f":"50%*SUM(D10:D13)","v":{"v":1950.3700000000001,"d":"1,950"}},null,{"$f":"IF(TRIM(D27)=\"rate only\",\"ro\",IF(ISBLANK(E27),\" \",D27*E27))","v":" "}]
[]
["202.02.02","Hard material","m³",{"$f":"SUM(D10:D13)*30%","v":{"v":1170.222,"d":"1,170"}},null,{"$f":"IF(TRIM(D29)=\"rate only\",\"ro\",IF(ISBLANK(E29),\" \",D29*E29))","v":" "}]
[]
["202.04","Hand excavation (extra over item"]
[null,"202.01)","m³",{"$f":"D29*20%","v":{"v":234.0444,"d":"234"}},null,{"$f":"IF(TRIM(D32)=\"rate only\",\"ro\",IF(ISBLANK(E32),\" \",D32*E32))","v":" "}]
[]
["202.06","The backfilling of trenches (excluding"]
[null,"the backfill around the pipe barrel)"]
[null,"with material obtained from"]
[null,"excavations","m³",{"$f":"D13*80%*1.1","v":{"v":3242.5712000000008,"d":"3,243"}},null,{"$f":"IF(TRIM(D37)=\"rate only\",\"ro\",IF(ISBLANK(E37),\" \",D37*E37))","v":" "}]
[]
["202.07","Extra over items 202.06 and 202.13"]
[null,"for using backfill material obtained -"]
[]
["202.07.01","From borrow areas","m³",{"$f":"D37*50%","v":{"v":1621.2856000000004,"d":"1,621"}},null,{"$f":"IF(TRIM(D42)=\"rate only\",\"ro\",IF(ISBLANK(E42),\" \",D42*E42))","v":" "}]
[]
["202.07.02","From sources provided by the"]
[null,"contractor","m³",{"$f":"D37*30%","v":{"v":972.7713600000002,"d":"973"}},null,{"$f":"IF(TRIM(D45)=\"rate only\",\"ro\",IF(ISBLANK(E45),\" \",D45*E45))","v":" "}]
[]
[]
["202.08","Backfilling additional excavations in"]
[null,"trench floor using -"]
[]
["202.08.01","Class 1 : 3  :6 / 19 concrete","m³",50,null,{"$f":"IF(TRIM(D51)=\"rate only\",\"ro\",IF(ISBLANK(E51),\" \",D51*E51))","v":" "}]
[]
["202.08.02","Concrete aggregate, max size 38 mm","m³",2,null,{"$f":"IF(TRIM(D53)=\"rate only\",\"ro\",IF(ISBLANK(E53),\" \",D53*E53))","v":" "}]
[]
["TOTAL CARRIED FORWARD",{"$nulls":4},{"$f":"SUM(F21:F54)","v":{"v":0,"d":"R 0.00"}}]
[]
["Signature of person authorised to sign the tender:",{"$nulls":3},"Date"]
[]
[]
["ITEM","DESCRIPTION","UNIT","QTY","RATE","AMOUNT"]
["TOTAL BROUGHT FORWARD",{"$nulls":4},{"$f":"F55","v":{"v":0,"d":"R 0.00"}}]
[]
["202.10","Removal of spoil material"]
[]
["202.10.02","To dumping areas to be provided by"]
[null,"Contractor","m³",{"$f":"SUM(D10:D14)*20%","v":{"v":780.1480000000001,"d":"780"}},null,{"$f":"IF(TRIM(D66)=\"rate only\",\"ro\",IF(ISBLANK(E66),\" \",D66*E66))","v":" "}]
[]
["202.13","Backfilling trenches with soilcrete","m³",50,null,{"$f":"IF(TRIM(D68)=\"rate only\",\"ro\",IF(ISBLANK(E68),\" \",D68*E68))","v":" "}]
{"$rows_empty":25}
["TOTAL CARRIED TO SUMMARY",{"$nulls":4},{"$f":"SUM(F61:F93)","v":{"v":0,"d":"R 0.00"}}]
[]
["Signature of person authorised to sign the tender:",{"$nulls":3},"Date"]

{"sheet":"Section 203","index":15,"n_rows":101,"n_cols":6,"rows_kept":101,"merged":[[37,0,37,4],[39,0,39,3],[39,4,39,5],[40,0,40,3],[40,4,40,5],[43,0,43,4],[62,0,62,4],[64,0,64,3],[64,4,64,5],[65,0,65,3],[65,4,65,5],[68,0,68,4],[98,0,98,4],[100,0,100,3],[100,4,100,5],[101,0,101,3],[101,4,101,5]]}
["ITEM","DESCRIPTION","UNIT","QTY","RATE","AMOUNT"]
[]
["SERIES 2","EARTHWORKS"]
[]
["Section 203","Mass Earthworks"]
[]
["203.01","Excavation and borrow to fill"]
[]
["203.01.01","Compaction to 90% of modified"]
[null,"AASHTO density","m³",{"$f":"1230*8*0.15","v":{"v":1476,"d":"1,476"}},null,{"$f":"IF(TRIM(D10)=\"rate only\",\"ro\",IF(OR(ISBLANK(D10),ISBLANK(E10)),\" \",D10*E10))","v":" "}]
[]
["203.01.02","Rock-fill processing and compaction","m³",{"$f":"100*10*0.5","v":500},null,{"$f":"IF(TRIM(D12)=\"rate only\",\"ro\",IF(ISBLANK(E12),\" \",D12*E12))","v":" "}]
[]
["203.01.03","Twelve-pass roller compaction","m³",{"$f":"D12","v":500},null,{"$f":"IF(TRIM(D14)=\"rate only\",\"ro\",IF(ISBLANK(E14),\" \",D14*E14))","v":" "}]
[]
["203.02","Extra over item 203.01 for excavating"]
[null,"in "]
[]
["203.02.01","Intermediate material","m³",{"$f":"D10*10%","v":{"v":147.6,"d":"148"}},null,{"$f":"IF(TRIM(D19)=\"rate only\",\"ro\",IF(ISBLANK(E19),\" \",D19*E19))","v":" "}]
[]
["203.02.02","Hard material","m³",{"$f":"D10*20%","v":{"v":295.2,"d":"295"}},null,{"$f":"IF(TRIM(D21)=\"rate only\",\"ro\",IF(ISBLANK(E21),\" \",D21*E21))","v":" "}]
[]
["B203.03","Excavate and stockpiling of -"]
[]
["203.03.01","Soft material","m³",{"v":932.75,"d":"933"},null,{"$f":"IF(TRIM(D25)=\"rate only\",\"ro\",IF(ISBLANK(E25),\" \",D25*E25))","v":" "}]
[]
["203.03.02","Intermediate material","m³",{"v":1865.5,"d":"1,866"},null,{"$f":"IF(TRIM(D27)=\"rate only\",\"ro\",IF(ISBLANK(E27),\" \",D27*E27))","v":" "}]
[]
["203.03.03","Hard material","m³",950,null,{"$f":"IF(TRIM(D29)=\"rate only\",\"ro\",IF(ISBLANK(E29),\" \",D29*E29))","v":" "}]
[]
["203.04","Removal of oversize material","m³",{"$f":"10%*D10","v":{"v":147.6,"d":"148"}},null,{"$f":"IF(TRIM(D31)=\"rate only\",\"ro\",IF(ISBLANK(E31),\" \",D31*E31))","v":" "}]
[]
[]
[]
[]
[]
[]
["TOTAL CARRIED FORWARD",{"$nulls":4},{"$f":"SUM(F2:F37)","v":{"v":0,"d":"R 0.00"}}]
[]
["Signature of person authorised to sign the tender:",{"$nulls":3},"Date"]
[]
[]
["ITEM","DESCRIPTION","UNIT","QTY","RATE","AMOUNT"]
["TOTAL BROUGHT FORWARD",{"$nulls":4},{"$f":"F38","v":{"v":0,"d":"R 0.00"}}]
[]
["203.05","Variations in compactive effort"]
[null,"(applicable to sub item 203.01.03"]
[null,"and item 203.07)"]
[]
["203.05.01","Vibratory rollers","m².pass",{"$f":"100*8.8","v":{"v":880.0000000000001,"d":"880"}},null,{"$f":"IF(TRIM(D50)=\"rate only\",\"ro\",IF(ISBLANK(E50),\" \",D50*E50))","v":" "}]
[]
["203.07","Three-pass roller compaction"]
[]
["203.07.01","Vibratory roller","m².pass",{"$f":"1435*8.8","v":{"v":12628.000000000002,"d":"12,628"}},null,{"$f":"IF(TRIM(D54)=\"rate only\",\"ro\",IF(ISBLANK(E54),\" \",D54*E54))","v":" "}]
[]
["203.08","Preparation and compaction of"]
[null,"construction bed material to 90% of"]
[null,"modified AASHTO density","m³",{"$f":"1435*10*0.2+61","v":{"v":2931,"d":"2,931"}},null,{"$f":"IF(TRIM(D58)=\"rate only\",\"ro\",IF(ISBLANK(E58),\" \",D58*E58))","v":" "}]
[]
["203.09","Material bladed to windrow","m³",{"$f":"D58*30%","v":{"v":879.3,"d":"879"}},null,{"$f":"IF(TRIM(D60)=\"rate only\",\"ro\",IF(ISBLANK(E60),\" \",D60*E60))","v":" "}]
[]
[]
["TOTAL CARRIED FORWARD",{"$nulls":4},{"$f":"SUM(F43:F62)","v":{"v":0,"d":"R 0.00"}}]
[]
["Signature of person authorised to sign the tender:",{"$nulls":3},"Date"]
[]
[]
["ITEM","DESCRIPTION","UNIT","QTY","RATE","AMOUNT"]
["TOTAL BROUGHT FORWARD",{"$nulls":4},{"$f":"F63","v":{"v":0,"d":"R 0.00"}}]
[]
["203.10","In situ treatment of the construction "]
[null,"bed"]
[]
["203.10.01","In situ treatment by ripping","m³",{"$f":"D58","v":{"v":2931,"d":"2,931"}},null,{"$f":"IF(TRIM(D74)=\"rate only\",\"ro\",IF(ISBLANK(E74),\" \",D74*E74))","v":" "}]
[]
["203.11","Finishing off slopes"]
[]
["LI 203.11.01","Excavation slopes","m²",{"v":1500,"d":"1,500"},null,{"$f":"IF(TRIM(D78)=\"rate only\",\"ro\",IF(ISBLANK(E78),\" \",D78*E78))","v":" "}]
[]
["LI 203.11.02","Fill slopes","m²",{"v":1000,"d":"1,000"},null,{"$f":"IF(TRIM(D80)=\"rate only\",\"ro\",IF(ISBLANK(E80),\" \",D80*E80))","v":" "}]
[]
["203.12","Provision of impact roller (extra over"]
[null,"items 203.07)","no",1,null,{"$f":"IF(TRIM(D83)=\"rate only\",\"ro\",IF(ISBLANK(E83),\" \",D83*E83))","v":" "}]
[]
["203.14","Extra over item 203.01 for borrow"]
[null,"material from sources to be"]
[null,"supplied by the Contractor","m³",200,null,{"$f":"IF(TRIM(D87)=\"rate only\",\"ro\",IF(ISBLANK(E87),\" \",D87*E87))","v":" "}]
[]
["203.15","Extra over items 203.03 and 203.04"]
[null,"for disposing of spoil material to sites"]
[null,"to be provided by the Contractor","m³",{"$f":"D31","v":{"v":147.6,"d":"148"}},null,{"$f":"IF(TRIM(D91)=\"rate only\",\"ro\",IF(ISBLANK(E91),\" \",D91*E91))","v":" "}]
{"$rows_empty":7}
["TOTAL CARRIED TO SUMMARY",{"$nulls":4},{"$f":"SUM(F69:F98)","v":{"v":0,"d":"R 0.00"}}]
[]
["Signature of person authorised to sign the tender:",{"$nulls":3},"Date"]

{"sheet":"Section 501","index":16,"n_rows":36,"n_cols":6,"rows_kept":36,"merged":[[35,0,35,4]]}
["ITEM","DESCRIPTION","UNIT","QTY","RATE","AMOUNT"]
[]
["SERIES 5","DRAINAGE AND EROSION"]
[null,"PROTECTION"]
[]
["Section 501","Subsurface Drains and Drainage"]
[null,"Blankets"]
[]
["501.01","Crushed stone"]
[]
["501.01.02","Single-sized crushed stone:"]
[]
["501.01.02.02","19mm nominal aggregate size","m³",{"$f":"100*2*0.3*1.1","v":66},null,{"$f":"IF(TRIM(D13)=\"rate only\",\"ro\",IF(ISBLANK(E13),\" \",D13*E13))","v":" "}]
[]
["501.02","Procuring of filter sand","Lump Sum",1,null,{"$f":"IF(TRIM(D15)=\"rate only\",\"ro\",IF(ISBLANK(E15),\" \",D15*E15))","v":" "}]
[]
["B501.03","Backfill with imported material (min G7)","m³",{"$f":"100*1*0.3","v":30},null,{"$f":"IF(TRIM(D17)=\"rate only\",\"ro\",IF(ISBLANK(E17),\" \",D17*E17))","v":" "}]
[]
["501.04","Geotextiles"]
[]
["501.04.02","Grade A2 (1.6mm thick) ","m²",{"$f":"1.2*100","v":120},null,{"$f":"IF(TRIM(D21)=\"rate only\",\"ro\",IF(ISBLANK(E21),\" \",D21*E21))","v":" "}]
[]
["501.05","Pipes in subsurface drains"]
[]
["501.05.01","OPVC Pipes complete with couplings ","m",100,null,{"$f":"IF(TRIM(D25)=\"rate only\",\"ro\",IF(ISBLANK(E25),\" \",D25*E25))","v":" "}]
[]
["501.07","Concrete outlet structure for"]
[null,"subsurface drains, including "]
[null,"formwork, Class 20/19 concrete","m³",1,null,{"$f":"IF(TRIM(D29)=\"rate only\",\"ro\",IF(ISBLANK(E29),\" \",D29*E29))","v":" "}]
[null,"(See drawing STD-023)"]
[]
["501.08","Concrete caps for subsurface"]
[null,"drain pipes","no",{"$f":"100/50","v":2},null,{"$f":"IF(TRIM(D33)=\"rate only\",\"ro\",IF(ISBLANK(E33),\" \",D33*E33))","v":" "}]
[]
[]
["TOTAL CARRIED TO SUMMARY",{"$nulls":4},{"$f":"SUM(F2:F35)","v":{"v":0,"d":"R 0.00"}}]

{"sheet":"Section 502","index":17,"n_rows":147,"n_cols":6,"rows_kept":147,"merged":[[33,0,33,4],[35,0,35,3],[35,4,35,5],[36,0,36,3],[36,4,36,5],[39,0,39,4],[66,0,66,4],[68,0,68,3],[68,4,68,5],[69,0,69,3],[69,4,69,5],[72,0,72,4],[91,0,91,4],[93,0,93,3],[93,4,93,5],[94,0,94,3],[94,4,94,5],[97,0,97,4],[116,0,116,4],[118,0,118,3],[118,4,118,5],[119,0,119,3],[119,4,119,5],[122,0,122,4],[144,0,144,4],[146,0,146,3],[146,4,146,5],[147,0,147,3],[147,4,147,5]]}
["ITEM","DESCRIPTION","UNIT","QTY","RATE","AMOUNT"]
["SERIES 5","DRAINAGE AND EROSION"]
[null,"PROTECTION"]
[]
["Section 502","Prefabricated Culverts and"]
[null,"Stormwater Sewers"]
[]
["502.01","Backfilling with selected excavated"]
[null,"material compacted to -"]
[]
["502.01.02","93% of modified AASHTO density","m³",{"$f":"('Section 202'!D13+'Section 202'!D11)*80%*1.1","v":{"v":3432.6512000000007,"d":"3,433"}},null,{"$f":"IF(TRIM(D11)=\"rate only\",\"ro\",IF(ISBLANK(E11),\" \",D11*E11))","v":" "}]
[]
["502.02","Supplying and laying of concrete"]
[null,"pipe culverts (type SC-pipes)"]
[]
["502.02.01","Class B bedding / Class 100D"]
[]
["502.02.01.01","600 mm Ø","m",{"$f":"60*2","v":120},null,{"$f":"IF(TRIM(D18)=\"rate only\",\"ro\",IF(ISBLANK(E18),\" \",D18*E18))","v":" "}]
[]
["502.02.02","Class B bedding / Class 75D"]
[]
["502.02.02.02","450 mm Ø","m",{"$f":"46.301+36.481+40.651+40.759+21.066+40.73+38.908+41.48+49.881+34.57","v":{"v":390.82700000000006,"d":"391"}},null,{"$f":"IF(TRIM(D22)=\"rate only\",\"ro\",IF(ISBLANK(E22),\" \",D22*E22))","v":" "}]
[]
["502.02.02.03","525 mm Ø","m",{"$f":"28.377+40.046+41.209","v":{"v":109.632,"d":"110"}},null,{"$f":"IF(TRIM(D24)=\"rate only\",\"ro\",IF(ISBLANK(E24),\" \",D24*E24))","v":" "}]
[]
["502.02.02.04","600 mm Ø","m",{"$f":"39.899+14.842+17.871","v":{"v":72.612,"d":"73"}},null,{"$f":"IF(TRIM(D26)=\"rate only\",\"ro\",IF(ISBLANK(E26),\" \",D26*E26))","v":" "}]
[]
["502.02.02.05","675 mm Ø","m",{"$f":"30.881+30.001","v":{"v":60.882000000000005,"d":"61"}},null,{"$f":"IF(TRIM(D28)=\"rate only\",\"ro\",IF(ISBLANK(E28),\" \",D28*E28))","v":" "}]
[]
["502.02.02.06","750 mm Ø","m",{"$f":"25.57+40.04","v":{"v":65.61,"d":"66"}},null,{"$f":"IF(TRIM(D30)=\"rate only\",\"ro\",IF(ISBLANK(E30),\" \",D30*E30))","v":" "}]
[]
["502.02.02.07","900 mm Ø","m",{"$f":"37.785+24.232","v":{"v":62.016999999999996,"d":"62"}},null,{"$f":"IF(TRIM(D32)=\"rate only\",\"ro\",IF(ISBLANK(E32),\" \",D32*E32))","v":" "}]
[]
["TOTAL CARRIED FORWARD",{"$nulls":4},{"$f":"SUM(F2:F33)","v":{"v":0,"d":"R 0.00"}}]
[]
["Signature of person authorised to sign the tender:",{"$nulls":3},"Date"]
[]
[]
["ITEM","DESCRIPTION","UNIT","QTY","RATE","AMOUNT"]
["TOTAL BROUGHT FORWARD",{"$nulls":4},{"$f":"F34","v":{"v":0,"d":"R 0.00"}}]
[]
["502.06","Supplying and laying portal rectangular"]
[null,"culverts"]
[]
["502.06.01","With precast invert slab"]
[]
["502.06.01.01","1800 mm x 600 mm","m",{"$f":"15+17*2","v":49},null,{"$f":"IF(TRIM(D47)=\"rate only\",\"ro\",IF(ISBLANK(E47),\" \",D47*E47))","v":" "}]
[]
["502.06.01.02","2400 mm x 1200 mm","m",{"$f":"20*2","v":40},null,{"$f":"IF(TRIM(D49)=\"rate only\",\"ro\",IF(ISBLANK(E49),\" \",D49*E49))","v":" "}]
[]
["502.06.01.03","3000 mm x 1200 mm","m",{"$f":"15*2","v":30},null,{"$f":"IF(TRIM(D51)=\"rate only\",\"ro\",IF(ISBLANK(E51),\" \",D51*E51))","v":" "}]
[]
["502.09","Extra over item 502.06 for end"]
[null,"units for portal and rectangular"]
[null,"culverts with a skew of more"]
[null,"than 20°"]
[]
["502.09.01","Complete with precast invert slab"]
[]
["502.09.01.01","1800 mm x 600 mm","m",49,null,{"$f":"IF(TRIM(D60)=\"rate only\",\"ro\",IF(ISBLANK(E60),\" \",D60*E60))","v":" "}]
[]
["502.09.01.02","2400 mm x 1200 mm","m",40,null,{"$f":"IF(TRIM(D62)=\"rate only\",\"ro\",IF(ISBLANK(E62),\" \",D62*E62))","v":" "}]
[]
["502.09.01.03","3000 mm x 1200 mm","m",30,null,{"$f":"IF(TRIM(D64)=\"rate only\",\"ro\",IF(ISBLANK(E64),\" \",D64*E64))","v":" "}]
[]
[]
["TOTAL CARRIED FORWARD",{"$nulls":4},{"$f":"SUM(F40:F66)","v":{"v":0,"d":"R 0.00"}}]
[]
["Signature of person authorised to sign the tender:",{"$nulls":3},"Date"]
[]
[]
["ITEM","DESCRIPTION","UNIT","QTY","RATE","AMOUNT"]
["TOTAL BROUGHT FORWARD",{"$nulls":4},{"$f":"F67","v":{"v":0,"d":"R 0.00"}}]
[]
["B502.10","Cast in situ concrete"]
[]
["B502.10.02","Roof slabs for portal or"]
[null,"rectangular culverts, including"]
[null,"formwork to provide Class F1 surface"]
[null,"finish and Class U2 surface finish"]
[null,"for unformed surfaces"]
[]
["B502.10.02.01","Class 25/19","m³",{"$f":"70*10*0.2","v":140},null,{"$f":"IF(TRIM(D83)=\"rate only\",\"ro\",IF(ISBLANK(E83),\" \",D83*E83))","v":" "}]
[]
["502.10.03","Inlet and outlet structures, catchpits,"]
[null,"manholes and junction boxes"]
[null,"excluding formwork, but including"]
[null,"U2 surface finish"]
[]
["502.10.03.02","Class 25/19","m³",{"$f":"(0.5*1.79*2.81*2*0.2+1.79*10*0.2)*15","v":{"v":68.7897,"d":"69"}},null,{"$f":"IF(TRIM(D90)=\"rate only\",\"ro\",IF(ISBLANK(E90),\" \",D90*E90))","v":" "}]
[]
["TOTAL CARRIED FORWARD",{"$nulls":4},{"$f":"SUM(F73:F91)","v":{"v":0,"d":"R 0.00"}}]
[]
["Signature of person authorised to sign the tender:",{"$nulls":3},"Date"]
[]
[]
["ITEM","DESCRIPTION","UNIT","QTY","RATE","AMOUNT"]
["TOTAL BROUGHT FORWARD",{"$nulls":4},{"$f":"F92","v":{"v":0,"d":"R 0.00"}}]
[]
["502.13","Welded-steel fabric"]
[]
["502.13.03","Reference 888","kg",{"$f":"(0.5*1.79*2.81*2*8.88+1.79*10*8.88)*15","v":{"v":3054.2626800000003,"d":"3,054"}},null,{"$f":"IF(TRIM(D102)=\"rate only\",\"ro\",IF(ISBLANK(E102),\" \",D102*E102))","v":" "}]
[]
["B502.16","Manholes, catchpits, precast inlet and"]
[null,"outlet structures and junction boxes"]
[null,"complete"]
[]
["B502.16.01","Concrete Field inlets "]
[]
[]
["B502.16.01.02","Cast insitu concrete field inlet with concrete ","no",2,null,{"$f":"IF(TRIM(D111)=\"rate only\",\"ro\",IF(ISBLANK(E111),\" \",D111*E111))","v":" "}]
[null,"ditch, stone pitching and silt trap complete"]
[null,"with cover slabs from 1,5m to 2,0m in depth"]
[]
[]
[]
["TOTAL CARRIED FORWARD",{"$nulls":4},{"$f":"SUM(F98:F116)","v":{"v":0,"d":"R 0.00"}}]
[]
["Signature of person authorised to sign the tender:",{"$nulls":3},"Date"]
[]
[]
["ITEM","DESCRIPTION","UNIT","QTY","RATE","AMOUNT"]
["TOTAL BROUGHT FORWARD",{"$nulls":4},{"$f":"F117","v":{"v":0,"d":"R 0.00"}}]
[]
["B502.16.02","Brick Field inlets"]
[]
["B502.16.02.01","Brick inlet field inlet with concrete ditch, ","no",1,null,{"$f":"IF(TRIM(D127)=\"rate only\",\"ro\",IF(ISBLANK(E127),\" \",D127*E127))","v":" "}]
[null,"stone pitching and silt trap complete with"]
[null,"cover slabs from 1m to 1,5m in depth"]
[]
[]
["B502.16.02.02","Brick inlet field inlet with concrete ditch, ","no",42,null,{"$f":"IF(TRIM(D132)=\"rate only\",\"ro\",IF(ISBLANK(E132),\" \",D132*E132))","v":" "}]
[null,"stone pitching and silt trap complete with "]
[null,"cover slabs from 1,5 m to 2,0m in depth"]
[]
["B502.16.02.03","Brick inlet field inlet with concrete ditch, ","no",1,null,{"$f":"IF(TRIM(D136)=\"rate only\",\"ro\",IF(ISBLANK(E136),\" \",D136*E136))","v":" "}]
[null,"stone pitching and silt trap complete with "]
[null,"cover slabs from 2,0m to 2,5m in depth"]
[]
["502.19","Benching","m²",{"$f":"1.5*1.5*15","v":{"v":33.75,"d":"34"}},null,{"$f":"IF(TRIM(D140)=\"rate only\",\"ro\",IF(ISBLANK(E140),\" \",D140*E140))","v":" "}]
[]
[]
[]
[]
["TOTAL CARRIED TO SUMMARY",{"$nulls":4},{"$f":"SUM(F123:F144)","v":{"v":0,"d":"R 0.00"}}]
[]
["Signature of person authorised to sign the tender:",{"$nulls":3},"Date"]

{"sheet":"Section 503","index":18,"n_rows":31,"n_cols":6,"rows_kept":31,"merged":[[28,0,28,4],[30,0,30,3],[30,4,30,5],[31,0,31,3],[31,4,31,5]]}
["ITEM","DESCRIPTION","UNIT","QTY","RATE","AMOUNT"]
[]
["SERIES 5","DRAINAGE AND EROSION"]
[null,"PROTECTION"]
[]
["Section 503","Kerbing and Channelling"]
[]
["503.01","Concrete kerbing Class 20/19"]
[null,"concrete  "]
[null,"(See drawing STD015)"]
[]
["503.01.01","SANS 927 Figure 10","m",{"$f":"18*2","v":36},null,{"$f":"IF(TRIM(D12)=\"rate only\",\"ro\",IF(OR(ISBLANK(D12),ISBLANK(E12)),\" \",D12*E12))","v":" "}]
[]
["503.02","Concrete kerbing-channelling"]
[null,"combination"]
[null,"(See drawing STD007 - STD015)"]
[]
["503.02.02","SANS 927 Barrier kerb (Fig. 3) "]
[null,"with concrete channel","m",{"$f":"51.68*2","v":{"v":103.36,"d":"103"}},null,{"$f":"IF(TRIM(D19)=\"rate only\",\"ro\",IF(ISBLANK(E19),\" \",D19*E19))","v":" "}]
[]
["503.03","Transition sections"]
[null,"(See drawing STD015)"]
[]
["503.03.01","SANS 927 Barrier kerb (Fig. 3)","no",6,{"$f":"E12","v":{"v":0,"d":"R 0.00"}},{"$f":"IF(TRIM(D24)=\"rate only\",\"ro\",IF(ISBLANK(E24),\" \",D24*E24))","v":{"v":0,"d":"R 0.00"}}]
[]
[]
[]
[]
["TOTAL CARRIED TO SUMMARY",{"$nulls":4},{"$f":"SUM(F2:F28)","v":{"v":0,"d":"R 0.00"}}]
[]
["Signature of person authorised to sign the tender:",{"$nulls":3},"Date"]

{"sheet":"Section 504","index":19,"n_rows":90,"n_cols":6,"rows_kept":90,"merged":[[24,0,24,4],[26,0,26,3],[26,4,26,5],[27,0,27,3],[27,4,27,5],[30,0,30,4],[65,0,65,4],[66,0,66,3],[66,4,66,5],[67,0,67,3],[67,4,67,5],[70,0,70,4],[87,0,87,4],[89,0,89,3],[89,4,89,5],[90,0,90,3],[90,4,90,5]]}
["ITEM","DESCRIPTION","UNIT","QTY","RATE","AMOUNT"]
[]
["SERIES 5","DRAINAGE AND EROSION"]
[null,"PROTECTION"]
[]
["Section 504","Open Drains"]
[]
["504.02","Mesh Reinforced Concrete chutes "]
[null,"( Cast insitu 25/19)"]
[]
["504.02.01","Discharge from road to the channel","m",{"$f":"7*20","v":140},null,{"$f":"IF(TRIM(D11)=\"rate only\",\"ro\",IF(OR(ISBLANK(D11),ISBLANK(E11)),\" \",D11*E11))","v":" "}]
[]
["504.04","Channels (Trapezoidal):"]
[]
["504.04.01","Trapezoidal Channel Class 25/19 concrete","m",{"v":1235,"d":"1,235"},null,{"$f":"IF(TRIM(D15)=\"rate only\",\"ro\",IF(ISBLANK(E15),\" \",D15*E15))","v":" "}]
[null,"as per drawing no 6229 PCE (T1)"]
[null,"maximum width of 1300mm and 500mm"]
[null,"deep and 100mm in thickness"]
[null,"with 150mm dia oPVC  filled with no fine "]
[null,"concrete in water logged areas"]
[]
[]
[]
[]
["TOTAL CARRIED FORWARD",{"$nulls":4},{"$f":"SUM(F2:F24)","v":{"v":0,"d":"R 0.00"}}]
[]
["Signature of person authorised to sign the tender:",{"$nulls":3},"Date"]
[]
[]
["ITEM","DESCRIPTION","UNIT","QTY","RATE","AMOUNT"]
["TOTAL BROUGHT FORWARD",{"$nulls":4},{"$f":"F25","v":{"v":0,"d":"R 0.00"}}]
["504.05","Construction of chutes, side drains,"]
[null,"channels, inlet and outlet structures,"]
[null,"transition sections and auxiliary"]
[null,"structures (Measured by components)"]
[]
["504.05.01","Excavation","m³",{"$f":"20*7*1.6*0.2+1435*1.5*2.14","v":{"v":4651.150000000001,"d":"4,651"}},null,{"$f":"IF(TRIM(D37)=\"rate only\",\"ro\",IF(ISBLANK(E37),\" \",D37*E37))","v":" "}]
[]
["504.05.02","Preparation of excavations for concrete-"]
[null,"lined open drains","m²",{"$f":"100*2","v":200},null,{"$f":"IF(TRIM(D40)=\"rate only\",\"ro\",IF(ISBLANK(E40),\" \",D40*E40))","v":" "}]
[]
["504.05.03","Cast in situ concrete for the lining of"]
[null,"of open drains, or open drains"]
[null,"constructed in concrete (concrete class","m³",{"$f":"1000*1.5*0.1","v":150},null,{"$f":"IF(TRIM(D44)=\"rate only\",\"ro\",IF(ISBLANK(E44),\" \",D44*E44))","v":" "}]
[null,"and type of drain stated. Class U2"]
[null,"surface finish)"]
[]
["504.05.04","Formwork for cast in situ concrete"]
[null,"(Class F2 surface finish)"]
[]
["504.05.04.01","To vertical sides of open drains "]
[null,"(formwork on internal face only)","m²",{"$f":"100*0.1*2","v":20},null,{"$f":"IF(TRIM(D52)=\"rate only\",\"ro\",IF(ISBLANK(E52),\" \",D52*E52))","v":" "}]
[]
["504.05.04.02","To sloping sides of open drains (formwork"]
[null," on internal face only)","m²",{"$f":"100*0.1*2","v":20},null,{"$f":"IF(TRIM(D55)=\"rate only\",\"ro\",IF(ISBLANK(E55),\" \",D55*E55))","v":" "}]
[]
["504.05.04.03","To both internal and external faces of"]
[null,"open drain sides (both sides measured)","m²",{"$f":"50*0.1*1.5","v":{"v":7.5,"d":"8"}},null,{"$f":"IF(TRIM(D58)=\"rate only\",\"ro\",IF(ISBLANK(E58),\" \",D58*E58))","v":" "}]
[]
["504.05.04.04","To ends of slabs","m²",{"$f":"7*1.5*0.15","v":{"v":1.575,"d":"2"}},null,{"$f":"IF(TRIM(D60)=\"rate only\",\"ro\",IF(ISBLANK(E60),\" \",D60*E60))","v":" "}]
[]
["504.05.05","Joints in the concrete lining of open drains","m",{"$f":"100/4*1.5","v":{"v":37.5,"d":"38"}},null,{"$f":"IF(TRIM(D62)=\"rate only\",\"ro\",IF(ISBLANK(E62),\" \",D62*E62))","v":" "}]
[]
["504.05.05.01","Void fomer joints in concrete channels","m",{"$f":"100/4*1.5+1435/4*2","v":755},null,{"$f":"IF(TRIM(D64)=\"rate only\",\"ro\",IF(ISBLANK(E64),\" \",D64*E64))","v":" "}]
[null,"and concrete lined drains"]
["TOTAL CARRIED FORWARD",{"$nulls":4},{"$f":"SUM(F30:F65)","v":{"v":0,"d":"R 0.00"}}]
["Signature of person authorised to sign the tender:",{"$nulls":3},"Date"]
[]
[]
["ITEM","DESCRIPTION","UNIT","QTY","RATE","AMOUNT"]
["TOTAL BROUGHT FORWARD",{"$nulls":4},{"$f":"F66","v":{"v":0,"d":"R 0.00"}}]
[]
["504.05.06","Welded-steel fabric"]
[]
["504.05.06.03","Reference 395","kg",{"$f":"100*1.5*3.95+140*1*3.95","v":{"v":1145.5,"d":"1,146"}},null,{"$f":"IF(TRIM(D75)=\"rate only\",\"ro\",IF(ISBLANK(E75),\" \",D75*E75))","v":" "}]
[]
["504.06","Polyethylene sheeting (0,150 mm thick)"]
[null,"for concrete-lined open drains","m²",{"$f":"100*1.7","v":170},null,{"$f":"IF(TRIM(D78)=\"rate only\",\"ro\",IF(ISBLANK(E78),\" \",D78*E78))","v":" "}]
[]
["504.07","Excavation in hard material"]
[null,"(Extra over items 504.01, 504.02"]
[null,"504.03, 504.04 and 504.05)","m³",{"$f":"D37*20%","v":{"v":930.2300000000001,"d":"930"}},null,{"$f":"IF(TRIM(D82)=\"rate only\",\"ro\",IF(ISBLANK(E82),\" \",D82*E82))","v":" "}]
[]
["504.08","Hand excavations (Extra over subitem"]
[null,"504.05.01)","m³",{"$f":"D37*10%","v":{"v":465.11500000000007,"d":"465"}},null,{"$f":"IF(TRIM(D85)=\"rate only\",\"ro\",IF(ISBLANK(E85),\" \",D85*E85))","v":" "}]
[]
[]
["TOTAL CARRIED TO SUMMARY",{"$nulls":4},{"$f":"SUM(F76:F87)","v":{"v":0,"d":"R 0.00"}}]
[]
["Signature of person authorised to sign the tender:",{"$nulls":3},"Date"]

{"sheet":"Section 505","index":20,"n_rows":66,"n_cols":6,"rows_kept":66,"merged":[[30,0,30,4],[32,0,32,3],[32,4,32,5],[33,0,33,3],[33,4,33,5],[36,0,36,4],[63,0,63,4],[65,0,65,3],[65,4,65,5],[66,0,66,3],[66,4,66,5]]}
["ITEM","DESCRIPTION","UNIT","QTY","RATE","AMOUNT"]
[]
["SERIES 5","DRAINAGE AND EROSION"]
[null,"PROTECTION"]
[]
["Section 505","Erosion Protection"]
[]
["505.01","Foundation trench excavation and"]
[null,"backfilling"]
[]
["505.01.02","In all other classes of material","m³",{"$f":"3.006*0.1*0.1*46","v":{"v":1.38276,"d":"1"}},null,{"$f":"IF(TRIM(D11)=\"rate only\",\"ro\",IF(ISBLANK(E11),\" \",D11*E11))","v":" "}]
[]
[]
["LI 505.02","Surface preparation for the bedding"]
[null,"of gabions","m²",{"$f":"3.006*0.5*46","v":{"v":69.13799999999999,"d":"69"}},null,{"$f":"IF(TRIM(D15)=\"rate only\",\"ro\",IF(ISBLANK(E15),\" \",D15*E15))","v":" "}]
[]
["505.03","Gabions"]
[]
["505.03.01","Gabion boxes, mesh type 80 with"]
[null,"2.7mm Class A galvanised wire -"]
[]
["505.03.01.01","1.0m x 1.0m x 1.0m ","m³",{"$f":"0.5*10*0.5*5","v":{"v":12.5,"d":"13"}},null,{"$f":"IF(TRIM(D22)=\"rate only\",\"ro\",IF(ISBLANK(E22),\" \",D22*E22))","v":" "}]
[]
["505.03.02","Gabion matress, mesh type 80 with"]
[null,"2.7mm Class A galvanised wire -"]
[]
["505.03.02.01","6.0m x 0.3m x 0.3m ","m³",{"$f":"6*10*0.3*5","v":90},null,{"$f":"IF(TRIM(D27)=\"rate only\",\"ro\",IF(ISBLANK(E27),\" \",D27*E27))","v":" "}]
[]
[]
[]
["TOTAL CARRIED FORWARD",{"$nulls":4},{"$f":"SUM(F2:F30)","v":{"v":0,"d":"R 0.00"}}]
[]
["Signature of person authorised to sign the tender:",{"$nulls":3},"Date"]
[]
[]
["ITEM","DESCRIPTION","UNIT","QTY","RATE","AMOUNT"]
["TOTAL BROUGHT FORWARD",{"$nulls":4},{"$f":"F31","v":{"v":0,"d":"R 0.00"}}]
[]
[]
["505.04","Extra over item 505.03 for supplying"]
[null,"gabions with PVC-coated wire"]
[]
["505.04.01","3.7mm PVC thickness","m³",{"$f":"D22","v":{"v":12.5,"d":"13"}},null,{"$f":"IF(TRIM(D43)=\"rate only\",\"ro\",IF(ISBLANK(E43),\" \",D43*E43))","v":" "}]
[]
["505.05","Filter fabric for gabions and riprap"]
[]
["505.05.01","Type A4, or U2 (1.6mm thck)","m²",{"$f":"6.6*10.6+1.5*10+0.5*0.5*2","v":{"v":85.46,"d":"85"}},null,{"$f":"IF(TRIM(D47)=\"rate only\",\"ro\",IF(ISBLANK(E47),\" \",D47*E47))","v":" "}]
[]
["505.06","Stone pitching"]
[]
["LI 505.06.02","Grouted pitching","m²",{"$f":"3.006*3.006*46","v":{"v":415.657656,"d":"416"}},null,{"$f":"IF(TRIM(D51)=\"rate only\",\"ro\",IF(ISBLANK(E51),\" \",D51*E51))","v":" "}]
[]
["505.10","Concrete in edge beams and"]
[null,"foundation trenches"]
[]
["505.10.02","Class 25/19 concrete","m³",{"$f":"51*0.15*0.3*2","v":{"v":4.59,"d":"5"}},null,{"$f":"IF(TRIM(D56)=\"rate only\",\"ro\",IF(ISBLANK(E56),\" \",D56*E56))","v":" "}]
{"$rows_empty":7}
["TOTAL CARRIED TO SUMMARY",{"$nulls":4},{"$f":"SUM(F53:F63)","v":{"v":0,"d":"R 0.00"}}]
[]
["Signature of person authorised to sign the tender:",{"$nulls":3},"Date"]

{"sheet":"Section 601","index":21,"n_rows":54,"n_cols":6,"rows_kept":54,"merged":[[26,0,26,4],[28,0,28,3],[28,4,28,5],[29,0,29,3],[29,4,29,5],[32,0,32,4],[51,0,51,4],[53,0,53,3],[53,4,53,5],[54,0,54,3],[54,4,54,5]]}
["ITEM","DESCRIPTION","UNIT","QTY","RATE","AMOUNT"]
[]
["SERIES 6","ROADS AND PARKING AREAS"]
[]
["Section 601","Gravel Pavement Layers"]
[]
[]
["B601.02","Gravel layers constructed from"]
[null,"material obtained from excavations"]
[]
["601.02.01","Subgrade"]
[]
["601.02.01.02","Lower Selected layer compacted to 93% "]
[null,"of modified AASHTO density","m³",{"$f":"1435*10*0.15+61","v":{"v":2213.5,"d":"2,214"}},null,{"$f":"IF(TRIM(D14)=\"rate only\",\"ro\",IF(ISBLANK(E14),\" \",D14*E14))","v":" "}]
[]
["601.02.01.03","Upper Selected Layer compacted to 95% "]
[null,"of modified AASHTO density","m³",{"$f":"D14","v":{"v":2213.5,"d":"2,214"}},{"$f":"E14","v":{"v":0,"d":"R 0.00"}},{"$f":"IF(TRIM(D17)=\"rate only\",\"ro\",IF(ISBLANK(E17),\" \",D17*E17))","v":{"v":0,"d":"R 0.00"}}]
[]
["B601.03","Gravel layers constructed from material"]
[null,"obtained commercial  sources:"]
[]
["601.03.02","C3 Subbase Layer"]
[]
["601.03.02.02","Compacted to 97% of modified"]
[null,"AASHTO density","m³",{"$f":"1435*10*0.2+61","v":{"v":2931,"d":"2,931"}},null,{"$f":"IF(TRIM(D25)=\"rate only\",\"ro\",IF(ISBLANK(E25),\" \",D25*E25))","v":" "}]
[]
["TOTAL CARRIED FORWARD",{"$nulls":4},{"$f":"SUM(F2:F26)","v":{"v":0,"d":"R 0.00"}}]
[]
["Signature of person authorised to sign the tender:",{"$nulls":3},"Date"]
[]
[]
["ITEM","DESCRIPTION","UNIT","QTY","RATE","AMOUNT"]
["TOTAL BROUGHT FORWARD",{"$nulls":4},{"$f":"F27","v":{"v":0,"d":"R 0.00"}}]
[]
["601.04","Extra over item 601.02 for obtaining"]
[null,"material from"]
[]
["601.04.01","Intermediate excavations","m³",{"$f":"'Section 201'!D7*20%","v":{"v":592.8000000000001,"d":"593"}},null,{"$f":"IF(TRIM(D38)=\"rate only\",\"ro\",IF(ISBLANK(E38),\" \",D38*E38))","v":" "}]
[]
["601.04.02","Hard excavations","m³",{"v":1438,"d":"1,438"},null,{"$f":"IF(TRIM(D40)=\"rate only\",\"ro\",IF(ISBLANK(E40),\" \",D40*E40))","v":" "}]
[]
["601.06","Extra over Item 601.02 and 61.03 for using "]
[null,"G5 material material from sources to be "]
[null,"supplied by the Contractor"]
[]
["601.06.02","Subbase"]
[]
["601.06.02.01","Compacted to 95% of modified"]
[null,"AASHTO density","m³",{"$f":"1435*10*0.2+61","v":{"v":2931,"d":"2,931"}},null,{"$f":"IF(TRIM(D49)=\"rate only\",\"ro\",IF(ISBLANK(E49),\" \",D49*E49))","v":" "}]
[]
[]
["TOTAL CARRIED TO SUMMARY",{"$nulls":4},{"$f":"SUM(F33:F51)","v":{"v":0,"d":"R 0.00"}}]
[]
["Signature of person authorised to sign the tender:",{"$nulls":3},"Date"]

{"sheet":"Section 602","index":22,"n_rows":39,"n_cols":6,"rows_kept":39,"merged":[[36,0,36,4],[38,0,38,3],[38,4,38,5],[39,0,39,3],[39,4,39,5]]}
["ITEM","DESCRIPTION","UNIT","QTY","RATE","AMOUNT"]
[]
["SERIES 6","ROADS AND PARKING AREAS"]
[]
["Section 602","Crushed-stone Pavement Layers"]
[]
["602.01","Crushed-stone base constructed"]
[null,"with material obtained from"]
[]
["602.01.01","Commercial sources"]
[]
["602.01.01.01","G1 material compacted to 86% of"]
[null,"Apparent density","m³",{"$f":"1435*6.6*0.15","v":{"v":1420.6499999999999,"d":"1,421"}},null,{"$f":"E13*D13","v":{"v":0,"d":"R 0.00"}}]
[]
["602.04","Additional compaction"]
[]
["602.04.01","Extra over sub items 602.01.01.01","m³",{"$f":"D13","v":{"v":1420.6499999999999,"d":"1,421"}},null,{"$f":"E17*D17","v":{"v":0,"d":"R 0.00"}}]
[null,"602.01.02.01, 602.02.01.01 and"]
[null,"602.02.02.01 for compaction to"]
[null,"88% of apparent density"]
{"$rows_empty":16}
["TOTAL CARRIED TO SUMMARY",{"$nulls":4},{"$f":"SUM(F2:F36)","v":{"v":0,"d":"R 0.00"}}]
[]
["Signature of person authorised to sign the tender:",{"$nulls":3},"Date"]

{"sheet":"Section 603","index":23,"n_rows":27,"n_cols":6,"rows_kept":27,"merged":[[24,0,24,4],[26,0,26,3],[26,4,26,5],[27,0,27,3],[27,4,27,5]]}
["ITEM","DESCRIPTION","UNIT","QTY","RATE","AMOUNT"]
[]
["SERIES 6","ROADS AND PARKING AREAS"]
[]
["Section 603","Unpaved areas"]
[]
["603.01","Compacted gravel shoulder or gravel"]
[null,"wearing course to 93% of modified"]
[null,"AASHTO density"]
[]
["603.01.01","Shoulder","m³",{"$f":"1435*3.5*0.15*2","v":{"v":1506.75,"d":"1,507"}},null,{"$f":"IF(TRIM(D11)=\"rate only\",\"ro\",IF(OR(ISBLANK(D11),ISBLANK(E11)),\" \",D11*E11))","v":" "}]
[]
["B603.02","Extra over Item 603.01 for borrow"]
[null,"material from stockpile to be"]
[null,"supplied by the Contractor","m³",{"$f":"D11","v":{"v":1506.75,"d":"1,507"}},null,{"$f":"IF(TRIM(D15)=\"rate only\",\"ro\",IF(ISBLANK(E15),\" \",D15*E15))","v":" "}]
{"$rows_empty":9}
["TOTAL CARRIED TO SUMMARY",{"$nulls":4},{"$f":"SUM(F2:F24)","v":{"v":0,"d":"R 0.00"}}]
[]
["Signature of person authorised to sign the tender:",{"$nulls":3},"Date"]

{"sheet":"Section 604","index":24,"n_rows":24,"n_cols":6,"rows_kept":24,"merged":[[21,0,21,4],[23,0,23,3],[23,4,23,5],[24,0,24,3],[24,4,24,5]]}
["ITEM","DESCRIPTION","UNIT","QTY","RATE","AMOUNT"]
[]
["SERIES 6","ROADS AND PARKING AREAS"]
[]
["Section 604","Stabilization"]
[]
["604.01","Chemical stabilization extra over"]
[null,"unstabilized compacted layers"]
[]
["604.01.03","Subbase","m³",{"$f":"'Section 601'!D25","v":{"v":2931,"d":"2,931"}},null,{"$f":"IF(TRIM(D10)=\"rate only\",\"ro\",IF(ISBLANK(E10),\" \",D10*E10))","v":" "}]
[]
["604.02","Chemical stabilizing agent"]
[]
["604.02.01","Cement","t",{"$f":"4%*D10*2200/1000","v":{"v":257.92800000000005,"d":"258"}},null,{"$f":"IF(TRIM(D14)=\"rate only\",\"ro\",IF(ISBLANK(E14),\" \",D14*E14))","v":" "}]
{"$rows_empty":7}
["TOTAL CARRIED TO SUMMARY",{"$nulls":4},{"$f":"SUM(F2:F21)","v":{"v":0,"d":"R 0.00"}}]
[]
["Signature of person authorised to sign the tender:",{"$nulls":3},"Date"]

{"sheet":"Section 605","index":25,"n_rows":27,"n_cols":6,"rows_kept":27,"merged":[[24,0,24,4],[26,0,26,3],[26,4,26,5],[27,0,27,3],[27,4,27,5]]}
["ITEM","DESCRIPTION","UNIT","QTY","RATE","AMOUNT"]
[]
["SERIES 6","ROADS AND PARKING AREAS"]
[]
["Section 605","Prime Coat"]
[]
["605.01","Prime coat"]
[]
["605.01.02","MC-30 cut-back bitumen","ℓ",{"$f":"1435*10*0.75+30*6.7*0.75","v":{"v":10913.25,"d":"10,913"}},null,{"$f":"IF(TRIM(D9)=\"rate only\",\"ro\",IF(OR(ISBLANK(D9),ISBLANK(E9)),\" \",D9*E9))","v":" "}]
[]
["605.02","Aggregate for blinding","m²",158,null,{"$f":"IF(TRIM(D11)=\"rate only\",\"ro\",IF(ISBLANK(E11),\" \",D11*E11))","v":" "}]
{"$rows_empty":13}
["TOTAL CARRIED TO SUMMARY",{"$nulls":4},{"$f":"SUM(F2:F24)","v":{"v":0,"d":"R 0.00"}}]
[]
["Signature of person authorised to sign the tender:",{"$nulls":3},"Date"]

{"sheet":"Section 606","index":26,"n_rows":52,"n_cols":6,"rows_kept":52,"merged":[[17,0,17,4],[19,0,19,3],[19,4,19,5],[20,0,20,3],[20,4,20,5],[23,0,23,4],[49,0,49,4],[51,0,51,3],[51,4,51,5],[52,0,52,3],[52,4,52,5]]}
["ITEM","DESCRIPTION","UNIT","QTY","RATE","AMOUNT"]
[]
["606.02","Asphalt surfacing"]
[]
["606.02.01","Continuously graded (grade stated) 30mm ","t",950,null,{"$f":"IF(TRIM(D5)=\"rate only\",\"ro\",IF(ISBLANK(E5),\" \",D5*E5))","v":" "}]
[]
["606.05","Tack coat of 30% stable grade"]
[null,"emulsion","ℓ",{"$f":"1435*10*0.55+30*6.7*0.55","v":{"v":8003.050000000001,"d":"8,003"}},null,{"$f":"IF(TRIM(D8)=\"rate only\",\"ro\",IF(ISBLANK(E8),\" \",D8*E8))","v":" "}]
[]
["606.06","Binder variations"]
[]
["606.06.01","Penetration grade bitumens","t",5,null,{"$f":"IF(TRIM(D12)=\"rate only\",\"ro\",IF(ISBLANK(E12),\" \",D12*E12))","v":" "}]
[]
[]
[]
[]
[]
["TOTAL CARRIED FORWARD",{"$nulls":4},{"$f":"SUM(F3:F17)","v":{"v":0,"d":"R 0.00"}}]
[]
["Signature of person authorised to sign the tender:",{"$nulls":3},"Date"]
[]
[]
["ITEM","DESCRIPTION","UNIT","QTY","RATE","AMOUNT"]
["TOTAL BROUGHT FORWARD",{"$nulls":4},{"$f":"F18","v":{"v":0,"d":"R 0.00"}}]
[]
["606.08","Trial sections (30 mm thick)","m²",{"$f":"200*3.2","v":640},null,{"$f":"IF(TRIM(D26)=\"rate only\",\"ro\",IF(ISBLANK(E26),\" \",D26*E26))","v":" "}]
[]
["606.09","100mm cores in asphalt paving","no",20,null,{"$f":"IF(TRIM(D28)=\"rate only\",\"ro\",IF(ISBLANK(E28),\" \",D28*E28))","v":" "}]
[]
["606.10","Saw-cutting of asphalt, asphalt base"]
[null,"or paving (50mm)","m",{"$f":"51*2","v":102},null,{"$f":"IF(TRIM(D31)=\"rate only\",\"ro\",IF(ISBLANK(E31),\" \",D31*E31))","v":" "}]
[]
[]
["B606.11","Speed Humps as per drawing No 6229","No",2,null,{"$f":"IF(TRIM(D34)=\"rate only\",\"ro\",IF(ISBLANK(E34),\" \",D34*E34))","v":" "}]
[null,"PCE (T1) complete with road makings"]
[null,"and signage"]
{"$rows_empty":13}
["TOTAL CARRIED TO SUMMARY",{"$nulls":4},{"$f":"SUM(F24:F49)","v":{"v":0,"d":"R 0.00"}}]
[]
["Signature of person authorised to sign the tender:",{"$nulls":3},"Date"]

{"sheet":"Section 607","index":27,"n_rows":155,"n_cols":6,"rows_kept":155,"hidden":true,"merged":[[48,0,48,4],[50,0,50,3],[50,4,50,5],[51,0,51,3],[51,4,51,5],[54,0,54,4],[100,0,100,4],[102,0,102,3],[102,4,102,5],[103,0,103,3],[103,4,103,5],[106,0,106,4],[152,0,152,4],[154,0,154,3],[154,4,154,5],[155,0,155,3],[155,4,155,5]]}
["ITEM","DESCRIPTION","UNIT","QTY","RATE","AMOUNT"]
[]
["SERIES 6","ROADS AND PARKING AREAS"]
[]
["Section 607","Bituminous Surface Treatments"]
[]
["607.01","Double-seal surface treatment using -"]
[]
["607.01.01","19,0 mm and 9,5 mm aggregate"]
[null,"(state types and rates of binder to"]
[null," be used)","m²","Rate only",null,{"$f":"IF(TRIM(D11)=\"rate only\",\"ro\",IF(OR(ISBLANK(D11),ISBLANK(E11)),\" \",D11*E11))","v":"ro"}]
[]
[]
[]
[]
["607.01.02","13.2mm and 6.7mm aggregate"]
[null,"(state types and rates of binder to"]
[null," be used)","m²","Rate only",null,{"$f":"IF(TRIM(D18)=\"rate only\",\"ro\",IF(ISBLANK(E18),\" \",D18*E18))","v":"ro"}]
[]
[]
[]
[]
["607.02","Bituminous surface treatment with "]
[null,"19,0 mm and slurry using -"]
[]
["607.02.01","RTH 45/50 or RTL 45/50 road tar as a"]
[null,"tack coat and 150/200 penetration-grade"]
[null,"bitumen in the penetration spray","m²","Rate only",null,{"$f":"IF(TRIM(D28)=\"rate only\",\"ro\",IF(ISBLANK(E28),\" \",D28*E28))","v":"ro"}]
[]
["607.02.02","150/200 penetration-grade bitumen in"]
[null,"both applications","m²","Rate only",null,{"$f":"IF(TRIM(D31)=\"rate only\",\"ro\",IF(ISBLANK(E31),\" \",D31*E31))","v":"ro"}]
[]
["607.02.03","150/200 penegtration-grade bitumen in"]
[null,"the tack coat and 60% or 65% spray-grade"]
[null,"emulsion in the penetration spray","m²","Rate only",null,{"$f":"IF(TRIM(D35)=\"rate only\",\"ro\",IF(ISBLANK(E35),\" \",D35*E35))","v":"ro"}]
[]
["607.02.04","Etc for other combinations of binders"]
{"$rows_empty":11}
["TOTAL CARRIED FORWARD",{"$nulls":4},{"$f":"SUM(F2:F48)","v":{"v":0,"d":"R 0.00"}}]
[]
["Signature of person authorised to sign the tender:",{"$nulls":3},"Date"]
[]
[]
["ITEM","DESCRIPTION","UNIT","QTY","RATE","AMOUNT"]
["TOTAL BROUGHT FORWARD",{"$nulls":4},{"$f":"F49","v":{"v":0,"d":"R 0.00"}}]
[]
["607.03","Bituminous surface treatment with"]
[null,"13.2mm aggregate and slurry-seal"]
[null,"using-"]
[]
["607.03.01","RTH 45/50 or RTL 45/50 road tar as a"]
[null,"tack coat and 60% or 65% emulsion in"]
[null,"the penetration spray","m²","Rate only",null,{"$f":"IF(TRIM(D63)=\"rate only\",\"ro\",IF(ISBLANK(E63),\" \",D63*E63))","v":"ro"}]
[]
["607.03.02","150/200 penetration-grade bitumen"]
[null,"in the tack coat and 60% or 65%"]
[null,"emulsion in the penetration spray","m²","Rate only",null,{"$f":"IF(TRIM(D67)=\"rate only\",\"ro\",IF(ISBLANK(E67),\" \",D67*E67))","v":"ro"}]
[]
["607.03.03","Etc for other combinations of binder"]
[null,"if required"]
[]
[]
[]
[]
["607.04","Bituminous binder variations"]
[]
["607.04.01","Road tar RTH 45/50 or RTL 45/50","ℓ","Rate only",null,{"$f":"IF(TRIM(D77)=\"rate only\",\"ro\",IF(ISBLANK(E77),\" \",D77*E77))","v":"ro"}]
[]
["607.04.02","150/200 penetration-grade bitumen","ℓ","Rate only",null,{"$f":"IF(TRIM(D79)=\"rate only\",\"ro\",IF(ISBLANK(E79),\" \",D79*E79))","v":"ro"}]
[]
["607.04.03","65% spray-grade emulsion","ℓ","Rate only",null,{"$f":"IF(TRIM(D81)=\"rate only\",\"ro\",IF(ISBLANK(E81),\" \",D81*E81))","v":"ro"}]
[]
["607.04.04","60% spray-grade emulsion","ℓ","Rate only",null,{"$f":"IF(TRIM(D83)=\"rate only\",\"ro\",IF(ISBLANK(E83),\" \",D83*E83))","v":"ro"}]
[]
["607.04.05","30% anionic spray-grade emulsion","ℓ","Rate only",null,{"$f":"IF(TRIM(D85)=\"rate only\",\"ro\",IF(ISBLANK(E85),\" \",D85*E85))","v":"ro"}]
[]
["607.04.06","Anionic slurry-seal emulsion"]
[null,"(60% bitumen)","ℓ","Rate only",null,{"$f":"IF(TRIM(D88)=\"rate only\",\"ro\",IF(ISBLANK(E88),\" \",D88*E88))","v":"ro"}]
[]
[]
["607.05","Aggregate variations"]
[]
["607.05.01","19,0 mm aggregate","m³","Rate only",null,{"$f":"IF(TRIM(D93)=\"rate only\",\"ro\",IF(ISBLANK(E93),\" \",D93*E93))","v":"ro"}]
[]
["607.05.02","13,2 mm aggregate","m³","Rate only",null,{"$f":"IF(TRIM(D95)=\"rate only\",\"ro\",IF(ISBLANK(E95),\" \",D95*E95))","v":"ro"}]
[]
["607.05.03","9,5 mm aggregate","m³","Rate only",null,{"$f":"IF(TRIM(D97)=\"rate only\",\"ro\",IF(ISBLANK(E97),\" \",D97*E97))","v":"ro"}]
[]
["607.05.04","6,7 mm aggregate","m³","Rate only",null,{"$f":"IF(TRIM(D99)=\"rate only\",\"ro\",IF(ISBLANK(E99),\" \",D99*E99))","v":"ro"}]
[]
["TOTAL CARRIED FORWARD",{"$nulls":4},{"$f":"SUM(F54:F100)","v":{"v":0,"d":"R 0.00"}}]
[]
["Signature of person authorised to sign the tender:",{"$nulls":3},"Date"]
[]
[]
["ITEM","DESCRIPTION","UNIT","QTY","RATE","AMOUNT"]
["TOTAL BROUGHT FORWARD",{"$nulls":4},{"$f":"F101","v":{"v":0,"d":"R 0.00"}}]
[]
["607.06","Application of fog spray consisting of"]
[]
["607.06.01","60% spray-grade emulsion","ℓ","Rate only",null,{"$f":"IF(TRIM(D111)=\"rate only\",\"ro\",IF(ISBLANK(E111),\" \",D111*E111))","v":"ro"}]
[]
["607.06.02","30% spray-grade emulsion","ℓ","Rate only",null,{"$f":"IF(TRIM(D113)=\"rate only\",\"ro\",IF(ISBLANK(E113),\" \",D113*E113))","v":"ro"}]
[]
[]
["607.07","Variation in the rate of application"]
[null,"of slurry seal","m³","Rate only",null,{"$f":"IF(TRIM(D117)=\"rate only\",\"ro\",IF(ISBLANK(E117),\" \",D117*E117))","v":"ro"}]
[]
[]
["607.08","Precoating of aggregate for second"]
[null,"application (indicate precoating fluid)","m³","Rate only",null,{"$f":"IF(TRIM(D121)=\"rate only\",\"ro\",IF(ISBLANK(E121),\" \",D121*E121))","v":"ro"}]
[]
[]
["607.08","Treating areas inaccessible to mechanical"]
[null,"eqiupment with premixed bituminous"]
[null,"material"]
[]
["607.08.01","19,0 mm thick","m²","Rate only",null,{"$f":"IF(TRIM(D128)=\"rate only\",\"ro\",IF(ISBLANK(E128),\" \",D128*E128))","v":"ro"}]
[]
["607.08.02","13,2 mm thick","m²","Rate only",null,{"$f":"IF(TRIM(D130)=\"rate only\",\"ro\",IF(ISBLANK(E130),\" \",D130*E130))","v":"ro"}]
[]
[]
["607.10","Correction for bleeding"]
[]
["607.10.01","Aggregate"]
[]
["607.10.01.01","13,2 mm","m³","Rate only",null,{"$f":"IF(TRIM(D137)=\"rate only\",\"ro\",IF(ISBLANK(E137),\" \",D137*E137))","v":"ro"}]
[]
["607.10.01.02","9,5 mm","m³","Rate only",null,{"$f":"IF(TRIM(D139)=\"rate only\",\"ro\",IF(ISBLANK(E139),\" \",D139*E139))","v":"ro"}]
[]
["607.10.01.03","4,75 mm","m³","Rate only",null,{"$f":"IF(TRIM(D141)=\"rate only\",\"ro\",IF(ISBLANK(E141),\" \",D141*E141))","v":"ro"}]
[]
[]
["607.10.02","Precoating of aggregate","m³","Rate only",null,{"$f":"IF(TRIM(D144)=\"rate only\",\"ro\",IF(ISBLANK(E144),\" \",D144*E144))","v":"ro"}]
[]
["607.10.03","Treatment of surface for bleeding","m²","Rate only",null,{"$f":"IF(TRIM(D146)=\"rate only\",\"ro\",IF(ISBLANK(E146),\" \",D146*E146))","v":"ro"}]
[]
[]
[]
[]
[]
[]
["TOTAL CARRIED TO SUMMARY",{"$nulls":4},{"$f":"SUM(F107:F152)","v":{"v":0,"d":"R 0.00"}}]
[]
["Signature of person authorised to sign the tender:",{"$nulls":3},"Date"]

{"sheet":"Section 608","index":28,"n_rows":207,"n_cols":6,"rows_kept":207,"hidden":true,"merged":[[48,0,48,4],[50,0,50,3],[50,4,50,5],[51,0,51,3],[51,4,51,5],[54,0,54,4],[100,0,100,4],[102,0,102,3],[102,4,102,5],[103,0,103,3],[103,4,103,5],[106,0,106,4],[152,0,152,4],[154,0,154,3],[154,4,154,5],[155,0,155,3],[155,4,155,5],[158,0,158,4],[204,0,204,4],[206,0,206,3],[206,4,206,5],[207,0,207,3],[207,4,207,5]]}
["ITEM","DESCRIPTION","UNIT","QTY","RATE","AMOUNT"]
[]
["SERIES 6","ROADS AND PARKING AREAS"]
[]
["Section 608","Road and Surfacing Rehabilitation"]
[null,"and Overlay Construction"]
[]
["608.01","Replacing failed layers"]
[]
["608.01.01","Excavation in existing pavements","m³","Rate only",null,{"$f":"IF(TRIM(D10)=\"rate only\",\"ro\",IF(OR(ISBLANK(D10),ISBLANK(E10)),\" \",D10*E10))","v":"ro"}]
[]
["608.01.02","Compacting the floor of excavations","m²","Rate only",null,{"$f":"IF(TRIM(D12)=\"rate only\",\"ro\",IF(ISBLANK(E12),\" \",D12*E12))","v":"ro"}]
[]
["608.01.03","Backfilling of excavation with:"]
[]
["608.01.03.01","Chemically-stabilized gravel","m³","Rate only",null,{"$f":"IF(TRIM(D16)=\"rate only\",\"ro\",IF(ISBLANK(E16),\" \",D16*E16))","v":"ro"}]
[]
["608.01.03.02","Emulsion-treated crushed stone","m³","Rate only",null,{"$f":"IF(TRIM(D18)=\"rate only\",\"ro\",IF(ISBLANK(E18),\" \",D18*E18))","v":"ro"}]
[]
["608.01.03.03","Asphalt base","t","Rate only",null,{"$f":"IF(TRIM(D20)=\"rate only\",\"ro\",IF(ISBLANK(E20),\" \",D20*E20))","v":"ro"}]
[]
["608.01.03.04","Asphalt surfacing","t","Rate only",null,{"$f":"IF(TRIM(D22)=\"rate only\",\"ro\",IF(ISBLANK(E22),\" \",D22*E22))","v":"ro"}]
[]
[]
["608.02","Repairing potholes and local pavement"]
[null,"layer failures with asphalt","t","Rate only",null,{"$f":"IF(TRIM(D26)=\"rate only\",\"ro\",IF(ISBLANK(E26),\" \",D26*E26))","v":"ro"}]
[]
["608.03","Treatment type 1 (fog or mist spray)"]
[]
["608.03.01","30% spray-grade emulsion","ℓ","Rate only",null,{"$f":"IF(TRIM(D30)=\"rate only\",\"ro\",IF(ISBLANK(E30),\" \",D30*E30))","v":"ro"}]
[]
["608.03.02","60% spray-grade emulsion","ℓ","Rate only",null,{"$f":"IF(TRIM(D32)=\"rate only\",\"ro\",IF(ISBLANK(E32),\" \",D32*E32))","v":"ro"}]
[]
[]
["608.04","Treatment type 2 (crusher-sand seal)"]
[null,"using:"]
[]
["608.04.01","60% spray-grade emulsion","ℓ","Rate only",null,{"$f":"IF(TRIM(D38)=\"rate only\",\"ro\",IF(ISBLANK(E38),\" \",D38*E38))","v":"ro"}]
[]
[null,"An application of doubly washed slurry-"]
[null,"seal aggregate","m³","Rate only",null,{"$f":"IF(TRIM(D41)=\"rate only\",\"ro\",IF(ISBLANK(E41),\" \",D41*E41))","v":"ro"}]
{"$rows_empty":7}
["TOTAL CARRIED FORWARD",{"$nulls":4},{"$f":"SUM(F2:F48)","v":{"v":0,"d":"R 0.00"}}]
[]
["Signature of person authorised to sign the tender:",{"$nulls":3},"Date"]
[]
[]
["ITEM","DESCRIPTION","UNIT","QTY","RATE","AMOUNT"]
["TOTAL BROUGHT FORWARD",{"$nulls":4},{"$f":"F49","v":{"v":0,"d":"R 0.00"}}]
[]
["608.05","Treatment type 3 (slurry seal)"]
[]
["608.05.01","Tack coat of 30% stable-grade emulsion","ℓ","Rate only",null,{"$f":"IF(TRIM(D59)=\"rate only\",\"ro\",IF(ISBLANK(E59),\" \",D59*E59))","v":"ro"}]
[]
["608.05.02","Slurry seal applied by hand","m³","Rate only",null,{"$f":"IF(TRIM(D61)=\"rate only\",\"ro\",IF(ISBLANK(E61),\" \",D61*E61))","v":"ro"}]
[]
["608.05.03","Slurry seal applied by spreader box","m²","Rate only",null,{"$f":"IF(TRIM(D63)=\"rate only\",\"ro\",IF(ISBLANK(E63),\" \",D63*E63))","v":"ro"}]
[]
[]
["608.06","Variation in rate of application of"]
[null,"slurry seal (applicable to item"]
[null,"608.05.03 only)","m³","Rate only",null,{"$f":"IF(TRIM(D68)=\"rate only\",\"ro\",IF(ISBLANK(E68),\" \",D68*E68))","v":"ro"}]
[]
[]
["608.07","Treatment type 4"]
[]
["608.07.01","Tack coat of 30%-stable-grade emulsion","ℓ","Rate only",null,{"$f":"IF(TRIM(D73)=\"rate only\",\"ro\",IF(ISBLANK(E73),\" \",D73*E73))","v":"ro"}]
[]
["608.07.02","Continuously-graded asphalt","t","Rate only",null,{"$f":"IF(TRIM(D75)=\"rate only\",\"ro\",IF(ISBLANK(E75),\" \",D75*E75))","v":"ro"}]
[]
[]
["608.08","Treatment type 5"]
[]
["608.08.01","Trimming the edges of existing surfacing","m","Rate only",null,{"$f":"IF(TRIM(D80)=\"rate only\",\"ro\",IF(ISBLANK(E80),\" \",D80*E80))","v":"ro"}]
[]
["608.08.02","Reconstructing edges using continuously-"]
[null,"graded asphalt","t","Rate only",null,{"$f":"IF(TRIM(D83)=\"rate only\",\"ro\",IF(ISBLANK(E83),\" \",D83*E83))","v":"ro"}]
[]
[]
["608.09","Treatment type 6 (crack sealing)"]
[]
["608.089.01","Cleaning the cracks with compressed"]
[null,"air","m² or m","Rate only",null,{"$f":"IF(TRIM(D89)=\"rate only\",\"ro\",IF(ISBLANK(E89),\" \",D89*E89))","v":"ro"}]
[]
["608.09.02","Applying bituminous binders for"]
[null,"sealing cracks"]
[]
["608.09.02.01","MSP/1 or similar prime","ℓ","Rate only",null,{"$f":"IF(TRIM(D94)=\"rate only\",\"ro\",IF(ISBLANK(E94),\" \",D94*E94))","v":"ro"}]
[]
["608.09.02.02","Anionic stable-grade emulsion mixed"]
[null,"with synthetic modifiers","ℓ","Rate only",null,{"$f":"IF(TRIM(D97)=\"rate only\",\"ro\",IF(ISBLANK(E97),\" \",D97*E97))","v":"ro"}]
[]
[]
[]
["TOTAL CARRIED FORWARD",{"$nulls":4},{"$f":"SUM(F54:F100)","v":{"v":0,"d":"R 0.00"}}]
[]
["Signature of person authorised to sign the tender:",{"$nulls":3},"Date"]
[]
[]
["ITEM","DESCRIPTION","UNIT","QTY","RATE","AMOUNT"]
["TOTAL BROUGHT FORWARD",{"$nulls":4},{"$f":"F101","v":{"v":0,"d":"R 0.00"}}]
[]
["608.09.02.03","Hot bitumen rubber","ℓ","Rate only",null,{"$f":"IF(TRIM(D109)=\"rate only\",\"ro\",IF(ISBLANK(E109),\" \",D109*E109))","v":"ro"}]
[]
["608.09.02.04","SV250 plus 2 parts of diesel oil","ℓ","Rate only",null,{"$f":"IF(TRIM(D111)=\"rate only\",\"ro\",IF(ISBLANK(E111),\" \",D111*E111))","v":"ro"}]
[]
[]
["608.09.03","Rolling the cracks","m² or m","Rate only",null,{"$f":"IF(TRIM(D114)=\"rate only\",\"ro\",IF(ISBLANK(E114),\" \",D114*E114))","v":"ro"}]
[]
[]
["608.10","Single-seal surface treatment where"]
[null,"80/100 oenetration grade bitumen"]
[null,"is used -"]
[]
["608.10.01","with 6,7 mm aggregate","m²","Rate only",null,{"$f":"IF(TRIM(D121)=\"rate only\",\"ro\",IF(ISBLANK(E121),\" \",D121*E121))","v":"ro"}]
[]
["608.10.02","with 9,5 mm aggregate","m²","Rate only",null,{"$f":"IF(TRIM(D123)=\"rate only\",\"ro\",IF(ISBLANK(E123),\" \",D123*E123))","v":"ro"}]
[]
["308.10.03","with 13,2 mm aggregate","m²","Rate only",null,{"$f":"IF(TRIM(D125)=\"rate only\",\"ro\",IF(ISBLANK(E125),\" \",D125*E125))","v":"ro"}]
[]
[]
["608.11","Single-seal surface treatment with"]
[null,"bitumen rubber binder and 13,2 mm"]
[null,"aggregate","m²","Rate only",null,{"$f":"IF(TRIM(D130)=\"rate only\",\"ro\",IF(ISBLANK(E130),\" \",D130*E130))","v":"ro"}]
[]
["608.12","Bituminous binder variations"]
[]
["608.12.01","80/100 penetration-grade bitumen","ℓ","Rate only",null,{"$f":"IF(TRIM(D134)=\"rate only\",\"ro\",IF(ISBLANK(E134),\" \",D134*E134))","v":"ro"}]
[]
["608.12.02","65% spray-grade emulsion","ℓ","Rate only",null,{"$f":"IF(TRIM(D136)=\"rate only\",\"ro\",IF(ISBLANK(E136),\" \",D136*E136))","v":"ro"}]
[]
["608.12.03","60% spray-grade emulsion","ℓ","Rate only",null,{"$f":"IF(TRIM(D138)=\"rate only\",\"ro\",IF(ISBLANK(E138),\" \",D138*E138))","v":"ro"}]
[]
["608.12.04","PVC tar","ℓ","Rate only",null,{"$f":"IF(TRIM(D140)=\"rate only\",\"ro\",IF(ISBLANK(E140),\" \",D140*E140))","v":"ro"}]
[]
["608.12.05","Precoating fluid","ℓ","Rate only",null,{"$f":"IF(TRIM(D142)=\"rate only\",\"ro\",IF(ISBLANK(E142),\" \",D142*E142))","v":"ro"}]
[]
["608.12.06","Bitumen rubber","ℓ","Rate only",null,{"$f":"IF(TRIM(D144)=\"rate only\",\"ro\",IF(ISBLANK(E144),\" \",D144*E144))","v":"ro"}]
{"$rows_empty":8}
["TOTAL CARRIED FORWARD",{"$nulls":4},{"$f":"SUM(F106:F152)","v":{"v":0,"d":"R 0.00"}}]
[]
["Signature of person authorised to sign the tender:",{"$nulls":3},"Date"]
[]
[]
["ITEM","DESCRIPTION","UNIT","QTY","RATE","AMOUNT"]
["TOTAL BROUGHT FORWARD",{"$nulls":4},{"$f":"F153","v":{"v":0,"d":"R 0.00"}}]
[]
["608.13","Aggregate variations"]
[]
["608.13.01","6,7 mm aggregate","m³","Rate only",null,{"$f":"IF(TRIM(D163)=\"rate only\",\"ro\",IF(ISBLANK(E163),\" \",D163*E163))","v":"ro"}]
[]
["608.13.02","9,5 mm aggregate","m³","Rate only",null,{"$f":"IF(TRIM(D165)=\"rate only\",\"ro\",IF(ISBLANK(E165),\" \",D165*E165))","v":"ro"}]
[]
["608.13.03","13,2 mm aggregate","m³","Rate only",null,{"$f":"IF(TRIM(D167)=\"rate only\",\"ro\",IF(ISBLANK(E167),\" \",D167*E167))","v":"ro"}]
[]
[]
["608.14","Application of fog spray"]
[]
["608.14.01","60% spray-grade emulsion","ℓ","Rate only",null,{"$f":"IF(TRIM(D172)=\"rate only\",\"ro\",IF(ISBLANK(E172),\" \",D172*E172))","v":"ro"}]
[]
["608.14.02","30% spray-grade emulsion","ℓ","Rate only",null,{"$f":"IF(TRIM(D174)=\"rate only\",\"ro\",IF(ISBLANK(E174),\" \",D174*E174))","v":"ro"}]
[]
[]
["608.15","Precoating of aggregate"]
[null,"(indicate precoating fluid)","m³","Rate only",null,{"$f":"IF(TRIM(D178)=\"rate only\",\"ro\",IF(ISBLANK(E178),\" \",D178*E178))","v":"ro"}]
{"$rows_empty":26}
["TOTAL CARRIED TO SUMMARY",{"$nulls":4},{"$f":"SUM(F159:F204)","v":{"v":0,"d":"R 0.00"}}]
[]
["Signature of person authorised to sign the tender:",{"$nulls":3},"Date"]

{"sheet":"Section 609","index":29,"n_rows":25,"n_cols":6,"rows_kept":25,"merged":[[22,0,22,4],[24,0,24,3],[24,4,24,5],[25,0,25,3],[25,4,25,5]]}
["ITEM","DESCRIPTION","UNIT","QTY","RATE","AMOUNT"]
[]
["SERIES 6","ROADS AND PARKING AREAS"]
[]
["Section 609","Segmented Paving"]
[]
["609.01","Construction of segmental block"]
[null,"paving made from -"]
[]
["LI 609.01.01","60mm Type S-A, Class 25 gray "]
[null,"precast blocks with 20mm bedding sand","m²",{"$f":"1.5*15*2","v":45},null,{"$f":"IF(TRIM(D11)=\"rate only\",\"ro\",IF(OR(ISBLANK(D11),ISBLANK(E11)),\" \",D11*E11))","v":" "}]
[]
["LI 609.01.03","80mm Type S-A, Class 25 gray"]
[null,"precast blocks with 20mm bedding sand","m²",{"$f":"(0.5*18*3.5*2+3.5*15)*10","v":{"v":1155,"d":"1,155"}},null,{"$f":"IF(TRIM(D14)=\"rate only\",\"ro\",IF(ISBLANK(E14),\" \",D14*E14))","v":" "}]
[]
["609.03","The construction of edge"]
[null,"restraints with"]
[]
["609.03.02","In situ concrete according to drawing"]
[null,"no 6229 PCE 216 (T1) class 20/19","m³",{"$f":"1435*0.18*0.25*2","v":{"v":129.15,"d":"129"}},null,{"$f":"IF(TRIM(D20)=\"rate only\",\"ro\",IF(ISBLANK(E20),\" \",D20*E20))","v":" "}]
[]
[]
["TOTAL CARRIED TO SUMMARY",{"$nulls":4},{"$f":"SUM(F16:F22)","v":{"v":0,"d":"R 0.00"}}]
[]
["Signature of person authorised to sign the tender:",{"$nulls":3},"Date"]

{"sheet":"Section 610","index":30,"n_rows":103,"n_cols":6,"rows_kept":103,"hidden":true,"merged":[[48,0,48,4],[50,0,50,3],[50,4,50,5],[51,0,51,3],[51,4,51,5],[54,0,54,4],[100,0,100,4],[102,0,102,3],[102,4,102,5],[103,0,103,3],[103,4,103,5]]}
["ITEM","DESCRIPTION","UNIT","QTY","RATE","AMOUNT"]
[]
["SERIES 6","ROADS AND PARKING AREAS"]
[]
["Section 610","Concrete Pavements"]
[]
["610.01","Concrete pavement"]
[]
["610.01.01","Class 30/19, 150mm - 180mm thick"]
[null,"in bus bays and roads","m³","Rate only",null,{"$f":"IF(TRIM(D10)=\"rate only\",\"ro\",IF(OR(ISBLANK(D10),ISBLANK(E10)),\" \",D10*E10))","v":"ro"}]
[null,"(state concrete finish)"]
[]
["610.01.02","Class 25/19, 100mm - 125mm thick"]
[null,"in walkways and cycle tracks","m³","Rate only",null,{"$f":"IF(TRIM(D14)=\"rate only\",\"ro\",IF(ISBLANK(E14),\" \",D14*E14))","v":"ro"}]
[null,"(including Class U2 concrete finish)"]
[]
["610.01.03","Etc for other classes and thickness"]
[]
[]
[]
[]
["610.02","Texturing and curing of concrete"]
[null,"pavement"]
[]
["610.02.01","Wire-brush texturing","m²","Rate only",null,{"$f":"IF(TRIM(D25)=\"rate only\",\"ro\",IF(ISBLANK(E25),\" \",D25*E25))","v":"ro"}]
[]
["610.02.02","Curing","m²","Rate only",null,{"$f":"IF(TRIM(D27)=\"rate only\",\"ro\",IF(ISBLANK(E27),\" \",D27*E27))","v":"ro"}]
[]
[]
["610.03","Variation in the rate of application"]
[null,"of the curing compound","ℓ","Rate only",null,{"$f":"IF(TRIM(D31)=\"rate only\",\"ro\",IF(ISBLANK(E31),\" \",D31*E31))","v":"ro"}]
[]
["610.04","Joints"]
[]
["610.04.01","Expansion joints complete (excluding","m","Rate only",null,{"$f":"IF(TRIM(D35)=\"rate only\",\"ro\",IF(ISBLANK(E35),\" \",D35*E35))","v":"ro"}]
[null,"dowels)"]
[]
["610.04.02","Longitudinal hinge joints"]
[]
["610.04.02.01","Sawn hinge joints (unsealed)","m","Rate only",null,{"$f":"IF(TRIM(D40)=\"rate only\",\"ro\",IF(ISBLANK(E40),\" \",D40*E40))","v":"ro"}]
[]
["610.04.02.02","Sawn hinge joints (sealed)","m","Rate only",null,{"$f":"IF(TRIM(D42)=\"rate only\",\"ro\",IF(ISBLANK(E42),\" \",D42*E42))","v":"ro"}]
[]
[]
[]
[]
[]
[]
["TOTAL CARRIED FORWARD",{"$nulls":4},{"$f":"SUM(F2:F48)","v":{"v":0,"d":"R 0.00"}}]
[]
["Signature of person authorised to sign the tender:",{"$nulls":3},"Date"]
[]
[]
["ITEM","DESCRIPTION","UNIT","QTY","RATE","AMOUNT"]
["TOTAL BROUGHT FORWARD",{"$nulls":4},{"$f":"F49","v":{"v":0,"d":"R 0.00"}}]
[]
["610.04.03","Transverse contraction joints"]
[]
["610.04.03.01","Sawn contraction joints (sealed)"]
[null,"completed in a single operation"]
[null,"(width as shown on drawing STD010)","m","Rate only",null,{"$f":"IF(TRIM(D61)=\"rate only\",\"ro\",IF(ISBLANK(E61),\" \",D61*E61))","v":"ro"}]
[]
["610.04.03.02","Sawn contraction joints (sealed)"]
[null,"completed in two separate operations"]
[null,"(width as shown on drawing STD010)","m","Rate only",null,{"$f":"IF(TRIM(D65)=\"rate only\",\"ro\",IF(ISBLANK(E65),\" \",D65*E65))","v":"ro"}]
[]
["610.04.03.03","Sawn contraction joints (unsealed)","m","Rate only",null,{"$f":"IF(TRIM(D67)=\"rate only\",\"ro\",IF(ISBLANK(E67),\" \",D67*E67))","v":"ro"}]
[]
[]
["610.04.04","Dowel bars (R12 mild steel)","m","Rate only",null,{"$f":"IF(TRIM(D70)=\"rate only\",\"ro\",IF(ISBLANK(E70),\" \",D70*E70))","v":"ro"}]
[]
["610.04.05","Tie bars","m","Rate only",null,{"$f":"IF(TRIM(D72)=\"rate only\",\"ro\",IF(ISBLANK(E72),\" \",D72*E72))","v":"ro"}]
[]
["610.04.06","End caps for dowels at expansion"]
[null,"joints","no","Rate only",null,{"$f":"IF(TRIM(D75)=\"rate only\",\"ro\",IF(ISBLANK(E75),\" \",D75*E75))","v":"ro"}]
[]
["610.04.07","Forming and sealing of joints "]
[null,"between asphalt and concrete"]
[null,"pavement","m","Rate only",null,{"$f":"IF(TRIM(D79)=\"rate only\",\"ro\",IF(ISBLANK(E79),\" \",D79*E79))","v":"ro"}]
[]
[]
["610.05","Coring and testing of cores"]
[]
["610.05.01","100mm cores drilled from pavement","no","Rate only",null,{"$f":"IF(TRIM(D84)=\"rate only\",\"ro\",IF(ISBLANK(E84),\" \",D84*E84))","v":"ro"}]
[]
["610.05.02","150mm cores drilled from pavement"]
[null,"and tested for compressive strength","no","Rate only",null,{"$f":"IF(TRIM(D87)=\"rate only\",\"ro\",IF(ISBLANK(E87),\" \",D87*E87))","v":"ro"}]
[]
[]
["610.06","Repairing cracks"]
[]
["610.06.01","By injection of epoxy resin","m","Rate only",null,{"$f":"IF(TRIM(D92)=\"rate only\",\"ro\",IF(ISBLANK(E92),\" \",D92*E92))","v":"ro"}]
[]
["610.06.02","By grouting and sealing with cold-"]
[null,"applied liquid sealant","m","Rate only",null,{"$f":"IF(TRIM(D95)=\"rate only\",\"ro\",IF(ISBLANK(E95),\" \",D95*E95))","v":"ro"}]
[]
[]
["610.07","Breaking up, removing and"]
[null,"replacing defective slabs","m²","Rate only",null,{"$f":"IF(TRIM(D99)=\"rate only\",\"ro\",IF(ISBLANK(E99),\" \",D99*E99))","v":"ro"}]
[]
["TOTAL CARRIED TO SUMMARY",{"$nulls":4},{"$f":"SUM(F55:F100)","v":{"v":0,"d":"R 0.00"}}]
[]
["Signature of person authorised to sign the tender:",{"$nulls":3},"Date"]

{"sheet":"Section 612","index":31,"n_rows":38,"n_cols":6,"rows_kept":38,"merged":[[35,0,35,4],[37,0,37,3],[37,4,37,5],[38,0,38,3],[38,4,38,5]]}
["ITEM","DESCRIPTION","UNIT","QTY","RATE","AMOUNT"]
[]
["SERIES 6","ROADS AND PARKING AREAS"]
[]
["Section B612","Traffic Signs"]
[]
["B612.01","Sign boards with painted back-"]
[null,"ground, symbols, lettering and"]
[null,"borders in engineering-grade retro-"]
[null,"reflective material with sign boards"]
[null,"constructed from -"]
[]
["B612.01.01","Aluminium sheet (2,0 mm thick) with an"]
[]
["B612.01.01.01","Area not exceeding 2m²","m²",25,null,{"$f":"IF(TRIM(D15)=\"rate only\",\"ro\",IF(OR(ISBLANK(D15),ISBLANK(E15)),\" \",D15*E15))","v":" "}]
[]
["B612.03","Poles"]
[]
["B612.03.02","Steel tubing","t",{"v":1,"d":"1.00"},null,{"$f":"IF(TRIM(D19)=\"rate only\",\"ro\",IF(ISBLANK(E19),\" \",D19*E19))","v":" "}]
[]
["B612.04","Extra over Items 612.03.01 and"]
[null,"612.03.02 for providing"]
[]
["B612.04.02","Painted galvanized steel members","t",{"v":1,"d":"1.00"},null,{"$f":"IF(TRIM(D24)=\"rate only\",\"ro\",IF(ISBLANK(E24),\" \",D24*E24))","v":" "}]
[]
[]
["612.05","Excavation and backfilling for"]
[null,"sign supports","m³",{"$f":"22*0.3*0.3*0.5","v":{"v":0.9899999999999999,"d":"1"}},null,{"$f":"IF(TRIM(D28)=\"rate only\",\"ro\",IF(ISBLANK(E28),\" \",D28*E28))","v":" "}]
[]
[]
["612.06","Dismantling, storing and re-erecting"]
[null,"traffic signs with a surface area of -"]
[]
["612.06.01","Up to 2m²","no",5,null,{"$f":"IF(TRIM(D34)=\"rate only\",\"ro\",IF(ISBLANK(E34),\" \",D34*E34))","v":" "}]
[]
["TOTAL CARRIED TO SUMMARY",{"$nulls":4},{"$f":"SUM(F17:F35)","v":{"v":0,"d":"R 0.00"}}]
[]
["Signature of person authorised to sign the tender:",{"$nulls":3},"Date"]

{"sheet":"Section 613","index":32,"n_rows":44,"n_cols":6,"rows_kept":44,"merged":[[41,0,41,4],[43,0,43,3],[43,4,43,5],[44,0,44,3],[44,4,44,5]]}
["ITEM","DESCRIPTION","UNIT","QTY","RATE","AMOUNT"]
[]
["SERIES 6","ROADS AND PARKING AREAS"]
[]
["Section B613","Traffic Markings"]
[]
["613.01","Road-marking paint"]
[]
["613.01.01","White lines (broken or unbroken)"]
[null,"(100mm wide)","km",0,null,{"$f":"IF(TRIM(D10)=\"rate only\",\"ro\",IF(OR(ISBLANK(D10),ISBLANK(E10)),\" \",D10*E10))","v":" "}]
[]
["613.01.02","Yellow lines (broken or unbroken)"]
[null,"(width indicated)","km",{"$f":"D10*2","v":0},null,{"$f":"IF(TRIM(D13)=\"rate only\",\"ro\",IF(ISBLANK(E13),\" \",D13*E13))","v":" "}]
[]
["613.01.03","White lettering and symbols","m²",0,null,{"$f":"IF(TRIM(D15)=\"rate only\",\"ro\",IF(ISBLANK(E15),\" \",D15*E15))","v":" "}]
[]
["613.01.06","Kerb markings (any colour)","m²",0,null,{"$f":"IF(TRIM(D17)=\"rate only\",\"ro\",IF(ISBLANK(E17),\" \",D17*E17))","v":" "}]
[]
["B613.02.01","1,2mm Thermoplastic Road Marking Paint"]
[]
["B613.02.01.01","White lines (broken or unbroken)"]
[null,"100mm wide","km",2,null,{"$f":"IF(TRIM(D22)=\"rate only\",\"ro\",IF(ISBLANK(E22),\" \",D22*E22))","v":" "}]
[]
["B613.02.01.02","Yellow lines (broken or unbroken)"]
[null,"100mm wide","km",{"$f":"1.435*3","v":{"v":4.305,"d":"4"}},null,{"$f":"IF(TRIM(D25)=\"rate only\",\"ro\",IF(ISBLANK(E25),\" \",D25*E25))","v":" "}]
[]
["B613.02.01.03","White lettering and symbols","m²",{"$f":"12*2*8","v":192},null,{"$f":"IF(TRIM(D27)=\"rate only\",\"ro\",IF(ISBLANK(E27),\" \",D27*E27))","v":" "}]
[]
["B613.02.01.04","Yellow lettering and symbols","m²",{"$f":"65%*D27","v":{"v":124.80000000000001,"d":"125"}},null,{"$f":"IF(TRIM(D29)=\"rate only\",\"ro\",IF(ISBLANK(E29),\" \",D29*E29))","v":" "}]
[]
["B613.02.01.05","Traffic-island markings (any colour)","m²",{"$f":"D27*35%","v":{"v":67.19999999999999,"d":"67"}},null,{"$f":"IF(TRIM(D31)=\"rate only\",\"ro\",IF(ISBLANK(E31),\" \",D31*E31))","v":" "}]
[]
["613.05","Road studs (SANS approved Cat eye all"]
[null,"colours)"]
[]
["613.05.01","Single sided road stud","no",{"$f":"(1435/12)*3","v":{"v":358.75,"d":"359"}},null,{"$f":"IF(TRIM(D36)=\"rate only\",\"ro\",IF(ISBLANK(E36),\" \",D36*E36))","v":" "}]
[]
["613.06","Setting out and the premarking of "]
[null,"lines (excluding traffic-island"]
[null,"markings, lettering and symbols)","km",2,null,{"$f":"IF(TRIM(D40)=\"rate only\",\"ro\",IF(ISBLANK(E40),\" \",D40*E40))","v":" "}]
[]
["TOTAL CARRIED TO SUMMARY",{"$nulls":4},{"$f":"SUM(F41:F41)","v":{"v":0,"d":"R 0.00"}}]
[]
["Signature of person authorised to sign the tender:",{"$nulls":3},"Date"]

{"sheet":"Section 903","index":33,"n_rows":79,"n_cols":6,"rows_kept":79,"merged":[[24,0,24,4],[26,0,26,3],[26,4,26,5],[27,0,27,3],[27,4,27,5],[30,0,30,4],[76,0,76,4],[78,0,78,3],[78,4,78,5],[79,0,79,3],[79,4,79,5]]}
["ITEM","DESCRIPTION","UNIT","QTY","RATE","AMOUNT"]
[]
["SERIES 9","QUALITY CONTROL"]
[]
["Section 903","Testing all inclusive"]
[]
["903.06","Prime cost for special tests required"]
[null," by the Engineer","Prime Cost",1,{"v":250000,"d":"R 250,000.00"},{"$f":"D8*E8","v":{"v":250000,"d":"R 250,000.00"}}]
[]
["903.06.01","Percentage on item 903.06 for"]
[null,"charges and profit","%",{"$f":"F8","v":{"v":250000,"d":"R250,000.00"}}]
{"$rows_empty":13}
["TOTAL CARRIED TO SUMMARY"]
[]
["Signature of person authorised to sign the tender:",{"$nulls":3},"Date"]
[]
[]
["ITEM","DESCRIPTION","UNIT","QTY","RATE","AMOUNT"]
["TOTAL BROUGHT FORWARD",{"$nulls":4},{"$f":"F25","v":{"v":0,"d":"R 0.00"}}]
[]
["903.03","Special tests on concrete and asphalt"]
[]
["903.03.01","Compressive-strength tests on"]
[null,"concrete cubes","no",null,null,{"$f":"IF(TRIM(D36)=\"rate only\",\"ro\",IF(ISBLANK(E36),\" \",D36*E36))","v":" "}]
[]
["903.03.03","Compressive-strength tests on"]
[null,"concrete cores","no",null,null,{"$f":"IF(TRIM(D39)=\"rate only\",\"ro\",IF(ISBLANK(E39),\" \",D39*E39))","v":" "}]
[]
["903.03.04","Asphalt tests on cores","no",null,null,{"$f":"IF(TRIM(D41)=\"rate only\",\"ro\",IF(ISBLANK(E41),\" \",D41*E41))","v":" "}]
{"$rows_empty":35}
["TOTAL CARRIED TO SUMMARY",{"$nulls":4},{"$f":"SUM(F31:F76)","v":{"v":0,"d":"R 0.00"}}]
[]
["Signature of person authorised to sign the tender:",{"$nulls":3},"Date"]

{"sheet":"Summary","index":34,"n_rows":51,"n_cols":6,"rows_kept":51,"merged":[[0,0,0,2],[40,0,40,1],[42,0,42,1],[43,0,43,1],[44,0,44,1],[45,0,45,1],[46,0,46,1],[47,0,47,1],[48,0,48,1],[50,0,50,1],[51,0,51,1]]}
["SUMMARY OF PRICING SCHEDULE"]
["SECTION","DESCRIPTION","AMOUNT"]
[]
["SERIES 0","GENERAL   "]
["001","General Requirements and Charges",{"$f":"'Section 001'!F66","v":{"v":0,"d":"R0.00"}}]
["002","Engineers Accommodation",{"$f":"'Section 002'!F24","v":{"v":0,"d":"R0.00"}}]
[{"$nulls":5},{"$f":"E7*F5","v":{"v":0,"d":"R0.00"}}]
["SERIES 1 ","ANCILLARY WORK"]
["101","Site Clearing and Grubbing",{"$f":"'Section 101'!F57","v":{"v":0,"d":"R0.00"}}]
["102","Accommodation of Traffic",{"$f":"'Section 102'!F70","v":{"v":0,"d":"R0.00"}}]
["103","Overhaul",{"$f":"'Section 103'!F22","v":{"v":0,"d":"R0.00"}}]
["104",{"$f":"'Section 104'!B5","v":"Landscaping and Grassing"},{"$f":"'Section 104'!F50","v":{"v":0,"d":"R0.00"}}]
["B107","Dayworks",{"$f":"'Section B107'!F58","v":{"v":0,"d":"R0.00"}}]
[]
["SERIES 2","EARTHWORKS"]
["201","General",{"$f":"'Section 201'!F28","v":{"v":0,"d":"R0.00"}}]
["202","Trenching",{"$f":"'Section 202'!F94","v":{"v":0,"d":"R0.00"}}]
["203","Mass Earthworks",{"$f":"'Section 203'!F99","v":{"v":0,"d":"R0.00"}}]
[]
["SERIES 5","DRAINAGE AND EROSION PROTECTION"]
["501","Subsurface Drains and Drainage Blankets",{"$f":"'Section 501'!F36","v":{"v":0,"d":"R0.00"}}]
["502","Prefabricated Culverts and Stormwater Drainage",{"$f":"'Section 502'!F145","v":{"v":0,"d":"R0.00"}}]
["503","Kerbing and Channelling",{"$f":"'Section 503'!F29","v":{"v":0,"d":"R0.00"}}]
["504","Open Drains",{"$f":"'Section 504'!F88","v":{"v":0,"d":"R0.00"}}]
["505","Erosion Protection",{"$f":"'Section 505'!F64","v":{"v":0,"d":"R0.00"}}]
[]
["SERIES 6","ROADS AND PARKING AREAS"]
["601","Gravel Pavement Layers",{"$f":"'Section 601'!F52","v":{"v":0,"d":"R0.00"}}]
["602","Crushed-stone Pavement Layers",{"$f":"'Section 602'!F37","v":{"v":0,"d":"R0.00"}}]
["603","Unpaved Areas",{"$f":"'Section 603'!F25","v":{"v":0,"d":"R0.00"}}]
["604","Stabilization",{"$f":"'Section 604'!F22","v":{"v":0,"d":"R0.00"}}]
["605","Prime Coat",{"$f":"'Section 605'!F25","v":{"v":0,"d":"R0.00"}}]
["606","Asphalt Base and Surfacing",{"$f":"'Section 606'!F50","v":{"v":0,"d":"R0.00"}}]
["609","Segmented Paving",{"$f":"'Section 609'!F23","v":{"v":0,"d":"R0.00"}}]
["612","Traffic Signs",{"$f":"'Section 612'!F36","v":{"v":0,"d":"R0.00"}}]
["613","Traffic Markings",{"$f":"'Section 613'!F42","v":{"v":0,"d":"R0.00"}}]
[]
["SERIES 9","QUALITY CONTROL"]
["903","Testing",{"$f":"'Section 903'!F77","v":{"v":0,"d":"R0.00"}}]
[]
["TOTAL SCHEDULE OF PRICES",null,{"$f":"SUM(C38:C40)","v":{"v":0,"d":"R0.00"}}]
[]
[{"$f":"CONCATENATE(\"Add \",TEXT(D43,\"0.00\"),\"% for contingencies\")","v":"Add 10.00% for contingencies"},null,null,1000]
["SUBTOTAL 1"]
[{"$f":"CONCATENATE(\"Add \",TEXT(D45,\"0.00\"),\"% CPA\")","v":"Add 0.06% CPA"},null,null,6]
["SUBTOTAL 1"]
[{"$f":"CONCATENATE(\"Add \",TEXT(D47,\"15\"),\"% VAT\")","v":"Add 15% VAT"}]
["GRAND TOTAL"]
["CONTRACT PRICE CARRIED FORWARD TO FORM OF OFFER"]
[]
["Signature of person authorised to sign the tender:",null,"Date"]

{"sheet":"Sheet2","index":35,"n_rows":0,"n_cols":0,"rows_kept":0}

{"sheet":"Master Section","index":36,"n_rows":103,"n_cols":6,"rows_kept":103,"hidden":true,"merged":[[48,0,48,4],[50,0,50,3],[50,4,50,5],[51,0,51,3],[51,4,51,5],[54,0,54,4],[100,0,100,4],[102,0,102,3],[102,4,102,5],[103,0,103,3],[103,4,103,5]]}
["ITEM","DESCRIPTION","UNIT","QTY","RATE","AMOUNT"]
[]
["SERIES #","SERIES NAME"]
[]
["Section ###","Section name"]
[]
[]
[]
[{"$nulls":5},{"$f":"IF(TRIM(D9)=\"rate only\",\"ro\",IF(OR(ISBLANK(D9),ISBLANK(E9)),\" \",D9*E9))","v":" "}]
{"$rows_empty":39}
["TOTAL CARRIED FORWARD",{"$nulls":4},{"$f":"SUM(F2:F48)","v":{"v":0,"d":"R 0.00"}}]
[]
["Signature of person authorised to sign the tender:",{"$nulls":3},"Date"]
[]
[]
["ITEM","DESCRIPTION","UNIT","QTY","RATE","AMOUNT"]
["TOTAL BROUGHT FORWARD",{"$nulls":4},{"$f":"F49","v":{"v":0,"d":"R 0.00"}}]
{"$rows_empty":45}
["TOTAL CARRIED TO SUMMARY",{"$nulls":4},{"$f":"SUM(F55:F100)","v":{"v":0,"d":"R 0.00"}}]
[]
["Signature of person authorised to sign the tender:",{"$nulls":3},"Date"]