{"text_format":"3","workbook":"xlsx","n_sheets":22,"sheets":["Summary","Prelims","Designing & Fees","Civils","Structures","Mechanical","Electrical","TESTING, COMMISIONING MAINTENAN","SUMMARY (2)","Exchange Rate& Inflation","STAGE BREAKDOWN","Monthly Cashflow-Summary","CASHFLOW-CONSTRUCTION CONS","BREAKDOWN","PM","ARCH","QS","STRUC","CIVIL","MECH","ELEC","FIRE"],"not_rendered":{"charts":3,"external_links":141,"defined_names":16787,"comments":13},"read":"whole","date_system":"1900"}

{"sheet":"Summary","index":0,"n_rows":56,"n_cols":6,"rows_kept":56,"merged":[[6,3,8,3],[6,4,8,4],[6,5,8,5]]}
["Engineer, Procure, Construct and Commission a 50 to 100 kW thermal Waste-to-Energy Test Facility at Eskom Research, Testing and Innovation Centre"]
["Revision  Rev 0"]
["Summary"]
[]
[]
[]
[{"$nulls":3},"Quantity","Rate","Total Amount"]
["Item No.","Description","Unit"]
[]
[]
{"$rows_left_out":25}
{"sheet":"Prelims","index":1,"n_rows":27,"n_cols":6,"rows_kept":27,"merged":[[5,3,7,3],[5,4,7,4],[5,5,7,5]]}
[{"$f":"+Summary!A1","v":"Engineer, Procure, Construct and Commission a 50 to 100 kW thermal Waste-to-Energy Test Facility at Eskom Research, Testing and Innovation Centre"}]
[{"$f":"+Summary!A2","v":"Revision  Rev 0"}]
["Section 01 - Preliminaries & General"]
[]
[]
[{"$nulls":3},"Quantity","Rate","Total Amount"]
["Item No.","Description","Unit"]
[]
[]
[1,"PRELIMINARIES AND GENERAL"]
{"$rows_left_out":11}
{"sheet":"Designing & Fees","index":2,"n_rows":25,"n_cols":6,"rows_kept":25,"merged":[[5,3,7,3],[5,4,7,4],[5,5,7,5]]}
[{"$f":"+Prelims!A1","v":"Engineer, Procure, Construct and Commission a 50 to 100 kW thermal Waste-to-Energy Test Facility at Eskom Research, Testing and Innovation Centre"}]
[{"$f":"+Prelims!A2","v":"Revision  Rev 0"}]
["Section 02 -Designing & Professional Fees"]
[]
[]
[{"$nulls":3},"Quantity","Rate","Total Amount"]
["Item No.","Description","Unit"]
[]
[]
[2,"PROFFESIONAL FEES"]
{"$rows_left_out":16}
{"sheet":"Civils","index":3,"n_rows":42,"n_cols":6,"rows_kept":42,"merged":[[6,3,8,3],[6,4,8,4],[6,5,8,5]]}
[{"$f":"+'Designing & Fees'!A1","v":"Engineer, Procure, Construct and Commission a 50 to 100 kW thermal Waste-to-Energy Test Facility at Eskom Research, Testing and Innovation Centre"}]
[{"$f":"+'Designing & Fees'!A2","v":"Revision  Rev 0"}]
["Section 03 - Civil Works"]
[]
[]
[]
[{"$nulls":3},"Quantity","Rate","Total Amount"]
["Item No.","Description","Unit"]
[]
[]
{"$rows_left_out":33}
{"sheet":"Structures","index":4,"n_rows":43,"n_cols":6,"rows_kept":43,"merged":[[6,3,8,3],[6,4,8,4],[6,5,8,5]]}
[{"$f":"+'Designing & Fees'!A1","v":"Engineer, Procure, Construct and Commission a 50 to 100 kW thermal Waste-to-Energy Test Facility at Eskom Research, Testing and Innovation Centre"}]
[{"$f":"+'Designing & Fees'!A2","v":"Revision  Rev 0"}]
["Section 04 - Structures"]
[]
[]
[]
[{"$nulls":3},"Quantity","Rate","Total Amount"]
["Item No.","Description","Unit"]
[]
[]
{"$rows_left_out":34}
{"sheet":"Mechanical","index":5,"n_rows":63,"n_cols":6,"rows_kept":63,"merged":[[6,3,8,3],[6,4,8,4],[6,5,8,5]]}
[{"$f":"+'Designing & Fees'!A1","v":"Engineer, Procure, Construct and Commission a 50 to 100 kW thermal Waste-to-Energy Test Facility at Eskom Research, Testing and Innovation Centre"}]
[{"$f":"+'Designing & Fees'!A2","v":"Revision  Rev 0"}]
["Section 05 - Mechanical & Fire"]
[]
[]
[]
[{"$nulls":3},"Quantity","Rate","Total Amount"]
["Item No.","Description","Unit"]
[]
[]
{"$rows_left_out":54}
{"sheet":"Electrical","index":6,"n_rows":55,"n_cols":6,"rows_kept":55,"merged":[[6,3,8,3],[6,4,8,4],[6,5,8,5]]}
[{"$f":"+'Designing & Fees'!A1","v":"Engineer, Procure, Construct and Commission a 50 to 100 kW thermal Waste-to-Energy Test Facility at Eskom Research, Testing and Innovation Centre"}]
[{"$f":"+'Designing & Fees'!A2","v":"Revision  Rev 0"}]
["Section 06 - Electrical Installations"]
[]
[]
[]
[{"$nulls":3},"Quantity","Rate","Total Amount"]
["Item No.","Description","Unit"]
[]
[]
{"$rows_left_out":22}
{"sheet":"TESTING, COMMISIONING MAINTENAN","index":7,"n_rows":50,"n_cols":6,"rows_kept":50,"merged":[[6,3,8,3],[6,4,8,4],[6,5,8,5]]}
[{"$f":"+'Designing & Fees'!A1","v":"Engineer, Procure, Construct and Commission a 50 to 100 kW thermal Waste-to-Energy Test Facility at Eskom Research, Testing and Innovation Centre"}]
[{"$f":"+'Designing & Fees'!A2","v":"Revision  Rev 0"}]
["Section 07 - Testing, Comminitioning and Technical Support"]
[]
[]
[]
[{"$nulls":3},"Quantity","Rate","Total Amount"]
["Item No.","Description","Unit"]
[]
[]
{"$rows_left_out":11}
{"sheet":"SUMMARY (2)","index":8,"n_rows":41,"n_cols":46,"rows_kept":41,"hidden":true,"merged":[[3,0,3,3],[7,7,7,23],[7,25,7,43],[9,7,11,7],[9,9,11,9],[9,11,11,11],[9,13,11,13],[9,15,11,15],[9,17,11,17],[9,19,11,19],[9,21,11,21],[9,23,11,23],[9,25,11,25],[9,27,11,27],[9,29,11,29],[9,31,11,31],[9,33,11,33],[9,35,11,35],[9,37,11,37],[9,39,11,39],[9,41,11,41],[9,43,11,43],[27,1,27,2],[27,3,27,4],[32,3,32,4]]}
[{"$f":"+'TESTING, COMMISIONING MAINTENAN'!A1","v":"Engineer, Procure, Construct and Commission a 50 to 100 kW thermal Waste-to-Energy Test Facility at Eskom Research, Testing and Innovation Centre"}]
[{"$f":"+'TESTING, COMMISIONING MAINTENAN'!A2","v":"Revision  Rev 0"}]
[]
[]
[]
[]
[]
[{"$nulls":7},"CORE CONSULTANTS",{"$nulls":17},"ADVISORY CONSULTANTS"]
[]
[{"$nulls":7},"Project Manager",null,{"$f":"BREAKDOWN!J19","v":"Architect"},null,{"$f":"BREAKDOWN!M19","v":"Quantity Surveyor"},null,{"$f":"BREAKDOWN!P19","v":"Structural Engineer"},null,{"$f":"BREAKDOWN!S19","v":"Civil Engineer"},null,{"$f":"BREAKDOWN!V19","v":"Mechanical Engineer"},null,{"$f":"BREAKDOWN!Y19","v":"Electrical Engineer"},null,{"$f":"BREAKDOWN!AE19","v":"Fire Engineer"},null,{"$f":"BREAKDOWN!AH19","v":"Wet Services"},null,"Project Manager",null,{"$f":"BREAKDOWN!AB19","v":"Rational Fire Engineer"},null,{"$f":"BREAKDOWN!AK19","v":"Landscape Architect"},null,"Safety Consultant",null,"Façade Engineer",null,"Green Consultant",null,"Lift Consultant",null,"Acoustic Consultant",null,"Services Co-ordination ",null,"Tenant Co-ordinator"]
{"$rows_left_out":32}
{"sheet":"Exchange Rate& Inflation","index":9,"n_rows":725,"n_cols":9,"rows_kept":725,"hidden":true,"merged":[[1,7,1,10],[5,2,5,3]]}
[]
[{"$nulls":5},{"$f":"++#REF!","v":{"$error":"#REF!"}}]
[]
["PROJECT DESCRIPTION :",null,{"$f":"+'TESTING, COMMISIONING MAINTENAN'!A1","v":"Engineer, Procure, Construct and Commission a 50 to 100 kW thermal Waste-to-Energy Test Facility at Eskom Research, Testing and Innovation Centre"}]
[]
[]
[null,"Stock No.","Description","Quantity","Rate ","Amount "]
[null,null,"Mechanical"]
[]
[null,null,"Eectrolysers"]
{"$rows_left_out":351}
{"sheet":"STAGE BREAKDOWN","index":10,"n_rows":70,"n_cols":47,"rows_kept":70,"hidden":true,"merged":[[3,0,3,2],[8,7,8,23],[8,25,8,42],[10,3,12,3],[10,5,12,5],[10,7,12,7],[10,9,12,9],[10,11,12,11],[10,13,12,13],[10,15,12,15],[10,17,12,17],[10,19,12,19],[10,21,12,21],[10,23,12,23],[10,25,12,25],[10,27,12,27],[10,29,12,29],[10,31,12,31],[10,33,12,33],[10,35,12,35],[10,36,12,36],[10,38,12,38],[10,40,12,40],[10,42,12,42],[60,3,60,5]]}
[{"$f":"+'SUMMARY (2)'!A1","v":"Engineer, Procure, Construct and Commission a 50 to 100 kW thermal Waste-to-Energy Test Facility at Eskom Research, Testing and Innovation Centre"}]
[{"$f":"+'SUMMARY (2)'!A2","v":"Revision  Rev 0"}]
[]
[]
[]
[]
["PROFESSIONAL FEES BREAKDOWN"]
[]
[{"$nulls":7},"CORE CONSULTANTS",{"$nulls":17},"ADVISORY CONSULTANTS",{"$nulls":19},{"$f":"5310/4","v":1327.5}]
[]
{"$rows_left_out":38}
{"sheet":"Monthly Cashflow-Summary","index":11,"n_rows":193,"n_cols":37,"rows_kept":193,"hidden":true,"merged":[[6,0,6,1],[12,17,12,31],[13,2,14,2],[13,17,13,31],[14,17,14,29],[16,17,16,29],[18,17,18,19],[18,20,18,21],[18,22,18,29],[18,30,18,31]]}
["Renewable Hydrogen Facility (RHF) "]
[]
[]
[]
["PROJECT CASHFLOW "]
[]
[{"$f":"+TODAY()","v":"2026-08-04"}]
[]
[]
[null,"PROJECT CASHFLOW"]
{"$rows_left_out":159}
{"sheet":"CASHFLOW-CONSTRUCTION CONS","index":12,"n_rows":109,"n_cols":16,"rows_kept":109,"hidden":true,"merged":[[5,1,5,2]]}
[]
[null,{"$f":"+'TESTING, COMMISIONING MAINTENAN'!A1","v":"Engineer, Procure, Construct and Commission a 50 to 100 kW thermal Waste-to-Energy Test Facility at Eskom Research, Testing and Innovation Centre"},{"$nulls":10},7]
[]
[null,"CONSTRUCTION CASHFLOW "]
[]
[null,{"$f":"+TODAY()","v":"2026-08-04"}]
[]
[null,"PRINCIPAL CONTRACTOR",{"$nulls":5},"tbc"]
[null,"CONTRACT COMMENCEMENT DATE ",{"$nulls":3},"A",":","2025-08-01"]
[null,"COMPLETION DATE",{"$nulls":3},"B",":","2026-02-01"]
{"$rows_left_out":69}
{"sheet":"BREAKDOWN","index":13,"n_rows":92,"n_cols":47,"rows_kept":92,"hidden":true,"merged":[[3,0,3,3],[18,6,20,7],[18,8,20,8],[18,9,20,10],[18,11,20,11],[18,12,20,13],[18,14,20,14],[18,15,20,16],[18,17,20,17],[18,18,20,19],[18,20,20,20],[18,21,20,22],[18,23,20,23],[18,24,20,25],[18,26,20,26],[18,27,20,28],[18,29,20,29],[18,30,20,31],[18,32,20,32],[18,33,20,34],[18,35,20,35],[18,36,20,37],[18,38,20,38],[18,39,20,40],[21,6,22,6],[21,7,22,7],[21,9,22,9],[21,10,22,10],[21,12,22,12],[21,13,22,13],[21,15,22,15],[21,16,22,16],[21,18,22,18],[21,19,22,19],[21,21,22,21],[21,22,22,22],[21,24,22,24],[21,25,22,25],[21,27,22,27],[21,28,22,28],[21,30,22,30],[21,31,22,31],[21,33,22,33],[21,34,22,34],[21,36,22,36],[21,37,22,37],[21,39,22,39],[21,40,22,40],[23,42,23,46],[31,3,31,4],[62,42,62,46],[63,45,63,46],[64,45,64,46],[65,1,65,4],[65,45,65,46],[66,45,66,46],[67,45,67,46],[68,45,68,46],[69,45,69,46],[70,45,70,46],[71,45,71,46],[74,42,74,46],[75,45,75,46]]}
[{"$f":"+'STAGE BREAKDOWN'!A1","v":"Engineer, Procure, Construct and Commission a 50 to 100 kW thermal Waste-to-Energy Test Facility at Eskom Research, Testing and Innovation Centre"}]
[{"$f":"+'STAGE BREAKDOWN'!A2","v":"Revision  Rev 0"}]
{"$rows_empty":16}
[{"$nulls":6},"Project Manager",null,null,"Architect",null,null,"Quantity Surveyor",null,null,"Structural Engineer",null,null,"Civil Engineer",null,null,"Mechanical Engineer",null,null,"Electrical Engineer",null,null,"Rational Fire Engineer",null,null,"Fire Engineer",null,null,"Wet Services",null,null,"Landscape Architect",null,null,"Sundry Fees Allowance"]
["No.","Element",{"$nulls":3},"Total",{"$nulls":6},"Quantity Surveyor"]
[]
[{"$nulls":6},"%","Value for fee purposes",null,"%","Value for fee purposes",null,"%","Value for fee purposes",null,"%","Value for fee purposes",null,"%","Value for fee purposes",null,"%","Value for fee purposes",null,"%","Value for fee purposes",null,"%","Value for fee purposes",null,"%","Value for fee purposes",null,"%","Value for fee purposes",null,"%","Value for fee purposes",null,"%","Value for fee purposes"]
[]
[{"$nulls":42},"DO NOT DELETE"]
[{"v":1,"d":"1.0"},"BUILDING WORKS & FINISHES ETC.,",{"$nulls":42},"ARCH as Principal Agent",false,{"$f":"((AT25*1))","v":{"v":0,"d":"0.00"}}]
{"$rows_left_out":68}
{"sheet":"PM","index":14,"n_rows":65,"n_cols":17,"rows_kept":65,"hidden":true,"merged":[[15,1,15,4],[15,10,15,12],[16,1,16,2],[16,5,16,8],[51,2,51,3]]}
[]
[null,{"$f":"UPPER(BREAKDOWN!G19)","v":"PROJECT MANAGER"},{"$nulls":7},{"$f":"IF(AND($P$36=0,$P$55=0),\"\",\"ERROR ON SHEET\")","v":{"$error":"#DIV/0!"}},null,null,"Act No. 48 of 2000"]
[{"$nulls":12},"SACPCMP Guideline Tariff of Fees - Effective January 2012"]
[null,"Variables"]
[]
["•","Value for fee purposes",null,{"$f":"+BREAKDOWN!H71","v":{"$error":"#DIV/0!"}}]
[]
["•","Discount %",null,{"$f":"+BREAKDOWN!H73","v":{"v":0.45,"d":"45%"}}]
[]
["•","Disbursement %",null,{"$f":"IF(BREAKDOWN!$AR$77=1,(BREAKDOWN!H75/100),0)","v":{"v":0,"d":"0%"}},null,1,null,null,{"$f":"IF(D10>0,F10,0)","v":0}]
{"$rows_left_out":56}
{"sheet":"ARCH","index":15,"n_rows":83,"n_cols":17,"rows_kept":83,"hidden":true,"merged":[[5,4,5,10],[16,1,16,4],[16,10,16,12],[17,1,17,2],[17,5,17,8],[63,2,63,3],[64,2,64,3],[73,1,73,12],[74,1,74,12],[76,1,76,12]]}
[{"$nulls":10},"`"]
[null,{"$f":"UPPER(BREAKDOWN!J19)","v":"ARCHITECT"},null,null,{"$f":"IF(AND($P$39=0,$P$68=0),\"\",\"ERROR ON SHEET\")","v":{"$error":"#DIV/0!"}},{"$nulls":7},"Board Notice 73 of 2015"]
[{"$nulls":12},"SACAP Professional Fees Guideline - Effective March 2015"]
[null,"Variables"]
[]
["•","Value for fee purposes",null,{"$f":"BREAKDOWN!K71","v":{"$error":"#DIV/0!"}},"Including alteration value"]
[]
["•","Alteration value",null,{"$f":"BREAKDOWN!K38","v":0}]
[]
["•","Discount %",null,{"$f":"+BREAKDOWN!K73","v":{"v":0.45,"d":"45%"}}]
{"$rows_left_out":74}
{"sheet":"QS","index":16,"n_rows":167,"n_cols":21,"rows_kept":167,"hidden":true,"merged":[[1,9,1,10],[5,4,5,10],[9,4,9,10],[18,1,18,4],[18,10,18,12],[19,1,19,2],[19,5,19,8],[41,1,42,1],[41,2,41,12],[42,5,42,9],[43,5,43,9],[44,5,44,9],[45,5,45,9],[46,5,46,9],[47,5,47,9],[57,1,58,1],[57,2,57,10],[68,2,68,4],[69,2,69,4],[74,1,75,1],[74,2,74,3],[84,1,84,2],[84,3,84,4],[85,1,85,2],[85,3,85,4],[86,3,86,4],[87,1,87,2],[87,3,87,4],[88,1,88,2],[88,3,88,4],[89,3,89,4],[90,1,90,2],[90,3,90,4],[91,3,91,4],[92,1,92,2],[92,3,92,4],[93,1,93,2],[93,3,93,4],[94,1,94,2],[94,3,94,4],[109,4,109,11],[112,4,112,11],[125,1,127,1],[125,2,125,12]]}
[]
[null,{"$f":"UPPER(BREAKDOWN!M19)","v":"QUANTITY SURVEYOR"},{"$nulls":7},{"$f":"IF(AND($P$99=0,$P$121=0),\"\",\"ERROR ON SHEET\")","v":{"$error":"#DIV/0!"}},null,null,"Act 49 of 2000"]
[{"$nulls":12},"SACQSP 2015 Tariff of Professional Fees Schedule - Effective August  2015"]
[null,"Variables"]
[]
["•","Value for fee purposes",null,{"$f":"+BREAKDOWN!N71","v":{"$error":"#DIV/0!"}},"Including alteration value"]
[]
["•","Alteration value",null,{"$f":"BREAKDOWN!N38","v":0}]
[]
["•","Redecoration works value",null,0,"Input value"]
{"$rows_left_out":158}
{"sheet":"STRUC","index":17,"n_rows":133,"n_cols":20,"rows_kept":133,"hidden":true,"merged":[[0,0,0,13],[1,9,1,10],[5,4,5,11],[7,4,7,12],[22,1,22,10],[22,11,22,12],[23,1,23,10],[23,11,23,12],[24,11,24,12],[25,11,25,12],[26,11,26,12],[27,11,27,12],[28,11,28,12],[29,11,29,12],[30,11,30,12],[31,11,31,12],[32,11,32,12],[33,11,33,12],[34,11,34,12],[35,11,35,12],[36,11,36,12],[37,11,37,12],[38,11,38,12],[39,11,39,12],[40,11,40,12],[41,11,41,12],[42,11,42,12],[43,11,43,12],[44,11,44,12],[45,11,45,12],[46,11,46,12],[47,11,47,12],[48,11,48,12],[49,11,49,12],[50,11,50,12],[51,11,51,12],[52,11,52,12],[53,11,53,12],[54,11,54,12],[55,11,55,12],[56,11,56,12],[57,11,57,12],[58,11,58,12],[59,11,59,12],[60,11,60,12],[61,11,61,12],[62,11,62,12],[63,11,63,12],[64,11,64,12],[65,11,65,12],[66,11,66,12],[67,11,67,12],[68,11,68,12],[71,15,71,20],[76,1,76,2],[86,9,86,10],[87,9,87,10],[88,9,88,10],[89,9,89,10],[89,15,89,16],[90,9,90,10],[90,15,90,16],[91,9,91,10],[91,15,91,16],[92,9,92,10],[92,15,92,16],[93,9,93,10],[94,9,94,10],[94,15,94,16],[95,15,95,16],[96,15,96,16],[97,15,97,16],[107,1,107,3],[107,9,107,11],[108,1,108,2],[108,9,108,10]]}
[]
[null,{"$f":"UPPER(BREAKDOWN!P19)","v":"STRUCTURAL ENGINEER"},{"$nulls":7},{"$f":"IF(AND($P$12=0,$P$124=0),\"\",\"ERROR ON SHEET\")","v":{"$error":"#DIV/0!"}},null,null,"Act 46 of 2000"]
[{"$nulls":12},"ECSA Guideline for Services and Process for estimating fees"]
[null,"Variables"]
[]
["•","Value for fee purposes",null,{"$f":"+BREAKDOWN!Q71","v":{"$error":"#DIV/0!"}},"Excluding Preliminaries and Escalation"]
[]
["•","Main Contractor Preliminaries",null,{"$f":"BREAKDOWN!Q64","v":0},"Pro-rata of Main Contractors Preliminaries on Value of Engineering works"]
[]
["•","Escalation",null,0,{"$nulls":11},"ALL CHECKS TO BE = 0"]
{"$rows_left_out":124}
{"sheet":"CIVIL","index":18,"n_rows":133,"n_cols":20,"rows_kept":133,"hidden":true,"merged":[[0,0,0,13],[1,9,1,10],[5,4,5,11],[22,1,22,10],[22,11,22,12],[23,1,23,10],[23,11,23,12],[24,11,24,12],[25,11,25,12],[26,11,26,12],[27,11,27,12],[28,11,28,12],[29,11,29,12],[30,11,30,12],[31,11,31,12],[32,11,32,12],[33,11,33,12],[34,11,34,12],[35,11,35,12],[36,11,36,12],[37,11,37,12],[38,11,38,12],[39,11,39,12],[40,11,40,12],[41,11,41,12],[42,11,42,12],[43,11,43,12],[44,11,44,12],[45,11,45,12],[46,11,46,12],[47,11,47,12],[48,11,48,12],[49,11,49,12],[50,11,50,12],[51,11,51,12],[52,11,52,12],[53,11,53,12],[54,11,54,12],[55,11,55,12],[56,11,56,12],[57,11,57,12],[58,11,58,12],[59,11,59,12],[60,11,60,12],[61,11,61,12],[62,11,62,12],[63,11,63,12],[64,11,64,12],[65,11,65,12],[66,11,66,12],[67,11,67,12],[68,11,68,12],[71,15,71,20],[76,1,76,2],[86,9,86,10],[86,11,86,12],[87,9,87,10],[87,11,87,12],[88,9,88,10],[88,11,88,12],[89,9,89,10],[89,11,89,12],[89,15,89,16],[90,9,90,10],[90,11,90,12],[90,15,90,16],[91,9,91,10],[91,11,91,12],[91,15,91,16],[92,9,92,10],[92,11,92,12],[92,15,92,16],[93,9,93,10],[93,11,93,12],[94,9,94,10],[94,11,94,12],[107,1,107,3],[107,9,107,11],[108,1,108,2],[108,9,108,10]]}
[]
[null,{"$f":"UPPER(BREAKDOWN!S19)","v":"CIVIL ENGINEER"},{"$nulls":7},{"$f":"IF(AND($P$12=0,$P$124=0),\"\",\"ERROR ON SHEET\")","v":{"$error":"#DIV/0!"}},null,null,"Act 46 of 2000"]
[{"$nulls":12},"ECSA Guideline for Services and Process for estimating fees"]
[null,"Variables"]
[]
["•","Value for fee purposes",null,{"$f":"+BREAKDOWN!T71","v":{"$error":"#DIV/0!"}},"Excluding Preliminaries and Escalation"]
[]
["•","Main Contractor Preliminaries",null,{"$f":"BREAKDOWN!T64","v":0},"Pro-rata of Main Contractors Preliminaries on Value of Engineering works"]
[]
["•","Escalation",null,0,{"$nulls":11},"ALL CHECKS TO BE = 0"]
{"$rows_left_out":124}
{"sheet":"MECH","index":19,"n_rows":97,"n_cols":20,"rows_kept":97,"hidden":true,"merged":[[0,0,0,13],[1,9,1,10],[5,4,5,11],[22,1,22,10],[22,11,22,12],[23,1,23,10],[23,11,23,12],[24,11,24,12],[25,11,25,12],[26,11,26,12],[27,11,27,12],[28,11,28,12],[29,11,29,12],[30,11,30,12],[31,11,31,12],[32,11,32,12],[33,11,33,12],[34,11,34,12],[35,11,35,12],[36,11,36,12],[37,11,37,12],[38,11,38,12],[39,11,39,12],[40,11,40,12],[41,11,41,12],[44,15,44,20],[49,1,49,2],[59,9,59,10],[59,11,59,12],[60,9,60,10],[60,11,60,12],[61,9,61,10],[61,11,61,12],[62,9,62,10],[62,11,62,12],[62,15,62,16],[63,9,63,10],[63,11,63,12],[63,15,63,16],[64,9,64,10],[64,11,64,12],[64,15,64,16],[65,9,65,10],[65,11,65,12],[65,15,65,16],[66,9,66,10],[66,11,66,12],[67,9,67,10],[67,11,67,12]]}
[]
[null,{"$f":"UPPER(BREAKDOWN!V19)","v":"MECHANICAL ENGINEER"},{"$nulls":7},{"$f":"IF(AND($P$12=0,$P$88=0),\"\",\"ERROR ON SHEET\")","v":{"$error":"#DIV/0!"}},null,null,"Act 46 of 2000"]
[{"$nulls":12},"ECSA Guideline for Services and Process for estimating fees"]
[null,"Variables"]
[]
["•","Value for fee purposes",null,{"$f":"+BREAKDOWN!W71","v":{"$error":"#DIV/0!"}}]
[]
["•","Main Contractor Preliminaries",null,{"$f":"BREAKDOWN!W64","v":0}]
[]
["•","Escalation",null,{"$f":"BREAKDOWN!W68+BREAKDOWN!W69","v":{"$error":"#DIV/0!"}},{"$nulls":11},"ALL CHECKS TO BE = 0"]
{"$rows_left_out":88}
{"sheet":"ELEC","index":20,"n_rows":95,"n_cols":20,"rows_kept":95,"hidden":true,"merged":[[0,0,0,13],[1,9,1,10],[5,4,5,11],[22,1,22,10],[22,11,22,12],[23,1,23,10],[23,11,23,12],[24,11,24,12],[25,11,25,12],[26,11,26,12],[27,11,27,12],[28,11,28,12],[29,11,29,12],[30,11,30,12],[31,11,31,12],[32,11,32,12],[33,11,33,12],[34,11,34,12],[35,11,35,12],[36,11,36,12],[37,11,37,12],[38,11,38,12],[39,11,39,12],[42,15,42,20],[47,1,47,2],[57,9,57,10],[57,11,57,12],[58,9,58,10],[58,11,58,12],[59,9,59,10],[59,11,59,12],[60,9,60,10],[60,11,60,12],[60,15,60,16],[61,9,61,10],[61,11,61,12],[61,15,61,16],[62,9,62,10],[62,11,62,12],[62,15,62,16],[63,9,63,10],[63,11,63,12],[63,15,63,16],[64,9,64,10],[64,11,64,12],[65,9,65,10],[65,11,65,12],[105,2,108,8]]}
[]
[null,{"$f":"UPPER(BREAKDOWN!Y19)","v":"ELECTRICAL ENGINEER"},{"$nulls":7},{"$f":"IF(AND($P$12=0,$P$87=0),\"\",\"ERROR ON SHEET\")","v":{"$error":"#DIV/0!"}},null,null,"Act 46 of 2000"]
[{"$nulls":12},"ECSA Guideline for Services and Process for estimating fees"]
[null,"Variables"]
[]
["•","Value for fee purposes",null,{"$f":"+BREAKDOWN!Z71","v":{"$error":"#DIV/0!"}}]
[]
["•","Main Contractor Preliminaries",null,{"$f":"BREAKDOWN!Z64","v":0}]
[]
["•","Escalation",null,{"$f":"BREAKDOWN!Z68+BREAKDOWN!Z69","v":{"$error":"#DIV/0!"}},{"$nulls":11},"ALL CHECKS TO BE = 0"]
{"$rows_left_out":86}
{"sheet":"FIRE","index":21,"n_rows":95,"n_cols":20,"rows_kept":95,"hidden":true,"merged":[[0,0,0,13],[1,9,1,10],[5,4,5,11],[22,1,22,10],[22,11,22,12],[23,1,23,10],[23,11,23,12],[24,11,24,12],[25,11,25,12],[26,11,26,12],[27,11,27,12],[28,11,28,12],[29,11,29,12],[30,11,30,12],[31,11,31,12],[32,11,32,12],[33,11,33,12],[34,11,34,12],[35,11,35,12],[36,11,36,12],[37,11,37,12],[38,11,38,12],[39,11,39,12],[42,15,42,20],[47,1,47,2],[57,9,57,10],[57,11,57,12],[58,9,58,10],[58,11,58,12],[59,9,59,10],[59,11,59,12],[60,9,60,10],[60,11,60,12],[60,15,60,16],[61,9,61,10],[61,11,61,12],[61,15,61,16],[62,9,62,10],[62,11,62,12],[62,15,62,16],[63,9,63,10],[63,11,63,12],[63,15,63,16],[64,9,64,10],[64,11,64,12],[65,9,65,10],[65,11,65,12],[105,2,108,8]]}
[]
[null,{"$f":"+BREAKDOWN!AE19","v":"Fire Engineer"},{"$nulls":7},{"$f":"IF(AND($P$12=0,$P$87=0),\"\",\"ERROR ON SHEET\")","v":{"$error":"#DIV/0!"}},null,null,"Act 46 of 2000"]
[{"$nulls":12},"ECSA Guideline for Services and Process for estimating fees"]
[null,"Variables"]
[]
["•","Value for fee purposes",null,{"$f":"+BREAKDOWN!AF66","v":{"$error":"#DIV/0!"}}]
[]
["•","Main Contractor Preliminaries",null,{"$f":"BREAKDOWN!Z64","v":0}]
[]
["•","Escalation",null,{"$f":"BREAKDOWN!Z68+BREAKDOWN!Z69","v":{"$error":"#DIV/0!"}},{"$nulls":11},"ALL CHECKS TO BE = 0"]
{"$rows_left_out":85}