{"text_format":"3","workbook":"xlsx","n_sheets":5,"sheets":["Functional Requirements","Change management Requirements","Accreditation and Certification","Technical Requirements","Evaluation Criteria"],"not_rendered":{"images":2,"defined_names":6},"read":"whole","date_system":"1900"}

{"sheet":"Functional Requirements","index":0,"n_rows":864,"n_cols":10,"rows_kept":864,"merged":[[0,0,0,8],[1,0,2,0],[1,1,2,1],[1,2,2,2],[1,3,2,3],[1,4,2,4],[1,5,2,5],[1,6,1,7],[1,8,2,8]]}
["Council for Geoscience Functional Requirements"]
["Section","Process","No","Must Have","Nice to have ","Description","Response",null,"Give a description of the module which provides this funtionality "]
[{"$nulls":6},"COMPLY","NOT COMPLY"]
["Human Resource Management","Recruitment Management",1,"ü",null,"The system should have a facility to create or import a job profile online  ",{"$nulls":3},{"$f":"IF(#REF!=\"X\",1,IF(#REF!=\"X\",0,0))","v":{"$error":"#REF!"}}]
["Human Resource Management","Recruitment Management",2,"ü",null,"The system should have a facility to create and access staff requisitions online ",{"$nulls":3},{"$f":"IF(#REF!=\"X\",1,IF(#REF!=\"X\",0,0))","v":{"$error":"#REF!"}}]
["Human Resource Management","Recruitment Management",3,"ü",null,"The system should have a facility to search for eligible applicants from a list of previously submitted applications online ",{"$nulls":3},{"$f":"IF(#REF!=\"X\",1,IF(#REF!=\"X\",0,0))","v":{"$error":"#REF!"}}]
["Human Resource Management","Recruitment Management",4,"ü",null,"The system should have a facility for applicants to apply for positions online",{"$nulls":3},{"$f":"IF(#REF!=\"X\",1,IF(#REF!=\"X\",0,0))","v":{"$error":"#REF!"}}]
["Human Resource Management","Recruitment Management",5,"ü",null,"The system should have facility to import CVs from the Internet or email ",{"$nulls":3},{"$f":"IF(#REF!=\"X\",1,IF(#REF!=\"X\",0,0))","v":{"$error":"#REF!"}}]
["Human Resource Management","Recruitment Management",6,"ü",null,"The system should be able to filter through applicants and shortlist ",{"$nulls":3},{"$f":"IF(#REF!=\"X\",1,IF(#REF!=\"X\",0,0))","v":{"$error":"#REF!"}}]
["Human Resource Management","Recruitment Management",7,"ü",null,"The system should enable workflow for forwarding application forms and CVs to reviewers and approvers ",{"$nulls":3},{"$f":"IF(#REF!=\"X\",1,IF(#REF!=\"X\",0,0))","v":{"$error":"#REF!"}}]
["Human Resource Management","Recruitment Management",8,"ü",null,"The system should allow for tracking of forwarded applications ",{"$nulls":3},{"$f":"IF(#REF!=\"X\",1,IF(#REF!=\"X\",0,0))","v":{"$error":"#REF!"}}]
["Human Resource Management","Recruitment Management",9,"ü",null,"The system should have a facility to schedule interviews on-line through sending an email to the shortlisted candidate ",{"$nulls":3},{"$f":"IF(#REF!=\"X\",1,IF(#REF!=\"X\",0,0))","v":{"$error":"#REF!"}}]
["Human Resource Management","Recruitment Management",10,null,"ü","The system should have a facility to route and track interview results ",{"$nulls":3},{"$f":"IF(#REF!=\"X\",1,IF(#REF!=\"X\",0,0))","v":{"$error":"#REF!"}}]
["Human Resource Management","Recruitment Management",11,"ü",null,"The system should have a facility to customise recruitment letters by merging files with a word processing template ",{"$nulls":3},{"$f":"IF(#REF!=\"X\",1,IF(#REF!=\"X\",0,0))","v":{"$error":"#REF!"}}]
["Human Resource Management","Recruitment Management",12,"ü",null,"The system should have a facility to track progress of the application throughout the process which includes motivations for appointments ",{"$nulls":3},{"$f":"IF(#REF!=\"X\",1,IF(#REF!=\"X\",0,0))","v":{"$error":"#REF!"}}]
["Human Resource Management","Recruitment Management",13,"ü",null,"Should have a facility to derive competencies automatically from existing job profiles ",{"$nulls":3},{"$f":"IF(#REF!=\"X\",1,IF(#REF!=\"X\",0,0))","v":{"$error":"#REF!"}}]
["Human Resource Management","Recruitment Management",14,"ü",null,"The system should enable competency matching between applicants’ competencies and vacancies and provide an initial shortlist of candidates ",{"$nulls":3},{"$f":"IF(#REF!=\"X\",1,IF(#REF!=\"X\",0,0))","v":{"$error":"#REF!"}}]
["Human Resource Management","Recruitment Management",15,"ü",null,"Cater for employee onboarding (i.e. notify IT, Protection Services, SHEQ etc if necessary) ",{"$nulls":3},{"$f":"IF(#REF!=\"X\",1,IF(#REF!=\"X\",0,0))","v":{"$error":"#REF!"}}]
["Human Resource Management","Employee Profiling",16,"ü",null,"The system should have a central database containing all employee information with restricted access",{"$nulls":3},{"$f":"IF(#REF!=\"X\",1,IF(#REF!=\"X\",0,0))","v":{"$error":"#REF!"}}]
["Human Resource Management","Employee Profiling",17,"ü",null,"The system should have a facility to search through employee records for information on experience and skills",{"$nulls":3},{"$f":"IF(#REF!=\"X\",1,IF(#REF!=\"X\",0,0))","v":{"$error":"#REF!"}}]
["Human Resource Management","Employee Profiling",18,"ü",null,"The system should track and store information on employee education and training",{"$nulls":3},{"$f":"IF(#REF!=\"X\",1,IF(#REF!=\"X\",0,0))","v":{"$error":"#REF!"}}]
["Human Resource Management","Employee Profiling",19,"ü",null,"The system should enable updating capability to the employee",{"$nulls":3},{"$f":"IF(#REF!=\"X\",1,IF(#REF!=\"X\",0,0))","v":{"$error":"#REF!"}}]
["Human Resource Management","Employee Profiling",20,"ü",null,"The system should provide an employee record in a database that stores personal information, experience, training, competency profile, promotions, performance appraisals and salary reviews ",{"$nulls":3},{"$f":"IF(#REF!=\"X\",1,IF(#REF!=\"X\",0,0))","v":{"$error":"#REF!"}}]
["Human Resource Management","Employee Profiling",21,"ü",null,"The system should update employee competency profile with competencies acquired from training ",{"$nulls":3},{"$f":"IF(#REF!=\"X\",1,IF(#REF!=\"X\",0,0))","v":{"$error":"#REF!"}}]
["Human Resource Management","Employee Profiling",22,"ü",null,"The system should have a personnel file structure as defined by the HR Department and Management",{"$nulls":3},{"$f":"IF(#REF!=\"X\",1,IF(#REF!=\"X\",0,0))","v":{"$error":"#REF!"}}]
["Human Resource Management","Employee Profiling",23,"ü",null,"The system should have a facility to identify gaps between an employee's competency profile and the competency profile of their job ",{"$nulls":3},{"$f":"IF(#REF!=\"X\",1,IF(#REF!=\"X\",0,0))","v":{"$error":"#REF!"}}]
["Human Resource Management","Employee Self Service",24,"ü",null," The system should have Employee Self Service (ESS) ",{"$nulls":3},{"$f":"IF(#REF!=\"X\",1,IF(#REF!=\"X\",0,0))","v":{"$error":"#REF!"}}]
["Human Resource Management","Employee Self Service",25,"ü",null,"Employee Self Service Module to satisfy the following (not limited to the below): Requesting and approval of leave (initiate workflow for leave to be approved), Request correction of personal information, Submit timesheets, View training record, View performance details, Upload & update of CV’s, Capturing of travel claim, Cancellation of leave that has been approved ",{"$nulls":3},{"$f":"IF(#REF!=\"X\",1,IF(#REF!=\"X\",0,0))","v":{"$error":"#REF!"}}]
["Human Resource Management","Employee Self Service",26,"ü",null,"The system should be able to do a leave trend analysis to assist in identifying leave abnormalities ",{"$nulls":3},{"$f":"IF(#REF!=\"X\",1,IF(#REF!=\"X\",0,0))","v":{"$error":"#REF!"}}]
["Human Resource Management","Employee Self Service",27,"ü",null,"The system must have multi-level approval",{"$nulls":3},{"$f":"IF(#REF!=\"X\",1,IF(#REF!=\"X\",0,0))","v":{"$error":"#REF!"}}]
["Human Resource Management","Employee Self Service",28,"ü",null,"The ESS must have record of all documentation and records relating to an employee",{"$nulls":3},{"$f":"IF(#REF!=\"X\",1,IF(#REF!=\"X\",0,0))","v":{"$error":"#REF!"}}]
["Human Resource Management","Employee Self Service",29,"ü",null,"The ESS must have functionality to query employee retirement plans, bonus, annual increment ",{"$nulls":3},{"$f":"IF(#REF!=\"X\",1,IF(#REF!=\"X\",0,0))","v":{"$error":"#REF!"}}]
["Human Resource Management","Employee Self Service",30,"ü",null,"The system must automate the workflow for benefits changes between Service Provider (Med Aid), HR and Payroll ",{"$nulls":3},{"$f":"IF(#REF!=\"X\",1,IF(#REF!=\"X\",0,0))","v":{"$error":"#REF!"}}]
["Human Resource Management","Employee Self Service",31,"ü",null,"The system should define entities and organisational units within the company ",{"$nulls":3},{"$f":"IF(#REF!=\"X\",1,IF(#REF!=\"X\",0,0))","v":{"$error":"#REF!"}}]
["Human Resource Management","Organisational Structures",32,"ü",null,"The system should enable organisational structures to be defined using a matrix or a hierarchy and management of the organisational structure with vacancy and people identification ",{"$nulls":3},{"$f":"IF(#REF!=\"X\",1,IF(#REF!=\"X\",0,0))","v":{"$error":"#REF!"}}]
["Human Resource Management","Organisational Structures",33,"ü",null,"The system should enable restricted access to the organisational structure and department information ",{"$nulls":3},{"$f":"IF(#REF!=\"X\",1,IF(#REF!=\"X\",0,0))","v":{"$error":"#REF!"}}]
["Human Resource Management","Organisational Structures",34,"ü",null,"The system should allow for drag-and-drop to be used to change the organisational structure, with changes automatically updated in the employee records",{"$nulls":3},{"$f":"IF(#REF!=\"X\",1,IF(#REF!=\"X\",0,0))","v":{"$error":"#REF!"}}]
["Human Resource Management","Organisational Structures",35,"ü",null,"The system should have a facility for the organisational structure to be used to define role-based information and database access ",{"$nulls":3},{"$f":"IF(#REF!=\"X\",1,IF(#REF!=\"X\",0,0))","v":{"$error":"#REF!"}}]
["Human Resource Management","Organisational Structures",36,"ü",null,"The system must be able to flag any alterations to information on the Organisational structure and/or personnel structure to ensure that necessary updates are made ",{"$nulls":3},{"$f":"IF(#REF!=\"X\",1,IF(#REF!=\"X\",0,0))","v":{"$error":"#REF!"}}]
["Human Resource Management","Organisational Structures",37,"ü",null,"The system should maintain personnel structure",{"$nulls":3},{"$f":"IF(#REF!=\"X\",1,IF(#REF!=\"X\",0,0))","v":{"$error":"#REF!"}}]
{"$rows_left_out":825}
{"sheet":"Change management Requirements","index":1,"n_rows":5,"n_cols":8,"rows_kept":5,"merged":[[0,0,0,7],[1,0,2,0],[1,1,2,1],[1,2,2,2],[1,3,2,3],[1,4,2,4],[1,5,1,6],[1,7,2,7]]}
["Council for Geoscience  Change Management and Training  Requirements"]
["Process","No","Must Have","Nice to have ","Description","Response",null,"Comments"]
[{"$nulls":5},"COMPLY","NOT COMPLY"]
["Communications and Change management",1,"ü",null,"The Bidder accepts that project team will be required to make assessment and conduct change management processes in relation to ERP project. The cost of such project resources will be for the account of the Bidder. Substantiate by providing an outline the bidder previous involvement in the change management processes\nOutline the bidder previous involvement in the change management processes\n"]
["Training",2,"ü",null,"  Guide, assist, train, mentor and transfer skills during the entire project process for 1st line Technical and functional support, super user and end user training. Trainers will also be assessed by the participants."]

{"sheet":"Accreditation and Certification","index":2,"n_rows":7,"n_cols":8,"rows_kept":7,"merged":[[0,0,0,7],[1,0,2,0],[1,1,2,1],[1,2,2,2],[1,3,2,3],[1,4,2,4],[1,5,1,6],[1,7,2,7]]}
["Council for Geoscience Accreditation and Certification  Requirements"]
["Process","No","Must Have","Nice to have ","Description","Response",null,"Comments"]
[{"$nulls":5},"COMPLY","NOT COMPLY"]
["Accreditation",1,"ü",null,"SAP consultant to be deployed on the project must no be less than K4 in terms of SAP consulting gradings  for normal consultants and between K6-7 for the lead and project management due to the complexity of the project. Please provide documentations"]
["Certification",2,"ü",null,"The project team for respective modules must be certified with the OEM. The finance team must at bear minimum have team lead with accounting qualification. Supporting evidence is required for this."]
["Personnel requirements",3,"ü",null,"SAP consultant to be deployed on the project must no be less than K4 in terms of SAP consulting gradings  for normal consultants and between K6-7 for the lead and project management due to the complexity of the project. Please provide documentations"]
["Subject matter expert per  area",4,"ü",null,"A subject matter expert must be provided for every area of expertise as required by the incumbent solution"]

{"sheet":"Technical Requirements","index":3,"n_rows":70,"n_cols":9,"rows_kept":70,"merged":[[0,0,0,7],[1,0,2,0],[1,1,2,1],[1,2,2,2],[1,3,2,3],[1,4,2,4],[1,5,1,6],[1,7,2,7]]}
["Council for Geoscience ICT Technical Requirements"]
["Process","No","Must Have","Nice to have ","Description","Response",null,"Comments"]
[{"$nulls":5},"COMPLY","NOT COMPLY"]
["Technology",1,"ü",null,"Integration across all modules, e.g. core Financials, Human Resources, projects budgetung, treasury, grants mangment, travel, maintenance, equipment, Payroll as as may be presribed by the client during requirementss gathering and solution development. Agility to  adapt and implement changes for improvement is required in case such is not stipulated anywhee in the requirements.",{"$nulls":3},{"$f":"IF(F4=\"X\",1,IF(G4=\"X\",0,0))","v":0}]
["Technology",2,"ü",null,"Database: MS SQL Server 2016 R2 or higher preferred; will consider Oracle.",{"$nulls":3},{"$f":"IF(F5=\"X\",1,IF(G5=\"X\",0,0))","v":0}]
["Technology",3,"ü",null,"Compatible with Windows 7 and higher desktop client.",{"$nulls":3},0]
["Technology",4,"ü",null,"Web‐enabled or Web‐based architecture with published open API’s. List browsers supported",{"$nulls":3},0]
["Technology",5,"ü",null,"Option that allows for multiple environments, e.g. production, test, training, development, etc.",{"$nulls":3},0]
["Technology",6,"ü",null,"Role‐level security by group or individual to menu and screen level with ability to mask sensitive data fields",{"$nulls":3},0]
["Technology",7,null,"ü","Online configurable role‐level training programs by module. Describe training configuration and options available",{"$nulls":3},0]
["Technology",8,"ü",null,"Online user knowledge base. Describe available options",{"$nulls":3},0]
["Technology",9,"ü",null,"Single sign‐on: MS Active Directory; LDAP compatible",{"$nulls":3},0]
["Technology",10,null,"ü","Support two‐factor authentication for on premise and/or hosted systems",{"$nulls":3},0]
["Technology",11,"ü",null,"Server virtualization on Microsoft VMWare Vsphere and Hyper‐V",{"$nulls":3},0]
["Technology",12,"ü",null,"Microsoft Outlook and Exchange Server integration for Email and workflow approval",{"$nulls":3},0]
["Technology",13,"ü",null,"Office 2016/Office 365 compatible",{"$nulls":3},0]
["Technology",14,"ü",null,"Import/Export to Microsoft Word, Access and Excel; ability to filter data for export",{"$nulls":3},0]
["Technology",15,"ü",null,"List integration technologies, e.g. Web Services, SOA, XML, XBRL, open API’s, etc. Flat file method not preferred",{"$nulls":3},0]
["Technology",16,null,"ü","Indicate experience integrating and proposed method to other Geoscience applications and services (Web Service, etc.)",{"$nulls":3},0]
["Technology",17,null,"ü","a. ArcGIS",{"$nulls":3},0]
["Technology",18,null,"ü","b. ERDAS",{"$nulls":3},0]
["Technology",19,null,"ü","c. ER Mapper",{"$nulls":3},0]
["Technology",20,null,"ü","d. ENVI",{"$nulls":3},0]
["Technology",21,null,"ü","e. Statistica",{"$nulls":3},0]
["Technology",22,"ü",null,"Scan and attach documents, scanned images and MS Office files to records throughout all modules",{"$nulls":3},0]
["Technology",23,"ü",null,"Describe functions supported by mobile technology, e.g. workflow approvals, data lookup’s, inspections, etc.",{"$nulls":3},0]
["Technology",24,"ü",null,"List supported mobile devices and operating systems, e.g. iPads, Surfaces, iOS, Android, Windows, etc.",{"$nulls":3},0]
["Technology",25,"ü",null,"Describe Web/Portal functionality for external user access to tax information, property information, pay online, etc.",{"$nulls":3},0]
["Technology",26,"ü",null,"Describe support for Microsoft SharePoint Enterprise Portal",{"$nulls":3},0]
["General Requirements",27,"ü",null,"Configurable role‐based dashboards to present reports, tasks, notifications, approvals, etc. with drill down to source transactions",{"$nulls":3},0]
["General Requirements",28,"ü",null,"Audit Trail with user, date and time stamp throughout all modules. Before/after history is important ",{"$nulls":3},0]
["General Requirements",29,"ü",null,"User configurable menus, screens, and fields, e.g. hide unused fields, set tab order, define mandatory fields, etc.",{"$nulls":3},0]
["General Requirements",30,"ü",null,"Flexible description field widths throughout the system. Describe where supported",{"$nulls":3},0]
["General Requirements",31,"ü",null,"User‐defined fields that can be used in queries and reports; indicate where available and limitations",{"$nulls":3},0]
["General Requirements",32,"ü",null,"Configurable electronic forms that can be filled in, routed online for approval and update the database, e.g. Personnel Action Form, Permit Application, etc.",{"$nulls":3},0]
["General Requirements",33,"ü",null,"Configurable online user help. Context sensitive is Nice to Have",{"$nulls":3},0]
["General Requirements",34,"ü",null,"Rules‐based workflow routing that can be concurrent or consecutive with electronic signatures",{"$nulls":3},0]
["General Requirements",35,"ü",null,"Visibility to workflow status and approval queue with proper segregation of duties applied.",{"$nulls":3},0]
["General Requirements",36,"ü",null,"Activity or date triggered alerts, flags, and messages, workflows and escalations",{"$nulls":3},0]
["General Requirements",37,"ü",null,"Effective dating of transactions throughout all modules",{"$nulls":3},0]
{"$rows_left_out":31}
{"sheet":"Evaluation Criteria","index":4,"n_rows":25,"n_cols":6,"rows_kept":25,"hidden":true,"merged":[[0,0,0,2]]}
["Council for Geoscience Evaluation Criteria"]
["No","Criteria","Scoring","Notes"]
[1,"Provide functional proposal that meets our specifications and related service requirements. A minimun score of 75% is required for each section.\n\n(Meets functional requirements)\n•   Average is 90% - 100% = 40 points\n•   Average is 80% - 89%   = 20 points\n•   Average is 75% - 79%   = 10 points\n•  Average is < 74%             =   0 points\n\nNB: Submit completed specifications spreadsheet (Functional Requirements)",40,{"$f":"IF(F20 <> FALSE, AVERAGE(E11:E19), \"One or more section is less than 75%\")","v":{"$error":"#REF!"}}]
[2,"Provide technical proposal that meets our specifications and related service requirements.\n\n(Meets technical requirements)\n•   Average is 90% - 100% =  20 points\n•   Average is 75% - 89%   =   10 points\n•  Average is < 74%             =   0 points\n\nNB: Submit completed specifications spreadsheet Technical Requirements)",20,{"$f":"E21","v":{"v":0,"d":"0.00"}}]
[3,"Approach and Methodology: Describe the approach, methodology and plan (AMP) to be adopted during the review, implementation, execution and hosting. \n\nThe scoring will be based on the following:\n• No or incomplete AMP = 0 points\n• Complete and detailed AMP = 10 points\n",10]
[4,"Project Plan: Bidders are required to submit a project plan with their proposals. (Note: Go-live must be within 12 months) \n\nProject plan must also include the following tasks and deliverables:\n• Project Initiation\n• Change and Communication Management\n• Requirements Gathering\n• Implementation\n• Training\n• Skills Transfer \n• Data Management\n\nThe scoring will be based on the following:\n• No or incomplete project plan = 0 points\n• Complete and detailed project plan within the requested period = 10 points\n",10]
[5,"Provide signed letters from contactable references stipulating where an ERP implementation project of a similar size (minimum 500 users) has been successfully delivered by the Bidder in the last 10 years\n\n•   5 and more implementation references = 10 points\n•  3 - 4 implementation references = 5 points\n•  0 - 3 implementation references = 0 points",10]
[6,"Capacity and experience of the proposed team. The proposed team must demonstrate experience, qualifications and capabilities. The team leader must have al least 7 years' experience in the ERP environment (Attach CV, profile, past and current projects).\n\n•   7 or more years experience = 10 points\n•   5 -  7 years experience           =   5 points\n•   0 or less than  5 years experience           =   0 points",10]
[]
[null,null,"Total Points Achievable","Total Points Achieved","%","Check if >75"]
[null,"Human Resource Management",{"$f":"COUNTIF('Functional Requirements'!A4:A859,'Evaluation Criteria'!B11)","v":89},{"$f":"SUM('Functional Requirements'!J4:J92)","v":{"$error":"#REF!"}},{"$f":"D11*100/C11","v":{"$error":"#REF!"}},{"$f":"AND(E11>75)","v":{"$error":"#REF!"}}]
[null,"Financial Management",{"$f":"COUNTIF('Functional Requirements'!A4:A859,'Evaluation Criteria'!B12)","v":361},{"$f":"SUM('Functional Requirements'!J93:J453)","v":{"$error":"#REF!"}},{"$f":"D12*100/C12","v":{"$error":"#REF!"}},{"$f":"AND(E12>75)","v":{"$error":"#REF!"}}]
[null,"Supply Chain Management",{"$f":"COUNTIF('Functional Requirements'!A4:A859,'Evaluation Criteria'!B13)","v":171},{"$f":"SUM('Functional Requirements'!J454:J625)","v":{"$error":"#REF!"}},{"$error":"#REF!"},{"$error":"#REF!"}]
[null,"Geological Resources & Applied Geoscience",{"$f":"COUNTIF('Functional Requirements'!A4:A859,'Evaluation Criteria'!B14)","v":97},{"$f":"SUM('Functional Requirements'!J626:J722)","v":{"$error":"#REF!"}},{"$error":"#REF!"},{"$error":"#REF!"}]
[null,"Assets and Logistics Management",{"$f":"COUNTIF('Functional Requirements'!A4:A859,'Evaluation Criteria'!B15)","v":70},{"$f":"SUM('Functional Requirements'!J723:J769)","v":{"$error":"#REF!"}},{"$error":"#REF!"},{"$error":"#REF!"}]
[null,"Safety, Health, Environment & Quality (SHEQ)",{"$f":"COUNTIF('Functional Requirements'!A4:A859,'Evaluation Criteria'!B16)","v":10},{"$f":"SUM('Functional Requirements'!J793:J802)","v":{"$error":"#REF!"}},{"$error":"#REF!"},{"$error":"#REF!"}]
[null,"Marketing & Communication",{"$f":"COUNTIF('Functional Requirements'!A4:A859,'Evaluation Criteria'!B17)","v":9},{"$f":"SUM('Functional Requirements'!J803:J810)","v":{"$error":"#REF!"}},{"$error":"#REF!"},{"$error":"#REF!"}]
[null,"Internal Audit",{"$f":"COUNTIF('Functional Requirements'!A4:A859,'Evaluation Criteria'!B18)","v":40},{"$f":"SUM('Functional Requirements'!J811:J850)","v":{"$error":"#REF!"}},{"$error":"#REF!"},{"$error":"#REF!"}]
[null,"Risk & Compliance Management",{"$f":"COUNTIF('Functional Requirements'!A4:A859,'Evaluation Criteria'!B19)","v":9},{"$f":"SUM('Functional Requirements'!J851:J859)","v":{"$error":"#REF!"}},{"$error":"#REF!"},{"$error":"#REF!"}]
[{"$nulls":5},{"$f":"AND(E11>75, E12>75, E13>75, E14>75, E15>75, E16>75,E17>75,E18>75,E19>75)","v":{"$error":"#REF!"}}]
[null,"Technology",{"$f":"COUNTA('Technical Requirements'!A4:A63)","v":60},{"$f":"SUM('Technical Requirements'!I4:I63)","v":0},{"v":0,"d":"0.00"}]
[]
[]
[]
[null,null,"   "]