{"text_format":"3","workbook":"xlsx","n_sheets":2,"sheets":["DCIM","Currency"],"not_rendered":{"external_links":7,"defined_names":301},"read":"whole","date_system":"1900"}

{"sheet":"DCIM","index":0,"n_rows":81,"n_cols":35,"rows_kept":81,"merged":[[2,3,2,8],[24,16,24,39],[26,5,26,7],[26,9,26,12],[26,14,26,17],[26,19,26,22],[26,24,26,27],[26,29,26,32],[27,5,27,7]]}
[{"$nulls":3},"Pricing Schedule: Data Center Infrastructure Management Service"]
[]
[{"$nulls":3},"VENDOR NAME"]
[]
[]
[]
[{"$nulls":3},"IMPORTANT NOTES"]
[{"$nulls":3},"All cells highlighted in GREEN must be completed"]
[{"$nulls":3},"Quoted prices MUST be in ZAR, EXCLUDING VAT and ESCALATIONS"]
[]
[{"$nulls":3},"Data Center Infrastructure Management Service"]
[{"$nulls":3},"Prices MUST be quoted based on the SCOPE provided"]
[{"$nulls":3},"Estimated quantities are based on the required number of Licenses"]
[{"$nulls":3},"Select the currency from the CURRENCY drop-down list in COLUMN \"G\""]
[]
[{"$nulls":3},"Capture the applicable Currency, ROE and ROE Published Date on the \"Currency sheet\". "]
[{"$nulls":3},"The adjustments for prevailing rates and the basis for future price adjustments will be determined at time of contracting. "]
[{"$nulls":3},"Exchange rate variations may not be claimed for the local mark-up in the pricing structure"]
[]
[{"$nulls":3},"NB: Provide details on the CONTRACT PRICE ADJUSTMENT in Column AI. "]
[]
[{"$nulls":3},"All Prices must be exclusive of VAT"]
[]
[]
[]
[]
[{"$nulls":9},"YEAR 1",{"$nulls":4},"YEAR 2",{"$nulls":4},"YEAR 3",{"$nulls":4},"YEAR 4",{"$nulls":4},"YEAR 5"]
[null,"Sites","Category","Description","Unit charge","CURRENCY",null,null,"Total Estimated Quantity","Unit Price in Nominated Currency","Unit Price in ZAR","Total [Nominated Currency]","Total in ZAR","Total Estimated Quantity","Unit Price in Nominated Currency","Unit Price in ZAR","Total [Nominated Currency]","Total in ZAR","Total Estimated Quantity","Unit Price in Nominated Currency","Unit Price in ZAR","Total [Nominated Currency]","Total in ZAR","Total Estimated Quantity","Unit Price in Nominated Currency","Unit Price in ZAR","Total [Nominated Currency]","Total in ZAR","Total Estimated Quantity","Unit Price in Nominated Currency","Unit Price in ZAR","Total [Nominated Currency]","Total in ZAR",null,"CONTRACT PRICE ADJUSTMENT"]
[null,"Acacia","Managed Service","DCIM as a Service","sum / month",{"$f":"IF(G29=\"\",\"\",IF(G29=\"ZAR\",\"Local\",\"Foreign\"))","v":"Local"},"ZAR",{"$f":"IF(F29=\"\",\"\",IF(F29=\"Foreign\",VLOOKUP(G29,Currency!$E$20:$F$33,2,FALSE),1))","v":{"v":1,"d":"1.00"}},12,0,{"$f":"J29*$H29","v":0},{"$f":"J29*$I29","v":0},{"$f":"K29*$I29","v":0},12,0,{"$f":"O29*$H29","v":0},{"$f":"O29*$N29","v":0},{"$f":"P29*$N29","v":0},12,0,{"$f":"T29*$H29","v":0},{"$f":"T29*$S29","v":0},{"$f":"U29*$S29","v":0},12,0,{"$f":"Y29*$H29","v":0},{"$f":"Y29*$X29","v":0},{"$f":"Z29*$X29","v":0},12,0,{"$f":"AD29*$H29","v":0},{"$f":"AD29*$AC29","v":0},{"$f":"AE29*$AC29","v":0}]
[null,"Ankerlig","Managed Service","DCIM as a Service","sum / month",{"$f":"IF(G30=\"\",\"\",IF(G30=\"ZAR\",\"Local\",\"Foreign\"))","v":"Local"},"ZAR",{"$f":"IF(F30=\"\",\"\",IF(F30=\"Foreign\",VLOOKUP(G30,Currency!$E$20:$F$33,2,FALSE),1))","v":{"v":1,"d":"1.00"}},12,0,0,0,0,12,0,0,0,0,12,0,0,0,0,12,0,0,0,0,12,0,0,0,0]
[null,"Polokwane","Managed Service","DCIM as a Service","sum / month","Local","ZAR",{"$f":"IF(F31=\"\",\"\",IF(F31=\"Foreign\",VLOOKUP(G31,Currency!$E$20:$F$33,2,FALSE),1))","v":{"v":1,"d":"1.00"}},12,0,0,0,0,12,0,0,0,0,12,0,0,0,0,12,0,0,0,0,12,0,0,0,0]
[null,"Belville 1","Managed Service","DCIM as a Service","sum / month","Local","ZAR",{"$f":"IF(F32=\"\",\"\",IF(F32=\"Foreign\",VLOOKUP(G32,Currency!$E$20:$F$33,2,FALSE),1))","v":{"v":1,"d":"1.00"}},12,0,0,0,0,12,0,0,0,0,12,0,0,0,0,12,0,0,0,0,12,0,0,0,0]
[null,"Belville 2","Managed Service","DCIM as a Service","sum / month","Local","ZAR",{"$f":"IF(F33=\"\",\"\",IF(F33=\"Foreign\",VLOOKUP(G33,Currency!$E$20:$F$33,2,FALSE),1))","v":{"v":1,"d":"1.00"}},12,0,0,0,0,12,0,0,0,0,12,0,0,0,0,12,0,0,0,0,12,0,0,0,0]
[null,"Blackenbergvlei","Managed Service","DCIM as a Service","sum / month","Local","ZAR",{"$f":"IF(F34=\"\",\"\",IF(F34=\"Foreign\",VLOOKUP(G34,Currency!$E$20:$F$33,2,FALSE),1))","v":{"v":1,"d":"1.00"}},12,0,0,0,0,12,0,0,0,0,12,0,0,0,0,12,0,0,0,0,12,0,0,0,0]
[null,"Bloemfontein","Managed Service","DCIM as a Service","sum / month","Local","ZAR",{"$f":"IF(F35=\"\",\"\",IF(F35=\"Foreign\",VLOOKUP(G35,Currency!$E$20:$F$33,2,FALSE),1))","v":{"v":1,"d":"1.00"}},12,0,0,0,0,12,0,0,0,0,12,0,0,0,0,12,0,0,0,0,12,0,0,0,0]
[null,"Camden Power Station","Managed Service","DCIM as a Service","sum / month","Local","ZAR",{"$f":"IF(F36=\"\",\"\",IF(F36=\"Foreign\",VLOOKUP(G36,Currency!$E$20:$F$33,2,FALSE),1))","v":{"v":1,"d":"1.00"}},12,0,0,0,0,12,0,0,0,0,12,0,0,0,0,12,0,0,0,0,12,0,0,0,0]
[null,"Drakenberg comms","Managed Service","DCIM as a Service","sum / month","Local","ZAR",{"$f":"IF(F37=\"\",\"\",IF(F37=\"Foreign\",VLOOKUP(G37,Currency!$E$20:$F$33,2,FALSE),1))","v":{"v":1,"d":"1.00"}},12,0,0,0,0,12,0,0,0,0,12,0,0,0,0,12,0,0,0,0,12,0,0,0,0]
[null,"Drakenberg Equipment","Managed Service","DCIM as a Service","sum / month","Local","ZAR",{"$f":"IF(F38=\"\",\"\",IF(F38=\"Foreign\",VLOOKUP(G38,Currency!$E$20:$F$33,2,FALSE),1))","v":{"v":1,"d":"1.00"}},12,0,0,0,0,12,0,0,0,0,12,0,0,0,0,12,0,0,0,0,12,0,0,0,0]
[null,"Durbanville","Managed Service","DCIM as a Service","sum / month","Local","ZAR",{"$f":"IF(F39=\"\",\"\",IF(F39=\"Foreign\",VLOOKUP(G39,Currency!$E$20:$F$33,2,FALSE),1))","v":{"v":1,"d":"1.00"}},12,0,0,0,0,12,0,0,0,0,12,0,0,0,0,12,0,0,0,0,12,0,0,0,0]
[null,"Duvha Power Station","Managed Service","DCIM as a Service","sum / month","Local","ZAR",{"$f":"IF(F40=\"\",\"\",IF(F40=\"Foreign\",VLOOKUP(G40,Currency!$E$20:$F$33,2,FALSE),1))","v":{"v":1,"d":"1.00"}},12,0,0,0,0,12,0,0,0,0,12,0,0,0,0,12,0,0,0,0,12,0,0,0,0]
[null,"Duvha ST","Managed Service","DCIM as a Service","sum / month","Local","ZAR",{"$f":"IF(F41=\"\",\"\",IF(F41=\"Foreign\",VLOOKUP(G41,Currency!$E$20:$F$33,2,FALSE),1))","v":{"v":1,"d":"1.00"}},12,0,0,0,0,12,0,0,0,0,12,0,0,0,0,12,0,0,0,0,12,0,0,0,0]
[null,"EAL","Managed Service","DCIM as a Service","sum / month","Local","ZAR",{"$f":"IF(F42=\"\",\"\",IF(F42=\"Foreign\",VLOOKUP(G42,Currency!$E$20:$F$33,2,FALSE),1))","v":{"v":1,"d":"1.00"}},12,0,0,0,0,12,0,0,0,0,12,0,0,0,0,12,0,0,0,0,12,0,0,0,0]
[null,"East London","Managed Service","DCIM as a Service","sum / month","Local","ZAR",{"$f":"IF(F43=\"\",\"\",IF(F43=\"Foreign\",VLOOKUP(G43,Currency!$E$20:$F$33,2,FALSE),1))","v":{"v":1,"d":"1.00"}},12,0,0,0,0,12,0,0,0,0,12,0,0,0,0,12,0,0,0,0,12,0,0,0,0]
[null,"Gariep","Managed Service","DCIM as a Service","sum / month","Local","ZAR",{"$f":"IF(F44=\"\",\"\",IF(F44=\"Foreign\",VLOOKUP(G44,Currency!$E$20:$F$33,2,FALSE),1))","v":{"v":1,"d":"1.00"}},12,0,0,0,0,12,0,0,0,0,12,0,0,0,0,12,0,0,0,0,12,0,0,0,0]
[null,"Gourikwa","Managed Service","DCIM as a Service","sum / month","Local","ZAR",{"$f":"IF(F45=\"\",\"\",IF(F45=\"Foreign\",VLOOKUP(G45,Currency!$E$20:$F$33,2,FALSE),1))","v":{"v":1,"d":"1.00"}},12,0,0,0,0,12,0,0,0,0,12,0,0,0,0,12,0,0,0,0,12,0,0,0,0]
[null,"Grootvlei Power Station","Managed Service","DCIM as a Service","sum / month","Local","ZAR",{"$f":"IF(F46=\"\",\"\",IF(F46=\"Foreign\",VLOOKUP(G46,Currency!$E$20:$F$33,2,FALSE),1))","v":{"v":1,"d":"1.00"}},12,0,0,0,0,12,0,0,0,0,12,0,0,0,0,12,0,0,0,0,12,0,0,0,0]
[null,"Hendrina Power Station","Managed Service","DCIM as a Service","sum / month","Local","ZAR",{"$f":"IF(F47=\"\",\"\",IF(F47=\"Foreign\",VLOOKUP(G47,Currency!$E$20:$F$33,2,FALSE),1))","v":{"v":1,"d":"1.00"}},12,0,0,0,0,12,0,0,0,0,12,0,0,0,0,12,0,0,0,0,12,0,0,0,0]
[null,"Ingula","Managed Service","DCIM as a Service","sum / month",{"$f":"IF(G48=\"\",\"\",IF(G48=\"ZAR\",\"Local\",\"Foreign\"))","v":"Local"},"ZAR",{"$f":"IF(F48=\"\",\"\",IF(F48=\"Foreign\",VLOOKUP(G48,Currency!$E$20:$F$33,2,FALSE),1))","v":{"v":1,"d":"1.00"}},12,0,0,0,0,12,0,0,0,0,12,0,0,0,0,12,0,0,0,0,12,0,0,0,0]
[null,"Kendal Power Station","Managed Service","DCIM as a Service","sum / month",{"$f":"IF(G49=\"\",\"\",IF(G49=\"ZAR\",\"Local\",\"Foreign\"))","v":"Local"},"ZAR",{"$f":"IF(F49=\"\",\"\",IF(F49=\"Foreign\",VLOOKUP(G49,Currency!$E$20:$F$33,2,FALSE),1))","v":{"v":1,"d":"1.00"}},12,0,0,0,0,12,0,0,0,0,12,0,0,0,0,12,0,0,0,0,12,0,0,0,0]
[null,"Klerksdorp","Managed Service","DCIM as a Service","sum / month","Local","ZAR",{"$f":"IF(F50=\"\",\"\",IF(F50=\"Foreign\",VLOOKUP(G50,Currency!$E$20:$F$33,2,FALSE),1))","v":{"v":1,"d":"1.00"}},12,0,0,0,0,12,0,0,0,0,12,0,0,0,0,12,0,0,0,0,12,0,0,0,0]
[null,"Koeberg","Managed Service","DCIM as a Service","sum / month",{"$f":"IF(G51=\"\",\"\",IF(G51=\"ZAR\",\"Local\",\"Foreign\"))","v":"Local"},"ZAR",{"$f":"IF(F51=\"\",\"\",IF(F51=\"Foreign\",VLOOKUP(G51,Currency!$E$20:$F$33,2,FALSE),1))","v":{"v":1,"d":"1.00"}},12,0,0,0,0,12,0,0,0,0,12,0,0,0,0,12,0,0,0,0,12,0,0,0,0]
[null,"Komati Power Station","Managed Service","DCIM as a Service","sum / month","Local","ZAR",{"$f":"IF(F52=\"\",\"\",IF(F52=\"Foreign\",VLOOKUP(G52,Currency!$E$20:$F$33,2,FALSE),1))","v":{"v":1,"d":"1.00"}},12,0,0,0,0,12,0,0,0,0,12,0,0,0,0,12,0,0,0,0,12,0,0,0,0]
[null,"Kriel Power Station","Managed Service","DCIM as a Service","sum / month",{"$f":"IF(G53=\"\",\"\",IF(G53=\"ZAR\",\"Local\",\"Foreign\"))","v":"Local"},"ZAR",{"$f":"IF(F53=\"\",\"\",IF(F53=\"Foreign\",VLOOKUP(G53,Currency!$E$20:$F$33,2,FALSE),1))","v":{"v":1,"d":"1.00"}},12,0,0,0,0,12,0,0,0,0,12,0,0,0,0,12,0,0,0,0,12,0,0,0,0]
[null,"Kusile Power Station","Managed Service","DCIM as a Service","sum / month",{"$f":"IF(G54=\"\",\"\",IF(G54=\"ZAR\",\"Local\",\"Foreign\"))","v":"Local"},"ZAR",{"$f":"IF(F54=\"\",\"\",IF(F54=\"Foreign\",VLOOKUP(G54,Currency!$E$20:$F$33,2,FALSE),1))","v":{"v":1,"d":"1.00"}},12,0,0,0,0,12,0,0,0,0,12,0,0,0,0,12,0,0,0,0,12,0,0,0,0]
[null,"Lethabo Power Station","Managed Service","DCIM as a Service","sum / month",{"$f":"IF(G55=\"\",\"\",IF(G55=\"ZAR\",\"Local\",\"Foreign\"))","v":"Local"},"ZAR",{"$f":"IF(F55=\"\",\"\",IF(F55=\"Foreign\",VLOOKUP(G55,Currency!$E$20:$F$33,2,FALSE),1))","v":{"v":1,"d":"1.00"}},12,0,0,0,0,12,0,0,0,0,12,0,0,0,0,12,0,0,0,0,12,0,0,0,0]
[null,"Majuba Power Station","Managed Service","DCIM as a Service","sum / month",{"$f":"IF(G56=\"\",\"\",IF(G56=\"ZAR\",\"Local\",\"Foreign\"))","v":"Local"},"ZAR",{"$f":"IF(F56=\"\",\"\",IF(F56=\"Foreign\",VLOOKUP(G56,Currency!$E$20:$F$33,2,FALSE),1))","v":{"v":1,"d":"1.00"}},12,0,0,0,0,12,0,0,0,0,12,0,0,0,0,12,0,0,0,0,12,0,0,0,0]
[null,"Matimba Power Station","Managed Service","DCIM as a Service","sum / month",{"$f":"IF(G57=\"\",\"\",IF(G57=\"ZAR\",\"Local\",\"Foreign\"))","v":"Local"},"ZAR",{"$f":"IF(F57=\"\",\"\",IF(F57=\"Foreign\",VLOOKUP(G57,Currency!$E$20:$F$33,2,FALSE),1))","v":{"v":1,"d":"1.00"}},12,0,0,0,0,12,0,0,0,0,12,0,0,0,0,12,0,0,0,0,12,0,0,0,0]
[null,"Matla Power Station","Managed Service","DCIM as a Service","sum / month",{"$f":"IF(G58=\"\",\"\",IF(G58=\"ZAR\",\"Local\",\"Foreign\"))","v":"Local"},"ZAR",{"$f":"IF(F58=\"\",\"\",IF(F58=\"Foreign\",VLOOKUP(G58,Currency!$E$20:$F$33,2,FALSE),1))","v":{"v":1,"d":"1.00"}},12,0,0,0,0,12,0,0,0,0,12,0,0,0,0,12,0,0,0,0,12,0,0,0,0]
[null,"Medupi Power Station","Managed Service","DCIM as a Service","sum / month",{"$f":"IF(G59=\"\",\"\",IF(G59=\"ZAR\",\"Local\",\"Foreign\"))","v":"Local"},"ZAR",{"$f":"IF(F59=\"\",\"\",IF(F59=\"Foreign\",VLOOKUP(G59,Currency!$E$20:$F$33,2,FALSE),1))","v":{"v":1,"d":"1.00"}},12,0,0,0,0,12,0,0,0,0,12,0,0,0,0,12,0,0,0,0,12,0,0,0,0]
[null,"Menston ","Managed Service","DCIM as a Service","sum / month",{"$f":"IF(G60=\"\",\"\",IF(G60=\"ZAR\",\"Local\",\"Foreign\"))","v":"Local"},"ZAR",{"$f":"IF(F60=\"\",\"\",IF(F60=\"Foreign\",VLOOKUP(G60,Currency!$E$20:$F$33,2,FALSE),1))","v":{"v":1,"d":"1.00"}},12,0,0,0,0,12,0,0,0,0,12,0,0,0,0,12,0,0,0,0,12,0,0,0,0]
[null,"Mkondeni","Managed Service","DCIM as a Service","sum / month",{"$f":"IF(G61=\"\",\"\",IF(G61=\"ZAR\",\"Local\",\"Foreign\"))","v":"Local"},"ZAR",{"$f":"IF(F61=\"\",\"\",IF(F61=\"Foreign\",VLOOKUP(G61,Currency!$E$20:$F$33,2,FALSE),1))","v":{"v":1,"d":"1.00"}},12,0,{"$f":"J61*$H61","v":0},{"$f":"J61*$I61","v":0},{"$f":"K61*$I61","v":0},12,0,{"$f":"O61*$H61","v":0},{"$f":"O61*$N61","v":0},{"$f":"P61*$N61","v":0},12,0,{"$f":"T61*$H61","v":0},{"$f":"T61*$S61","v":0},{"$f":"U61*$S61","v":0},12,0,{"$f":"Y61*$H61","v":0},{"$f":"Y61*$X61","v":0},{"$f":"Z61*$X61","v":0},12,0,{"$f":"AD61*$H61","v":0},{"$f":"AD61*$AC61","v":0},{"$f":"AE61*$AC61","v":0}]
[null,"MWP2","Managed Service","DCIM as a Service","sum / month",{"$f":"IF(G62=\"\",\"\",IF(G62=\"ZAR\",\"Local\",\"Foreign\"))","v":"Local"},"ZAR",{"$f":"IF(F62=\"\",\"\",IF(F62=\"Foreign\",VLOOKUP(G62,Currency!$E$20:$F$33,2,FALSE),1))","v":{"v":1,"d":"1.00"}},12,0,0,0,0,12,0,0,0,0,12,0,0,0,0,12,0,0,0,0,12,0,0,0,0]
[null,"New Germany","Managed Service","DCIM as a Service","sum / month",{"$f":"IF(G63=\"\",\"\",IF(G63=\"ZAR\",\"Local\",\"Foreign\"))","v":"Local"},"ZAR",{"$f":"IF(F63=\"\",\"\",IF(F63=\"Foreign\",VLOOKUP(G63,Currency!$E$20:$F$33,2,FALSE),1))","v":{"v":1,"d":"1.00"}},12,0,0,0,0,12,0,0,0,0,12,0,0,0,0,12,0,0,0,0,12,0,0,0,0]
[null,"Palmiet","Managed Service","DCIM as a Service","sum / month",{"$f":"IF(G64=\"\",\"\",IF(G64=\"ZAR\",\"Local\",\"Foreign\"))","v":"Local"},"ZAR",{"$f":"IF(F64=\"\",\"\",IF(F64=\"Foreign\",VLOOKUP(G64,Currency!$E$20:$F$33,2,FALSE),1))","v":{"v":1,"d":"1.00"}},12,0,0,0,0,12,0,0,0,0,12,0,0,0,0,12,0,0,0,0,12,0,0,0,0]
[null,"PMDC Matimba","Managed Service","DCIM as a Service","sum / month",{"$f":"IF(G65=\"\",\"\",IF(G65=\"ZAR\",\"Local\",\"Foreign\"))","v":"Local"},"ZAR",{"$f":"IF(F65=\"\",\"\",IF(F65=\"Foreign\",VLOOKUP(G65,Currency!$E$20:$F$33,2,FALSE),1))","v":{"v":1,"d":"1.00"}},12,0,0,0,0,12,0,0,0,0,12,0,0,0,0,12,0,0,0,0,12,0,0,0,0]
[null,"PMDC Middleburg","Managed Service","DCIM as a Service","sum / month",{"$f":"IF(G66=\"\",\"\",IF(G66=\"ZAR\",\"Local\",\"Foreign\"))","v":"Local"},"ZAR",{"$f":"IF(F66=\"\",\"\",IF(F66=\"Foreign\",VLOOKUP(G66,Currency!$E$20:$F$33,2,FALSE),1))","v":{"v":1,"d":"1.00"}},12,0,0,0,0,12,0,0,0,0,12,0,0,0,0,12,0,0,0,0,12,0,0,0,0]
[null,"PMDC Rotek","Managed Service","DCIM as a Service","sum / month",{"$f":"IF(G67=\"\",\"\",IF(G67=\"ZAR\",\"Local\",\"Foreign\"))","v":"Local"},"ZAR",{"$f":"IF(F67=\"\",\"\",IF(F67=\"Foreign\",VLOOKUP(G67,Currency!$E$20:$F$33,2,FALSE),1))","v":{"v":1,"d":"1.00"}},12,0,0,0,0,12,0,0,0,0,12,0,0,0,0,12,0,0,0,0,12,0,0,0,0]
[null,"Polokwane","Managed Service","DCIM as a Service","sum / month","Local","ZAR",{"$f":"IF(F68=\"\",\"\",IF(F68=\"Foreign\",VLOOKUP(G68,Currency!$E$20:$F$33,2,FALSE),1))","v":{"v":1,"d":"1.00"}},12,0,0,0,0,12,0,0,0,0,12,0,0,0,0,12,0,0,0,0,12,0,0,0,0]
[null,"Rosherville (ERIC)","Managed Service","DCIM as a Service","sum / month","Local","ZAR",{"$f":"IF(F69=\"\",\"\",IF(F69=\"Foreign\",VLOOKUP(G69,Currency!$E$20:$F$33,2,FALSE),1))","v":{"v":1,"d":"1.00"}},12,0,0,0,0,12,0,0,0,0,12,0,0,0,0,12,0,0,0,0,12,0,0,0,0]
[null,"Sere","Managed Service","DCIM as a Service","sum / month","Local","ZAR",{"$f":"IF(F70=\"\",\"\",IF(F70=\"Foreign\",VLOOKUP(G70,Currency!$E$20:$F$33,2,FALSE),1))","v":{"v":1,"d":"1.00"}},12,0,0,0,0,12,0,0,0,0,12,0,0,0,0,12,0,0,0,0,12,0,0,0,0]
[null,"Simmerpan DEC","Managed Service","DCIM as a Service","sum / month","Local","ZAR",{"$f":"IF(F71=\"\",\"\",IF(F71=\"Foreign\",VLOOKUP(G71,Currency!$E$20:$F$33,2,FALSE),1))","v":{"v":1,"d":"1.00"}},12,0,0,0,0,12,0,0,0,0,12,0,0,0,0,12,0,0,0,0,12,0,0,0,0]
[null,"Simmerpan Dx","Managed Service","DCIM as a Service","sum / month",{"$f":"IF(G72=\"\",\"\",IF(G72=\"ZAR\",\"Local\",\"Foreign\"))","v":"Local"},"ZAR",{"$f":"IF(F72=\"\",\"\",IF(F72=\"Foreign\",VLOOKUP(G72,Currency!$E$20:$F$33,2,FALSE),1))","v":{"v":1,"d":"1.00"}},12,0,0,0,0,12,0,0,0,0,12,0,0,0,0,12,0,0,0,0,12,0,0,0,0]
[null,"Simmerpan Tx","Managed Service","DCIM as a Service","sum / month",{"$f":"IF(G73=\"\",\"\",IF(G73=\"ZAR\",\"Local\",\"Foreign\"))","v":"Local"},"ZAR",{"$f":"IF(F73=\"\",\"\",IF(F73=\"Foreign\",VLOOKUP(G73,Currency!$E$20:$F$33,2,FALSE),1))","v":{"v":1,"d":"1.00"}},12,0,0,0,0,12,0,0,0,0,12,0,0,0,0,12,0,0,0,0,12,0,0,0,0]
[null,"DR Site","Managed Service","DCIM as a Service","sum / month",{"$f":"IF(G74=\"\",\"\",IF(G74=\"ZAR\",\"Local\",\"Foreign\"))","v":"Local"},"ZAR",{"$f":"IF(F74=\"\",\"\",IF(F74=\"Foreign\",VLOOKUP(G74,Currency!$E$20:$F$33,2,FALSE),1))","v":{"v":1,"d":"1.00"}},12,0,0,0,0,12,0,0,0,0,12,0,0,0,0,12,0,0,0,0,12,0,0,0,0]
[null,"Tutuka Power Station","Managed Service","DCIM as a Service","sum / month",{"$f":"IF(G75=\"\",\"\",IF(G75=\"ZAR\",\"Local\",\"Foreign\"))","v":"Local"},"ZAR",{"$f":"IF(F75=\"\",\"\",IF(F75=\"Foreign\",VLOOKUP(G75,Currency!$E$20:$F$33,2,FALSE),1))","v":{"v":1,"d":"1.00"}},12,0,0,0,0,12,0,0,0,0,12,0,0,0,0,12,0,0,0,0,12,0,0,0,0]
[null,"Witbank Network Room","Managed Service","DCIM as a Service","sum / month",{"$f":"IF(G76=\"\",\"\",IF(G76=\"ZAR\",\"Local\",\"Foreign\"))","v":"Local"},"ZAR",{"$f":"IF(F76=\"\",\"\",IF(F76=\"Foreign\",VLOOKUP(G76,Currency!$E$20:$F$33,2,FALSE),1))","v":{"v":1,"d":"1.00"}},12,0,0,0,0,12,0,0,0,0,12,0,0,0,0,12,0,0,0,0,12,0,0,0,0]
[null,"Witbank Server Room","Managed Service","DCIM as a Service","sum / month","Local","ZAR",{"$f":"IF(F77=\"\",\"\",IF(F77=\"Foreign\",VLOOKUP(G77,Currency!$E$20:$F$33,2,FALSE),1))","v":{"v":1,"d":"1.00"}},12,0,0,0,0,12,0,0,0,0,12,0,0,0,0,12,0,0,0,0,12,0,0,0,0]
[]
[{"$nulls":4},"TOTAL",{"$nulls":7},{"$f":"SUM(M29:M77)","v":0},{"$nulls":4},{"$f":"SUM(R29:R77)","v":0},{"$nulls":4},{"$f":"SUM(W29:W77)","v":0},{"$nulls":4},{"$f":"SUM(AB29:AB77)","v":0},{"$nulls":4},{"$f":"SUM(AG29:AG77)","v":0}]
[]
[{"$nulls":4},"GRAND TOTAL",{"$nulls":7},{"$f":"SUM(M79,R79,W79,AB79,AG79)","v":0}]

{"sheet":"Currency","index":1,"n_rows":33,"n_cols":8,"rows_kept":33,"merged":[[1,1,1,5],[6,2,6,7],[7,1,9,1],[7,2,7,7],[7,15,7,20],[8,2,8,7],[9,2,9,7],[10,2,10,7],[11,2,11,7],[12,1,14,1],[12,2,12,7],[13,2,13,7],[14,2,14,7],[17,2,17,7]]}
[]
[null,{"$f":"DCIM!D3","v":"VENDOR NAME"}]
[]
[null,"EXCHANGE RATES FOR MULTIPLE CURRENCIES"]
[]
[null,"NOTES:"]
[null,1,"The table below needs to be completed if the Employer will be exposed to any currency fluctuation as stipulated in Secondary Clause X3.  For conversion of the foreign portions to Rand, please use the South African Reserve Bank's (SARB) exchange rate at 12:00 on the day of advertisement of the bid.  This is in terms of the Preferential Procurement Policy Framework Act (PPPFA) with which the Employer has to comply.\nNB: Tenderers must submit proof of the SARB rate(s) of exchange used  "]
[null,2,"The following URL (electronic route) is to be followed to access the relevant SARB rates on their web pages:\n"]
[null,null,"www.resbank.co.za"]
[null,null,"-  Select Research\n-  Then select Rates\n-  Click on \"Select historical exchange rates and other interest rates\"\n-  Clicking on the exchange rate in the following page opens the daily rates per currency and SA Rand"]
[null,3,"The Employer deals only in the currencies listed below unless other currencies are specifically approved for this tender.  Kindly notify the Employer of any currency that the tenderer intends to use, but is not stipulated in the table, to consider sanctioning such currency.  Sufficient time must be allowed for the assessment and to respond to such request.  The onus is on the tenderer to submit a bid with approved currencies"]
[null,4,"The format in which the exchange rate must be inserted in the table is:  1 (One) Foreign Currency = R Amount  (i.e. the Rand amount for one of each foreign currency applicable).  Exchange rates must be rounded to 4 decimals\n\nNB :  Only the USD/ZAR, GBP/ZAR and EUR/ZAR are published in this way on the SARB web pages above.  The Rand rate with the other currencies must be inverted (1/Foreign Currency Rate) in order to list it in the required format in the table below\n"]
[null,5,"All information in the table below must conform with all other equivalent information in the offer. "]
[null,null,"Payment in terms of Payment Method 2  is considered as a \"foreign payment\" although it will be effected in South African Rand. However, amounts for  \"F.O.R. Price-Goods supplied from Imported Items\", are NOT considered as \"foreign payments\""]
[null,null,"If more than one payment method apply for a currency, the Tenderer must request an additional row be inserted in the table in order to split the values and identify the relevant method.   "]
[]
[]
[null,null,"MULTIPLE CURRENCIES"]
[null,null,"No","Currency Description","Code","Exchange Rate Currency 1,00 =","Date Published","Source"]
[null,null,1,"Australian Dollar","AUD"]
[null,null,2,"Canadian Dollar","CAN"]
[null,null,3,"Swiss Franc","CHF"]
[null,null,4,"Danish Krone","DKK"]
[null,null,5,"European Currency","EUR"]
[null,null,6,"British Pound","GBP"]
[null,null,7,"Hong Kong Dollar","HKD"]
[null,null,8,"Japanese Yen","JPY"]
[null,null,9,"Norwegian Krone","NOK"]
[null,null,10,"New Zealand Dollar","NZD"]
[null,null,11,"Swedish Krone","SEK"]
[null,null,12,"Singapore Dollar","SGD"]
[null,null,13,"United States Dollar","USD"]
[null,null,14,"South African Rand","ZAR",{"v":1,"d":"R 1.000000"}]