{"text_format":"3","workbook":"xlsx","n_sheets":14,"sheets":["Cover Sheet","01-Instructions","02-Flat Plate, Gel","03-Labour_Subs_Travel","04-Transport & Off Loading","05-Accessories","06-Training","07-Other Costs","08-Flat Plate Gel Full Range","Option X3","Option X1","Indices","TOTAL PRICE_Flat Plate, Gel","Forecasts"],"not_rendered":{"images":1,"external_links":12,"defined_names":328,"comments":5},"read":"whole","date_system":"1900"}

{"sheet":"Cover Sheet","index":0,"n_rows":22,"n_cols":3,"rows_kept":22,"merged":[[0,0,0,2],[7,0,7,2],[8,0,8,2]]}
["VALVE REGULATED LEAD ACID BATTERIES PRICING SCHEDULE COVERSHEET"]
[]
[null,"ENQUIRY:","E1270DXWC_"]
[null,"COMMODITY:","FLAT PLATE, GEL, VALVE REGULATED LEAD ACID (VRLA) BATTERIES"]
[null,"SUPPLIER:"]
[]
[]
["These VRLA Battery Enquiry Activity Schedules consists of the following worksheets:"]
["Click on the hyperlinks of the worksheets to access them."]
[null,"Worksheet","Notes"]
{"$rows_left_out":13}
{"sheet":"01-Instructions","index":1,"n_rows":39,"n_cols":3,"rows_kept":39,"merged":[[2,1,2,2],[4,1,4,2]]}
[]
[]
[null,"INSTRUCTIONS FOR COMPLETING THIS PRICING SCHEDULE"]
[]
[null,"THE PURPOSE OF THIS WORKSHEET IS TO ENSURE THAT ALL SUPPLIERS ARE QUOTING FOR ALL ITEMS IN A STANDARD FORMAT, ON A COMMON BASIS FOR EASE OF EVALUATION"]
[]
[null,null,"GENERAL NOTES"]
[null,1,"The supplier must complete the following sheets:-"]
[null,null," - All 9 Activity schedules"]
[null,null," - Option X3: Rate of Exchange"]
{"$rows_left_out":30}
{"sheet":"02-Flat Plate, Gel","index":2,"n_rows":35,"n_cols":104,"rows_kept":35,"merged":[[0,0,0,7],[2,0,2,1],[2,2,2,7],[3,0,3,1],[3,2,3,7],[4,0,4,1],[4,2,4,7],[6,0,6,34],[7,0,7,27],[11,0,14,0],[11,1,14,1],[11,2,14,2],[11,3,14,3],[11,4,14,4],[11,5,11,15],[11,16,11,26],[11,27,11,37],[11,38,11,48],[11,49,11,59],[11,60,11,70],[11,71,11,81],[11,82,11,92],[11,93,11,103],[12,15,14,15],[12,26,14,26],[12,37,14,37],[12,48,14,48],[12,59,14,59],[12,70,14,70],[12,81,14,81],[12,92,14,92],[12,103,14,103],[13,5,14,5],[13,6,13,7],[13,8,13,11],[13,12,13,14],[13,16,14,16],[13,17,13,18],[13,19,13,22],[13,23,13,25],[13,27,14,27],[13,28,13,29],[13,30,13,33],[13,34,13,36],[13,38,14,38],[13,39,13,40],[13,41,13,44],[13,45,13,47],[13,49,14,49],[13,50,13,51],[13,52,13,55],[13,56,13,58],[13,60,14,60],[13,61,13,62],[13,63,13,66],[13,67,13,69],[13,71,14,71],[13,72,13,73],[13,74,13,77],[13,78,13,80],[13,82,14,82],[13,83,13,84],[13,85,13,88],[13,89,13,91],[13,93,14,93],[13,94,13,95],[13,96,13,99],[13,100,13,102]]}
["Offered Flat Plate, Gel Type VRLA Cells/Batteries"]
[]
["ENQUIRY NO:",null,{"$f":"'Cover Sheet'!C3","v":"E1270DXWC_"}]
["COMMODITY:",null,{"$f":"'Cover Sheet'!C4","v":"FLAT PLATE, GEL, VALVE REGULATED LEAD ACID (VRLA) BATTERIES"}]
["SUPPLIER:",null,{"$f":"IF('Cover Sheet'!C5=\"\",\"\",'Cover Sheet'!C5)","v":""}]
[]
["The prices for individual cells include a cell/battery label (number), inter-cell/battery connectors, bolts, nuts, washers, spring washers and corrosion protection.."]
["Linking sets will include interrow connectors, terminating cables and associated accessories."]
[]
[null,1,2,3,4,5,6,7,8,9,10,11,12,13,14,15,16,17,18,19,20,21,22,23,24,25,26,27,28,29,30,31,32,33,34,35,36,37,38,39,40,41,42,43,44,45,46,47,48,49,50,51,52,53,54,55,56,57,58,59,60,61,62,63,64,65,66,67,68,69,70,71,72,73,74,75,76,77,78,79,80,81,82,83,84,85,86,87,88,89,90,91,92,93,94,95,96,97,98,99,100,101,102,103]
{"$rows_left_out":26}
{"sheet":"03-Labour_Subs_Travel","index":3,"n_rows":49,"n_cols":10,"rows_kept":49,"merged":[[0,0,0,5],[2,0,2,2],[2,3,2,6],[3,0,3,2],[3,3,3,6],[4,0,4,2],[5,0,5,2],[5,3,5,5],[6,0,6,2],[6,3,6,5],[7,0,7,2],[7,3,7,5],[16,4,16,7],[17,0,18,0],[17,1,18,1],[17,2,18,2],[17,3,18,3],[17,4,18,4],[17,5,18,5],[17,6,18,6],[17,7,18,7],[30,0,31,0],[30,1,31,1],[30,2,31,2],[30,3,31,5],[32,3,32,5],[33,3,33,5],[34,3,34,5],[36,0,36,7],[36,8,36,9],[37,0,38,0],[37,1,38,1],[37,2,38,2],[37,3,38,3],[37,4,38,4],[37,5,38,5],[37,6,38,6],[37,7,38,7],[37,8,38,8],[37,9,38,9]]}
["COSTS FOR LABOUR, SUBSISTENCE AND TRAVELLING"]
[]
[{"$nulls":3},"Prices in South African Currency (Excluding VAT)"]
[{"$nulls":3},"Activities shall be quoted as PER UNIT and as being at the same site at the same time"]
[]
["ENQUIRY NO",null,null,{"$f":"'Cover Sheet'!C3","v":"E1270DXWC_"}]
["COMMODITY",null,null,{"$f":"'Cover Sheet'!C4","v":"FLAT PLATE, GEL, VALVE REGULATED LEAD ACID (VRLA) BATTERIES"}]
["SUPPLIER",null,null,{"$f":"IF('Cover Sheet'!C5=\"\",\"\",'Cover Sheet'!C5)","v":""}]
[]
["Notes:"]
{"$rows_left_out":40}
{"sheet":"04-Transport & Off Loading","index":4,"n_rows":27,"n_cols":13,"rows_kept":27,"merged":[[0,0,0,12],[2,0,2,5],[2,6,2,12],[3,0,3,5],[3,6,3,12],[4,0,4,5],[4,6,4,12],[5,0,8,0],[5,1,8,1],[5,3,5,12],[6,3,6,12],[7,3,7,12],[26,0,26,12]]}
["TRANSPORT AND OFF LOADING COSTS (Applicable to crated orders. Small items shall be couriered at the cheapest cost)"]
["Transport Costs on the same order, going to the same location shall be optimised and NOT treated as individual consignments."]
[" ENQUIRY NO",{"$nulls":5},{"$f":"'Cover Sheet'!C3","v":"E1270DXWC_"}]
["COMMODITY",{"$nulls":5},{"$f":"'Cover Sheet'!C4","v":"FLAT PLATE, GEL, VALVE REGULATED LEAD ACID (VRLA) BATTERIES"}]
["SUPPLIER",{"$nulls":5},{"$f":"IF('Cover Sheet'!C5=\"\",\"\",'Cover Sheet'!C5)","v":""}]
["Item","Distance to site [km]",null,"Prices in South African Currency (Excluding VAT)"]
[{"$nulls":3},"Transport to site or regional store and off-loading"]
[{"$nulls":3},"Total Mass [kg]"]
[{"$nulls":3},"0-1000","1001 - 2000","2001 - 3000","3001 - 4000","4001 - 6000","6001 - 8000","8001 - 10000","10001 - 14000","14001 - 18000","18000 +"]
[{"$nulls":3},1000,2000,3000,4000,6000,8000,10000,14000,18000,22000]
{"$rows_left_out":18}
{"sheet":"05-Accessories","index":5,"n_rows":29,"n_cols":5,"rows_kept":29,"merged":[[1,0,1,2],[1,3,1,4],[2,0,2,2],[2,3,2,4],[3,0,3,2],[3,3,3,4],[5,0,5,4],[26,1,26,4],[27,1,27,4],[28,1,28,4]]}
[]
["ENQUIRY NO",null,null,{"$f":"'Cover Sheet'!C3","v":"E1270DXWC_"}]
["COMMODITY",null,null,{"$f":"'Cover Sheet'!C4","v":"FLAT PLATE, GEL, VALVE REGULATED LEAD ACID (VRLA) BATTERIES"}]
["SUPPLIER",null,null,{"$f":"IF('Cover Sheet'!C5=\"\",\"\",'Cover Sheet'!C5)","v":""}]
[]
["List of Accessories (All amounts in ZAR excluding VAT.)"]
["Item","SAP Number","Short Description","Price","Comments"]
[1,"TBA","Anti-corrosion lubricant (at least 250ml)"]
[2,"TBA","VRLA battery cell logbook 1)"]
[3,"TBA","Battery cabinet identification label"]
{"$rows_left_out":20}
{"sheet":"06-Training","index":6,"n_rows":14,"n_cols":6,"rows_kept":14,"merged":[[1,0,1,5],[3,0,3,5],[5,0,5,1],[5,2,5,5],[6,0,6,1],[6,2,6,5],[7,0,7,1],[7,2,7,5],[11,0,11,5],[13,0,13,5]]}
[]
["TRAINING"]
[]
["Prices in South African Currency (Excluding VAT)"]
[]
[" ENQUIRY NO",null,{"$f":"'Cover Sheet'!C3","v":"E1270DXWC_"}]
["COMMODITY",null,{"$f":"'Cover Sheet'!C4","v":"FLAT PLATE, GEL, VALVE REGULATED LEAD ACID (VRLA) BATTERIES"}]
["SUPPLIER",null,{"$f":"IF('Cover Sheet'!C5=\"\",\"\",'Cover Sheet'!C5)","v":""}]
["Item","Options","Cost / Session / Student","Min no. of students","Max no. of students","Duration [days]"]
[1,"At Eskom Premises"]
{"$rows_left_out":5}
{"sheet":"07-Other Costs","index":7,"n_rows":7,"n_cols":3,"rows_kept":7,"merged":[[4,1,4,2]]}
[]
[null," ENQUIRY NO",{"$f":"'Cover Sheet'!C3","v":"E1270DXWC_"}]
[null,"COMMODITY",{"$f":"'Cover Sheet'!C4","v":"FLAT PLATE, GEL, VALVE REGULATED LEAD ACID (VRLA) BATTERIES"}]
[null,"SUPPLIER",{"$f":"IF('Cover Sheet'!C5=\"\",\"\",'Cover Sheet'!C5)","v":""}]
[null,"The supplier shall state the terms and conditions related to other costs that were not explicitly stated (requested) as part of the enquiry. These could include costs related to storage on behalf of Eskom where the site is not yet ready; cancellation fees - where an order was placed and needs to be amended / changed for other equipment, etc."]
[]
[null,"Item","Proposal with terms and conditions"]

{"sheet":"08-Flat Plate Gel Full Range","index":8,"n_rows":60,"n_cols":104,"rows_kept":60,"merged":[[0,0,0,7],[2,0,2,1],[2,2,2,7],[3,0,3,1],[3,2,3,7],[4,0,4,1],[4,2,4,7],[6,0,6,31],[7,0,7,34],[8,0,8,34],[9,0,9,27],[13,0,16,0],[13,1,16,1],[13,2,16,2],[13,3,16,3],[13,4,16,4],[13,5,13,15],[13,16,13,26],[13,27,13,37],[13,38,13,48],[13,49,13,59],[13,60,13,70],[13,71,13,81],[13,82,13,92],[13,93,13,103],[14,15,16,15],[14,26,16,26],[14,37,16,37],[14,48,16,48],[14,59,16,59],[14,70,16,70],[14,81,16,81],[14,92,16,92],[14,103,16,103],[15,5,16,5],[15,6,15,7],[15,8,15,11],[15,12,15,14],[15,16,16,16],[15,17,15,18],[15,19,15,22],[15,23,15,25],[15,27,16,27],[15,28,15,29],[15,30,15,33],[15,34,15,36],[15,38,16,38],[15,39,15,40],[15,41,15,44],[15,45,15,47],[15,49,16,49],[15,50,15,51],[15,52,15,55],[15,56,15,58],[15,60,16,60],[15,61,15,62],[15,63,15,66],[15,67,15,69],[15,71,16,71],[15,72,15,73],[15,74,15,77],[15,78,15,80],[15,82,16,82],[15,83,15,84],[15,85,15,88],[15,89,15,91],[15,93,16,93],[15,94,15,95],[15,96,15,99],[15,100,15,102],[17,1,59,1]]}
[{"$f":"'02-Flat Plate, Gel'!A1","v":"Offered Flat Plate, Gel Type VRLA Cells/Batteries"}]
[]
["ENQUIRY NO:",null,{"$f":"'Cover Sheet'!C3","v":"E1270DXWC_"}]
["COMMODITY:",null,{"$f":"'Cover Sheet'!C4","v":"FLAT PLATE, GEL, VALVE REGULATED LEAD ACID (VRLA) BATTERIES"}]
["SUPPLIER:",null,{"$f":"IF('Cover Sheet'!C5=\"\",\"\",'Cover Sheet'!C5)","v":""}]
[]
["Price Schedule for Tripper Pack and Individual Cells - All amounts in ZAR excluding VAT."]
["The prices for individual cells include a cell label (number), inter-cell connectors, bolts, nuts, washers, spring washers, corrosion protection and electrolyte."]
["Tripper Pack is sealed, cylindrical, D size Nickel Cadmium cells consisiting of 20 cells (4x5 cell configuration) shall be wrapped (PVC shrink-wrapping, or plastic casings) as a unit. Comply with IEC 61951-1, Secondary cells and batteries containing alkaline or other non-acid electrolytes – Portable sealed rechargeable single cells – Part 1: Nickel-Cadmium."]
["Linking sets will include interrow connectors, terminating cables and associated accessories."]
{"$rows_left_out":51}
{"sheet":"Option X3","index":9,"n_rows":21,"n_cols":7,"rows_kept":21,"merged":[[1,1,1,3],[1,4,1,6],[2,1,2,3],[2,4,2,6],[3,1,3,3],[3,4,3,6],[4,1,4,6],[20,1,20,6]]}
[]
[null,{"$f":"[10]Summary!C3","v":"ENQUIRY No"},null,null,{"$f":"'Cover Sheet'!C3","v":"E1270DXWC_"}]
[null,{"$f":"[10]Summary!C4","v":"COMMODITY"},null,null,{"$f":"'Cover Sheet'!C4","v":"FLAT PLATE, GEL, VALVE REGULATED LEAD ACID (VRLA) BATTERIES"}]
[null,{"$f":"[10]Summary!C5","v":"SUPPLIER"},null,null,{"$f":"IF('Cover Sheet'!C5=\"\",\"\",'Cover Sheet'!C5)","v":""}]
[null,"MULTIPLE CURRENCIES - SECONDARY OPTION X3"]
[null,"No","Currency Description","Code","Foreign Exchange Currency 1,00 =","Date Published","Source"]
[null,1,"Austrailian Dollar","AUD"]
[null,{"$f":"B7+1","v":2},"Canadian Dollar","CAD"]
[null,3,"Swiss Franc","CHF"]
[null,4,"Danish Krone","DKK"]
{"$rows_left_out":12}
{"sheet":"Option X1","index":10,"n_rows":108,"n_cols":15,"rows_kept":108,"merged":[[1,1,1,2],[1,3,1,5],[2,1,2,2],[2,3,2,5],[3,1,3,2],[3,3,3,5],[4,1,4,5],[6,2,6,5],[7,2,7,5],[8,2,8,5],[9,2,9,5],[10,2,10,5],[11,2,11,5],[12,2,12,5],[13,2,13,5],[14,2,14,5],[15,2,15,5],[16,2,16,5],[20,2,26,2],[29,2,35,2],[38,2,44,2],[47,2,53,2],[56,2,62,2],[65,2,71,2],[74,2,80,2],[83,2,89,2],[92,2,98,2],[101,2,107,2]]}
[]
[null,"ENQUIRY No",null,{"$f":"'Cover Sheet'!C3","v":"E1270DXWC_"}]
[null,"COMMODITY",null,{"$f":"'Cover Sheet'!C4","v":"FLAT PLATE, GEL, VALVE REGULATED LEAD ACID (VRLA) BATTERIES"}]
[null,"SUPPLIER",null,{"$f":"IF('Cover Sheet'!C5=\"\",\"\",'Cover Sheet'!C5)","v":""}]
[null,"PRICE ADJUSTMENT FOR INFLATION - SECONDARY OPTION X1"]
[null,"No","Description of Formula"]
[null,"Fixed","Firm and Fixed"]
[null,"01",{"$f":"C21","v":"Description of formula 1"}]
[null,"02",{"$f":"C30","v":"Description of formula 2"}]
[null,"03",{"$f":"C39","v":"Description of formula 3"}]
{"$rows_left_out":99}
{"sheet":"Indices","index":11,"n_rows":33,"n_cols":5,"rows_kept":33,"merged":[[10,3,19,3],[10,4,12,4],[12,5,13,5],[13,4,19,4],[14,5,15,5],[15,0,18,0],[16,5,17,5],[18,5,19,5],[20,0,20,4],[21,0,21,4]]}
[{"$f":"'[11]C2.2.0 Cover Page'!A12","v":"OFFER CATEGORY : E.g.  \"MAIN\", or \"ALTERNATIVE 3\", etc."}]
[]
[]
["PRESCRIBED INDICES"]
["Note :"]
["It is important that these indices are considered with the requirements in Spares and Tools and Maintenance and repairs,Training and IP"]
["Please go through the Eskom CPA strategy document attached."]
["LOCAL CPA INDICES","Latest"]
[]
["Labour","Commodities","Processed material","Transport","Others"]
{"$rows_left_out":24}
{"sheet":"TOTAL PRICE_Flat Plate, Gel","index":12,"n_rows":31,"n_cols":15,"rows_kept":31,"merged":[[1,1,1,3],[1,10,1,15],[2,1,2,3],[3,1,3,3],[3,10,3,15],[5,0,5,3],[30,1,30,6]]}
[{"$nulls":5},"Cost","Column #",null,null,"Notes:","1) Custom battery banks qty's standardised to closest standard bank size"]
["ENQUIRY NO",{"$f":"'Cover Sheet'!C3","v":"E1270DXWC_"},{"$nulls":3},"Equipment",{"$f":"SUM(C10:E26)","v":0},"1+2+3",null,null,"2) Distance for travelling is assumed to 1000km (roundtrip)"]
["COMMODITY",{"$f":"'Cover Sheet'!C4","v":"FLAT PLATE, GEL, VALVE REGULATED LEAD ACID (VRLA) BATTERIES"},{"$nulls":3},"Services without Discharge Test",{"$f":"SUM(F10:L26)","v":0},"4+5+7+8+9+10",null,null,"3) Distance for transport is assumed to 500km (one way)",null,null,500,"km"]
["SUPPLIER",{"$f":"IF('Cover Sheet'!C5=\"\",\"\",'Cover Sheet'!C5)","v":""},{"$nulls":3},"Services with Discharge Test",{"$f":"SUM(F10:K26)+SUM(N10:N26)","v":0},"4+5+7+8+9+12"]
[]
["SUMMARY OF PRICES EXCLUDING VAT"]
[{"$nulls":3},"DRST",null,null,0,{"$f":"G7+13","v":13},{"$f":"H7+13","v":26},39,52]
["Column #",null,1,2,3,4,5,6,7,8,9,10,11,12,13]
["Required Capacity [Ah]","Offered Ah","Wet Cells","Linking Sets","Battery Cabinets","Decommissioning","Installation","Commissioning without Discharge","Commissioning with Discharge","Transport","Travelling","Subsistence (Wet Charged) - Commissioning without Discharge Test","Total cost - Commissioning without Discharge Test","Subsistence (Wet Charged) - Commissioning with Discharge Test","Total cost - Commissioning with Discharge Test"]
[{"$f":"'02-Flat Plate, Gel'!B16","v":"12V/7.8Ah"},{"$f":"'02-Flat Plate, Gel'!C16","v":0},{"$f":"VLOOKUP($A10,LP_Table,12,0)","v":0},{"$f":"SUM(VLOOKUP($A10,LP_Table,23,0),VLOOKUP($A10,LP_Table,34,0),VLOOKUP($A10,LP_Table,45,0),VLOOKUP($A10,LP_Table,56,0))","v":0},{"$f":"SUM(VLOOKUP($A10,LP_Table,67,0),VLOOKUP($A10,LP_Table,78,0),VLOOKUP($A10,LP_Table,89,0),VLOOKUP($A10,LP_Table,100,0))","v":0},{"$f":"IF($B10<='03-Labour_Subs_Travel'!$C$20,('02-Flat Plate, Gel'!Q16*'03-Labour_Subs_Travel'!E42)+('02-Flat Plate, Gel'!$AB16*'03-Labour_Subs_Travel'!E$44)+('02-Flat Plate, Gel'!$AM16*'03-Labour_Subs_Travel'!E$46)+('02-Flat Plate, Gel'!$AX16*'03-Labour_Subs_Travel'!E$48),('02-Flat Plate, Gel'!Q16*'03-Labour_Subs_Travel'!E43)+('02-Flat Plate, Gel'!$AB16*'03-Labour_Subs_Travel'!E$45)+('02-Flat Plate, Gel'!$AM16*'03-Labour_Subs_Travel'!E$47)+('02-Flat Plate, Gel'!$AX16*'03-Labour_Subs_Travel'!E$49))","v":0},{"$f":"IF($B10<='03-Labour_Subs_Travel'!$C$20,('02-Flat Plate, Gel'!Q16*'03-Labour_Subs_Travel'!F$42)+('02-Flat Plate, Gel'!$AB16*'03-Labour_Subs_Travel'!F$44)+('02-Flat Plate, Gel'!$AM16*'03-Labour_Subs_Travel'!F$46)+('02-Flat Plate, Gel'!$AX16*'03-Labour_Subs_Travel'!F$48),('02-Flat Plate, Gel'!Q16*'03-Labour_Subs_Travel'!F$43)+('02-Flat Plate, Gel'!$AB16*'03-Labour_Subs_Travel'!F$45)+('02-Flat Plate, Gel'!$AM16*'03-Labour_Subs_Travel'!F$47)+('02-Flat Plate, Gel'!$AX16*'03-Labour_Subs_Travel'!F$49))","v":0},{"$f":"IF($B10<='03-Labour_Subs_Travel'!$C$20,('02-Flat Plate, Gel'!$Q16*'03-Labour_Subs_Travel'!G$42)+('02-Flat Plate, Gel'!$AB16*'03-Labour_Subs_Travel'!G$44)+('02-Flat Plate, Gel'!$AM16*'03-Labour_Subs_Travel'!G$46)+('02-Flat Plate, Gel'!$AX16*'03-Labour_Subs_Travel'!G$48),('02-Flat Plate, Gel'!$Q16*'03-Labour_Subs_Travel'!G$43)+('02-Flat Plate, Gel'!$AB16*'03-Labour_Subs_Travel'!G$45)+('02-Flat Plate, Gel'!$AM16*'03-Labour_Subs_Travel'!G$47)+('02-Flat Plate, Gel'!$AX16*'03-Labour_Subs_Travel'!G$49))","v":0},{"$f":"IF($B10<='03-Labour_Subs_Travel'!$C$20,('02-Flat Plate, Gel'!$Q16*'03-Labour_Subs_Travel'!H$42)+('02-Flat Plate, Gel'!$AB16*'03-Labour_Subs_Travel'!H$44)+('02-Flat Plate, Gel'!$AM16*'03-Labour_Subs_Travel'!H$46)+('02-Flat Plate, Gel'!$AX16*'03-Labour_Subs_Travel'!H$48),('02-Flat Plate, Gel'!$Q16*'03-Labour_Subs_Travel'!H$43)+('02-Flat Plate, Gel'!$AB16*'03-Labour_Subs_Travel'!H$45)+('02-Flat Plate, Gel'!$AM16*'03-Labour_Subs_Travel'!H$47)+('02-Flat Plate, Gel'!$AX16*'03-Labour_Subs_Travel'!H$49))","v":0},{"$f":"('02-Flat Plate, Gel'!Q16*INDEX(TransportTable,MATCH(IF($N$3<100,100,$N$3),Distance,1),MATCH(IF(Num_30*VLOOKUP($A10,LP_Table,4,0)<1000,1000,Num_30*VLOOKUP($A10,LP_Table,4,0)),WeightRange,1)))+('02-Flat Plate, Gel'!AB16*INDEX(TransportTable,MATCH(IF($N$3<100,100,$N$3),Distance,1),MATCH(IF(Num_48*VLOOKUP($A10,LP_Table,4,0)<1000,1000,Num_48*VLOOKUP($A10,LP_Table,4,0)),WeightRange,1)))+('02-Flat Plate, Gel'!AM16*INDEX(TransportTable,MATCH(IF($N$3<100,100,$N$3),Distance,1),MATCH(IF(Num_110*VLOOKUP($A10,LP_Table,4,0)<1000,1000,Num_110*VLOOKUP($A10,LP_Table,4,0)),WeightRange,1)))+('02-Flat Plate, Gel'!AX16*INDEX(TransportTable,MATCH(IF($N$3<100,100,$N$3),Distance,1),MATCH(IF(Num_220*VLOOKUP($A10,LP_Table,4,0)<1000,1000,Num_220*VLOOKUP($A10,LP_Table,4,0)),WeightRange,1)))","v":0},{"$f":"2*$N$3*'03-Labour_Subs_Travel'!$C$35*('02-Flat Plate, Gel'!Q16+'02-Flat Plate, Gel'!AB16+'02-Flat Plate, Gel'!AM16+'02-Flat Plate, Gel'!AX16)","v":0},{"$f":"IF($B10<='03-Labour_Subs_Travel'!$C$20,('02-Flat Plate, Gel'!Q16*'03-Labour_Subs_Travel'!$I$42)+('02-Flat Plate, Gel'!AB16*'03-Labour_Subs_Travel'!$I$44)+('02-Flat Plate, Gel'!AM16*'03-Labour_Subs_Travel'!$I$46)+('02-Flat Plate, Gel'!AX16*'03-Labour_Subs_Travel'!$I$48),('02-Flat Plate, Gel'!Q16*'03-Labour_Subs_Travel'!$I$43)+('02-Flat Plate, Gel'!AB16*'03-Labour_Subs_Travel'!$I$45)+('02-Flat Plate, Gel'!AM16*'03-Labour_Subs_Travel'!$I$47)+('02-Flat Plate, Gel'!AX16*'03-Labour_Subs_Travel'!$I$49))","v":0},{"$f":"SUM(C10:L10)","v":0},{"$f":"IF($B10<='03-Labour_Subs_Travel'!$C$20,('02-Flat Plate, Gel'!Q16*'03-Labour_Subs_Travel'!$J$42)+('02-Flat Plate, Gel'!AB16*'03-Labour_Subs_Travel'!$J$44)+('02-Flat Plate, Gel'!AM16*'03-Labour_Subs_Travel'!$J$46)+('02-Flat Plate, Gel'!AX16*'03-Labour_Subs_Travel'!$J$48),('02-Flat Plate, Gel'!Q16*'03-Labour_Subs_Travel'!$J$43)+('02-Flat Plate, Gel'!AB16*'03-Labour_Subs_Travel'!$J$45)+('02-Flat Plate, Gel'!AM16*'03-Labour_Subs_Travel'!$J$47)+('02-Flat Plate, Gel'!AX16*'03-Labour_Subs_Travel'!$J$49))","v":0},{"$f":"SUM(C10:K10)+N10","v":0}]
{"$rows_left_out":22}
{"sheet":"Forecasts","index":13,"n_rows":23,"n_cols":16,"rows_kept":23,"merged":[[0,0,0,1],[1,4,1,12]]}
["DC : Valve Regulated Lead Acid Batteries",{"$nulls":3},"Rate =","R",12,"/Ah"]
[{"$nulls":4},"Item Quantity/OU"]
["Item No","Item Description","C10 Rating [Ah]","SAP Number","ECOU","FSOU","GOU","KZNOU","LOU","MOU","NCOU","NWOU","WCOU","48V","110V","220V"]
[{"$f":"'[12]1.VLA Total'!A4","v":1},{"$f":"\"2V, Flat Plate, Valve Regulated, Lead Acid, Gel Cell, C10 = \"&C4&\"Ah\"","v":"2V, Flat Plate, Valve Regulated, Lead Acid, Gel Cell, C10 = 50Ah"},50,null,0,0,0,600,0,0,0,0,0,{"$f":"SUM(E4:M4)/24","v":25}]
[{"$f":"'[12]1.VLA Total'!A5","v":2},{"$f":"\"2V, Flat Plate, Valve Regulated, Lead Acid, Gel Cell, C10 = \"&C5&\"Ah\"","v":"2V, Flat Plate, Valve Regulated, Lead Acid, Gel Cell, C10 = 100Ah"},100,null,0,0,0,{"$f":"2100-1587","v":513},0,0,0,0,0,null,{"$f":"H5/60","v":8.55}]
[{"$f":"'[12]1.VLA Total'!A6","v":3},"2V, Flat Plate, Valve Regulated, Lead Acid, Gel Cell, C10 = 150Ah",150,null,448,0,0,{"$f":"2100-1587","v":513},0,0,0,0,0,{"$f":"E6/28","v":16},{"$f":"H6/60","v":8.55}]
[{"$f":"'[12]1.VLA Total'!A7","v":4},"2V, Flat Plate, Valve Regulated, Lead Acid, Gel Cell, C10 = 200Ah",200,null,0,0,0,0,0,0,12,0,0,3]
[{"$f":"'[12]1.VLA Total'!A8","v":5},"2V, Flat Plate, Valve Regulated, Lead Acid, Gel Cell, C10 = 250Ah",250,null,24,0,0,0,0,0,0,0,0,1]
[{"$f":"'[12]1.VLA Total'!A9","v":6},"2V, Flat Plate, Valve Regulated, Lead Acid, Gel Cell, C10 = 300Ah",300,null,510,0,0,0,150,0,0,630,0,{"$f":"SUM(E14:M14)/25","v":262}]
[{"$f":"'[12]1.VLA Total'!A10","v":7},"2V, Flat Plate, Valve Regulated, Lead Acid, Gel Cell, C10 = 350Ah",350,null,24,0,0,0,0,0,0,0,0,1]
{"$rows_left_out":13}