{"text_format":"3","workbook":"xlsx","n_sheets":7,"sheets":["Read Me","Tender Cover Sheet","5.1.0 Preamble","5.1.1 Price Table 1","5.1.2 CPA Formulae","5.1.4 PS5","5.1.4 Exchange Rates"],"not_rendered":{"images":1,"external_links":2,"defined_names":11},"read":"whole","date_system":"1900"}

{"sheet":"Read Me","index":0,"n_rows":25,"n_cols":3,"rows_kept":25,"merged":[[7,1,7,2],[8,1,8,2],[9,1,9,2],[10,1,10,2],[15,8,15,15],[16,8,16,15],[21,1,21,2],[22,1,22,2]]}
["Enquiry No."]
["Package Name:",null,{"$f":"'Tender Cover Sheet'!C14","v":"Facilities Maintenance and Repairs on Eskom Telecommunications Radio Site in Western Region on an as and when required basis for a period of 36 months"}]
["Tenderer's Name:"]
["Category of Offer ( Main Offer Only):",null,"Main Offer Only"]
[]
["READ ME"]
[]
[1,"Read these notes BEFORE you commence input  to this workbook. Changes may not be made to this workbook. No columns may be removed, edited, added or changed on this workbook."]
[2,"Only The Main Offer shall be accepted. No alternative offers are accepted. There must be a separate Excel and PDF file for the main offer."]
[3,"Main offer is = The pricing schedule may not be changed or altered. Tenderer(s) to populate all required information on the Tender cover sheet and also populate as stipulated in (5.1.1 Pricing, 5.1.2 CPA Formulae, 5.1.3 Summary (VATPortion) and 5.1.4 Exchange Rates. "]
[4,"NOTE:  ALL CALCULATIONS ARE THE RESPONSIBILITY OF THE TENDERER, AND MUST BE CHECKED THOROUGHLY.  ANY DISCREPANCY FOUND IN THE CALCULATIONS IN THIS WORKBOOK MUST BE BROUGHT TO THE ATTENTION OF ESKOM, THROUGH THE DESIGNATED BUYER!"]
[]
[]
[5,"This workbook contains the following sheets:"]
[null,"Read Me","This sheet provides an overview to the Tenderer of the content and role of the sheets making up the Price Schedule.  It will not form part of the tender or contract.The tender will be awarded to a single supplier.This contract is an \"as and when\" required contract. The units herein are estimates only and are non-committal."]
[null,"Tender Cover Sheet","This is the cover sheet for Worksheets 5.1.0 to 5.1.4 and provides the total tendered price which is mandatory be completed.  It is also the source of the package name, tenderer name etc. for the other worksheets.  It will  form part of the tender or contract. Worksheets Tender Cover Sheet, 5.1.1 Pricing, 5.1.2 CPA Formulae, 5.1.3 Summary and 5.1.4 Exchange Rates are compulsory tender returnables as they are loaded onto the Eskom Tender Bulletin and they may not be changed or altered."]
[null,"5.1.0 Preamble","This sheet provides general guidelines for this section."]
[null,"5.1.1 Pricing","This is the main data entry sheet for the Tenderer to complete. The Tenderer takes responsibility for ensuring correct inputs. Tenderers are to populate their pricing information as stipulated in the pricing schedule. The pricing schedule may not be changed or altered. Tenderer(s) to populate all required information on the Tender cover sheet as stipulated in  (5.1.1 Pricing ), (5.1.4 Exchange rates) and  (5.1.2 CPA Formulae). "]
[null,"5.1.2 CPA Formulae","This sheet must be completed by the Tenderer for the proposed contract price adjustment (CPA) formulae, (where applicable ) and will be carried forward to worksheet (5.1.1 Pricing). Details of the CPA Formulae to be determined in accordance with the CPA conditions with reference to the NOTES. If the CPA Formulae are not inputted, in worksheet 5.1.2 CPA formulae, the tendered prices will be deemed \"Fixed and Firm\". If the CPA formulae is inputted in worksheet (5.1.2 CPA Formulae) but is not reflected, using the drop downs, in worksheet (5.1.1 Pricing), the tendered prices will be deemed \"Fixed and Firm\". Rate of exchange (ROE) cannot be accepted by Eskom to form part of any CPA formulae. Prices will be fixed and firm for the first year of the contract. Each CPA formula must add up to 100% and must contain a minimum fixed portion of 15%"]
[]
[]
[6,"Conventions used in this workbook"]
[null,"The following conventions have been used in this workbook to facilitate its accurate use:"]
[null,null,"Only Light Green highlighted cells are to be inputted by the Tenderer."]
[null,null,"There will be no inputting in Grey highlighted cells."]

{"sheet":"Tender Cover Sheet","index":1,"n_rows":44,"n_cols":4,"rows_kept":44}
{"$rows_empty":9}
[null,"PRICING INFORMATION"]
[]
[null,"ENQUIRY No."]
[]
[null,"NAME OF PACKAGE:","Facilities Maintenance and Repairs on Eskom Telecommunications Radio Site in Western Region on an as and when required basis for a period of 36 months"]
[]
[null,"TENDERER’S NAME:  "]
[]
[null,"CATEGORY OF OFFER (MAIN OFFER ONLY):",{"$f":"'Read Me'!C4","v":"Main Offer Only"}]
[]
[null,"TENDERED PRICE:  IN ZAR",{"$f":"#REF!","v":{"$error":"#REF!"}}]
[null,"(excluding VAT)"]
[]
[null,"RAND VALUE IN WORDS","[Price in Words]"]
[]
[]
[]
[]
[null,"TENDERED PRICE:  IN ZAR",{"$f":"#REF!","v":{"$error":"#REF!"}}]
[null,"(including VAT)"]
[]
[null,"DATE :"]
[]
[]
[]
[null,"FULL NAMES OF SIGNATORY:"]
[]
[]
[]
{"$rows_left_out":7}
{"sheet":"5.1.0 Preamble","index":2,"n_rows":18,"n_cols":3,"rows_kept":18,"merged":[[0,0,0,1],[1,0,1,1],[2,0,2,1],[3,0,3,1],[7,1,7,2],[8,1,8,2],[9,1,9,2],[10,1,10,2],[11,1,11,2],[12,1,12,2],[13,1,13,2],[14,1,14,2],[15,1,15,2],[16,1,16,2],[17,1,17,2]]}
["Enquiry No.",null,{"$f":"'Tender Cover Sheet'!C12","v":0}]
["Package Name:",null,{"$f":"'Tender Cover Sheet'!C14","v":"Facilities Maintenance and Repairs on Eskom Telecommunications Radio Site in Western Region on an as and when required basis for a period of 36 months"}]
["Tenderer's Name:",null,{"$f":"'Tender Cover Sheet'!C16","v":0}]
["Category of Offer:",null,{"$f":"'Read Me'!C4","v":"Main Offer Only"}]
[]
["5.1.0 PREAMBLE TO PRICE SCHEDULE "]
[]
[1,"The Price Schedule provides the basis of valuation, price adjustment (CPA) formulae and information for general contract progress monitoring. This contract is an \"as and when\" required contract.The tender will be awarded to a single supplier.The units herein are estimates only and are non-committal.  No alternative offers are accepted."]
[2,"This is the main data entry sheet for the Tenderer to complete. The Tenderer takes responsibility for ensuring correct inputs. Tenderers are to populate their pricing information as stipulated in the pricing schedule. The pricing schedule may not be changed or altered. Tenderer(s) to populate all required information on the Tender cover sheet and also populate  as stipulated in  (5.1.1 Pricing )  (5.1.2 CPA Formulae) and (5.1.4 Exchange rates). CPA Formulae should represent cost breakdown of the goods/commodities/components/items being sourced."]
[3,"The Prices are the amounts stated in the price column of the Price Schedule.  Where an estimated quantity is stated for an item in the Price Schedule, the Price is calculated by multiplying the estimated quantity by the rate."]
[4,"If the Supplier has decided not to identify a particular item in the price schedule at the time of tender the cost to the Supplier of doing the work is assumed to be included in, or spread across, the other Prices and rates in the price schedule in order to fulfil the obligation to Provide the Goods and Services for the tendered total of the Prices.  "]
[5,"The total of the prices must include for all direct and indirect costs, overheads, profit on costs, risks, liabilities, obligations, etc. relative to the contract."]
[6,"The Tenderer must allow for all necessary costs to complete the pricing shedule as required in terms of the specifications, technical scope and conditions of contract whether expressly stated or not in the Price Schedules. The Tenderer must provide any breakdown of prices as may be required for specific items not detailed in the Price Schedule prior to or after contract award."]
[7,"The Prices quoted by the supplier should be exclusive and inclusive of VAT."]
[8," Please note, that the Tenderer is to input the VAT amount as no formulae has been provided for the VAT portion."]
[9,"All worksheets in this Pricing Schedule are to be submitted. Tenderers are not allowed to ommit a worksheet. If specifically worksheets, 5.1.1 or 5.1.2 are ommited, it will be deemed that CPA  are not applicable to this tender. Rate of exchange (ROE) cannot be accepted by Eskom to form part of any CPA formulae."]
[10,"Only Light Green highlighted cells are to be inputted by the Tenderer."]
[11,"There will be no inputting in Grey highlighted cells."]

{"sheet":"5.1.1 Price Table 1","index":3,"n_rows":82,"n_cols":16,"rows_kept":82,"merged":[[8,1,8,2],[9,1,9,2],[11,4,11,5],[11,6,11,10],[11,11,11,13],[11,14,11,15],[12,0,13,0],[12,1,13,1],[12,2,13,2],[12,3,13,3],[12,4,13,4],[12,5,13,5],[12,6,13,6],[12,7,13,7],[12,8,13,8],[12,9,13,9],[12,10,13,10],[12,11,13,11],[12,12,13,12],[12,13,13,13],[12,14,13,14],[12,15,13,15],[80,6,80,8]]}
["Enquiry No.",{"$f":"'[1]Tender Cover Sheet'!C12","v":0}]
["Package Name:",{"$f":"'Tender Cover Sheet'!C14","v":"Facilities Maintenance and Repairs on Eskom Telecommunications Radio Site in Western Region on an as and when required basis for a period of 36 months"}]
["Tenderer's Name:",{"$f":"'Tender Cover Sheet'!C16","v":0}]
["Category of Offer:",{"$f":"'Tender Cover Sheet'!C18","v":"Main Offer Only"}]
[]
["5.1.1. Pricing"]
[]
["NOTES:"]
[1,"NB - Column F & Column N in 5.1.1 Pricing is a  drop down cell for tenderer to select the Currency and CPA formula chosen that they would have populated in 5.1.2 CPA Formulae and 5.1.4 Exchange Rates. It is the Tenderer's responsibility to ensure that Column H correctly reflects the intention of the Tenderer."]
[2,"CPA Formulae Codes Column I 5.1.1 Pricing is to be populated by the tenderer by selecting the respective drop down codes CPA formula as  developed by Tenderer in 5.1.2 CPA formulae worksheet   (e.g. Formula A - J ) then  the tenderer must populate their respective CPA formula in  5.1.2 CPA Formulae Worksheet. Codes and descriptions must be selected by the tenderer and inserted into each row of activity. "]
[]
[{"$nulls":4},"Local Currency",null,"Foreign Currency",{"$nulls":4},"Local + Foreign",null,null,"CPA"]
["Line No.","Activity description","Unit of measure"," Quantities","Tendered Rates (ZAR)","Total Tendered Value (ZAR)","Currency Code (See Sheet 5.1.4 Rate of Exchange)","RoE Currency 1,00 = ZAR","Unit Price in Foreign Currency","Total Foreign Price in Foreign Currency","Total Foreign Price in Local Currency (ZAR)","Tendered Price Excld. Vat (ZAR)","Vat ","Tendered Price Including Vat (ZAR)","CPA Formula No.\n(See Sheet 5.1.2)","CPA Description\n(See Sheet 5.1.2)"]
[]
[]
[null,"Maintenance Services (including Health and Safety costs):"]
["Table 1","Assistant Skilled (R/hour):"]
[1,"Assistant Skilled - Normal time (R/hour)","Hr",1,null,{"$f":"E18*D18","v":0},"ZAR",{"$f":"IF(G18<>\"\",VLOOKUP(G18,'[2]5.1.4 Exchange Rates'!$C$23:$D$37,2,FALSE),\"\")","v":1},null,{"$f":"D18*I18","v":0},{"$f":"D18*H18*I18","v":0},{"$f":"K18+F18","v":0},{"$f":"L18*15%","v":0},{"$f":"L18+M18","v":0},null,{"$f":"IF(O18=\"\",\"Fixed\",VLOOKUP(O18,'[2]5.1.2 CPA Formulae'!$B$9:$E$19,2,FALSE))","v":"Fixed"}]
[2,"Assistant Skilled - Overtime @ 1.5 (R/hour)","Hr",1,null,0,"ZAR",{"$f":"IF(G19<>\"\",VLOOKUP(G19,'[2]5.1.4 Exchange Rates'!$C$23:$D$37,2,FALSE),\"\")","v":1},null,0,0,{"$f":"K19+F19","v":0},0,0,null,{"$f":"IF(O19=\"\",\"Fixed\",VLOOKUP(O19,'[2]5.1.2 CPA Formulae'!$B$9:$E$19,2,FALSE))","v":"Fixed"}]
[3,"Assistant Skilled - Overtime @ 2 (R/hour)","Hr",1,null,0,"ZAR",1,null,0,0,0,0,0,null,{"$f":"IF(O20=\"\",\"Fixed\",VLOOKUP(O20,'[2]5.1.2 CPA Formulae'!$B$9:$E$19,2,FALSE))","v":"Fixed"}]
[4,"Assistant Skilled - Travel time - Normal (R/hour)","Hr",1,null,0,"ZAR",{"$f":"IF(G21<>\"\",VLOOKUP(G21,'[2]5.1.4 Exchange Rates'!$C$23:$D$37,2,FALSE),\"\")","v":1},null,0,0,0,0,0,null,{"$f":"IF(O21=\"\",\"Fixed\",VLOOKUP(O21,'[2]5.1.2 CPA Formulae'!$B$9:$E$19,2,FALSE))","v":"Fixed"}]
[5,"Assistant Skilled - Travel time - Overtime @ 1.5 (R/hour)","Hr",1,null,0,"ZAR",1,null,0,0,0,0,0,null,{"$f":"IF(O22=\"\",\"Fixed\",VLOOKUP(O22,'[2]5.1.2 CPA Formulae'!$B$9:$E$19,2,FALSE))","v":"Fixed"}]
[6,"Assistant Skilled - Travel time - Overtime @ 2 (R/hour)","Hr",1,null,0,"ZAR",1,null,0,0,0,0,0,null,{"$f":"IF(O23=\"\",\"Fixed\",VLOOKUP(O23,'[2]5.1.2 CPA Formulae'!$B$9:$E$19,2,FALSE))","v":"Fixed"}]
[null,"TOTAL",{"$nulls":3},{"$f":"SUM(F18:F22)","v":0},{"$nulls":3},{"$f":"SUM(J18:J22)","v":0},0,0,0,0]
[]
["Table 2","Assistant Un-Skilled (R/hour):"]
[1,"Assistant Un-Skilled - Normal time (R/hour)","Hr",1,null,{"$f":"E27*D27","v":0},"ZAR",{"$f":"IF(G27<>\"\",VLOOKUP(G27,'[2]5.1.4 Exchange Rates'!$C$23:$D$37,2,FALSE),\"\")","v":1},null,{"$f":"D27*I27","v":0},{"$f":"D27*H27*I27","v":0},{"$f":"K27+F27","v":0},{"$f":"L27*15%","v":0},{"$f":"L27+M27","v":0},null,{"$f":"IF(O27=\"\",\"Fixed\",VLOOKUP(O27,'[2]5.1.2 CPA Formulae'!$B$9:$E$19,2,FALSE))","v":"Fixed"}]
[2,"Assistant Un-Skilled - Overtime @ 1.5 (R/hour)","Hr",1,null,0,"ZAR",{"$f":"IF(G28<>\"\",VLOOKUP(G28,'[2]5.1.4 Exchange Rates'!$C$23:$D$37,2,FALSE),\"\")","v":1},null,0,0,{"$f":"K28+F28","v":0},0,0,null,{"$f":"IF(O28=\"\",\"Fixed\",VLOOKUP(O28,'[2]5.1.2 CPA Formulae'!$B$9:$E$19,2,FALSE))","v":"Fixed"}]
[3,"Assistant Un-Skilled - Overtime @ 2 (R/hour)","Hr",1,null,0,"ZAR",{"$f":"IF(G29<>\"\",VLOOKUP(G29,'[2]5.1.4 Exchange Rates'!$C$23:$D$37,2,FALSE),\"\")","v":1},null,0,0,0,0,0,null,{"$f":"IF(O29=\"\",\"Fixed\",VLOOKUP(O29,'[2]5.1.2 CPA Formulae'!$B$9:$E$19,2,FALSE))","v":"Fixed"}]
[4,"Assistant Un-Skilled - Travel time - Normal (R/hour)","Hr",1,null,0,"ZAR",{"$f":"IF(G30<>\"\",VLOOKUP(G30,'[2]5.1.4 Exchange Rates'!$C$23:$D$37,2,FALSE),\"\")","v":1},null,0,0,0,0,0,null,{"$f":"IF(O30=\"\",\"Fixed\",VLOOKUP(O30,'[2]5.1.2 CPA Formulae'!$B$9:$E$19,2,FALSE))","v":"Fixed"}]
{"$rows_left_out":53}
{"sheet":"5.1.2 CPA Formulae","index":4,"n_rows":148,"n_cols":67,"rows_kept":148,"merged":[[0,0,0,1],[1,0,1,1],[2,0,2,1],[3,0,3,1],[5,0,5,4],[8,2,8,3],[8,5,8,7],[9,2,9,4],[9,5,18,7],[10,2,10,4],[11,2,11,4],[12,2,12,4],[13,2,13,4],[14,2,14,4],[15,2,15,4],[16,2,16,4],[17,2,17,4],[18,2,18,4],[21,1,21,6],[22,1,22,6],[25,1,25,6],[26,1,26,6],[27,1,27,6],[28,1,28,6],[29,1,29,6],[30,1,30,6],[32,1,32,6],[33,1,33,6],[34,1,34,6],[35,1,35,6],[36,1,36,6],[40,1,40,6],[51,1,51,6],[62,1,62,6],[73,1,73,6],[84,1,84,6],[95,1,95,6],[106,1,106,6],[117,1,117,6],[128,1,128,6],[139,1,139,6]]}
["Enquiry No.",null,{"$f":"'Tender Cover Sheet'!C12","v":0}]
["Package Name:",null,{"$f":"'Tender Cover Sheet'!C14","v":"Facilities Maintenance and Repairs on Eskom Telecommunications Radio Site in Western Region on an as and when required basis for a period of 36 months"}]
["Tenderer's Name:",null,{"$f":"'Tender Cover Sheet'!C16","v":0}]
["Category of Offer:",null,{"$f":"'Read Me'!C4","v":"Main Offer Only"}]
[]
["5.1.2 CONTRACT PRICE ADJUSTMENT (CPA) FOR INFLATION"]
[]
["No.","Formula Code","Summary of the description of the Tenderer's Formulae"]
[1,"Fixed","Firm and Fixed ",null,null,"Prices are 100 % fixed and firm. CPA is not applicable. "]
[2,"A",{"$f":"B41","v":"Tenderer's description of Formula A"},null,null,"Type in the description of each formula in the tables below"]
[3,"B",{"$f":"B52","v":"Tenderer's description of Formula B"}]
[4,"C",{"$f":"B63","v":"Tenderer's description of Formula C"}]
[5,"D",{"$f":"B74","v":"Tenderer's description of Formula D"}]
[6,"E",{"$f":"B85","v":"Tenderer's description of Formula E"}]
[7,"F",{"$f":"B96","v":"Tenderer's description of Formula F"}]
[8,"G",{"$f":"B107","v":"Tenderer's description of Formula G"}]
[9,"H",{"$f":"B118","v":"Tenderer's description of Formula H"}]
[10,"I",{"$f":"B129","v":"Tenderer's description of Formula I"}]
[11,"J",{"$f":"B140","v":"Tenderer's description of Formula J"}]
[]
["SPECIFIC REQUIREMENTS"]
[{"v":1,"d":"1."},"Only Main Offer is to be submitted. Main offer tenderers are to fully comply with the requirements in the General Notes and CPA Formulae Notes below."]
[{"v":2,"d":"2."},"No ALTERNATIVE offers are accepted."]
[]
["GENERAL NOTES :"]
[1,"References to \"indices\" below mean \"cost indices or reference prices\"."]
[2,"Where 5 year historical information must be provided as instructed below, internet address references which are accessible to the general public may be submitted by the Tenderer instead, with the specific electronic route and web page reflecting the applicable data."]
[3,"The worksheet  CPA Formula in 5.1.2. has to be populated by the tenderer (columns B - J), unless the tenderer’s prices are fixed and firm for the duration of the contract. Each CPA formula must add up to a total of 100%.  All columns are to be populated. No inhouse CPA indices may be used. Tenderers are to provide all requested information.CPA Formulae should represent cost breakdown of the goods/commodities/components/items being sourced.\n"]
[4,"CPA Formulae Codes Column N 5.1.1 Pricing is to be populated by the tenderer by selecting the respective drop down codes CPA formula as  developed by Tenderer in 5.1.2 CPA formulae worksheet   (e.g. Formula A-J ) then  the tenderer must populate their respective CPA formula in  5.1.2 CPA Formulae Worksheet. Codes and descriptions must be selected by the tenderer and inserted into each row of activity. "]
[5,"Prices will be fixed for the first twelve (12) months after contract signing date and escalated on an annual basis based on the CPA formula agreed on with tenderer."]
{"$rows_left_out":119}
{"sheet":"5.1.4 PS5","index":5,"n_rows":83,"n_cols":19,"rows_kept":83,"hidden":true,"merged":[[8,1,8,7],[11,1,11,7],[12,1,12,7],[54,1,54,7]]}
["Enquiry No.",null,{"$f":"'Tender Cover Sheet'!C12","v":0}]
["Package Name:",null,{"$f":"'Tender Cover Sheet'!C14","v":"Facilities Maintenance and Repairs on Eskom Telecommunications Radio Site in Western Region on an as and when required basis for a period of 36 months"}]
["Tenderer's Name:",null,{"$f":"'Tender Cover Sheet'!C16","v":0}]
["Category of Offer:",null,{"$f":"'Tender Cover Sheet'!C18","v":"Main Offer Only"}]
[]
["5.1.4. PS 5 "]
[]
["NOTES:"]
[1,"The exchange rates inputted below must be the same as per Worksheet 5.1.6   Exchange Rates."]
[]
[{"$nulls":10},1,2,3,4,5,6,7,8]
["No.","Description",{"$nulls":6}," ",null,{"$f":"#REF!","v":{"$error":"#REF!"}},{"$f":"#REF!","v":{"$error":"#REF!"}},{"$f":"#REF!","v":{"$error":"#REF!"}},{"$f":"#REF!","v":{"$error":"#REF!"}},{"$f":"#REF!","v":{"$error":"#REF!"}},{"$f":"#REF!","v":{"$error":"#REF!"}},{"$f":"#REF!","v":{"$error":"#REF!"}},{"$f":"#REF!","v":{"$error":"#REF!"}}]
[null," *Eskom may effect this insurance which includes war",{"$nulls":6}," "]
[null,"   risk insurance"]
[null,"**Please specify"]
[null,"SUPPLIED FROM OUTSIDE R.S.A.:",{"$nulls":7},"(In ZAR)"]
[1,"1: F.O.B. PRICE",{"$nulls":7},"(In ZAR)",{"v":1000,"d":"1,000.00"}]
[2,"2: COST OF SEA  FREIGHT",{"$nulls":7},"(In ZAR)"]
[3,"3: COST OF AIR  FREIGHT",{"$nulls":7},"(In ZAR)"]
[4,"4: COST OF MARINE INSURANCES *",{"$nulls":7},"(In ZAR)"]
[5,"5: TOTAL PRICE DELIVERED PORT R.S.A. ...",{"$nulls":5},"(1+2+3+4)",null,"(In ZAR)",{"$f":"SUM(K17:K20)","v":{"v":1000,"d":"1,000.00"}},{"$f":"SUM(L17:L20)","v":0},0,0,0,0,0,0]
[6,"6: WHARFAGE",{"$nulls":7},"(In ZAR)"]
[7,"7: LANDING CHARGES",{"$nulls":7},"(In ZAR)"]
[8,"8: CUSTOMS DUTIES",{"$nulls":7},"(In ZAR)"]
[9,"9: IMPORT SURCHARGE",{"$nulls":7},"(In ZAR)"]
[10,"10: OTHER**",{"$nulls":7},"(In ZAR)"]
[11,"11: COST OF IMPORTATION ...",{"$nulls":5},"(6+7+8+9+10)",null,"(In ZAR)",{"$f":"SUM(K22:K26)","v":0},0,0,0,0,0,0,0]
[12,"12: COST OF RAIL TRANSPORT IN R.S.A.",{"$nulls":7},"(In ZAR)"]
[13,"13: COST OF ROAD TRANSPORT IN R.S.A.",{"$nulls":7},"(In ZAR)"]
[14,"14: TOTAL COST OF TRANSPORT S.A. PORT TO WORK/SITE ...",{"$nulls":5},"(12+13)",null,"(In ZAR)",{"$f":"SUM(K28:K29)","v":0},0,0,0,0,0,{"$f":"SUM(Q28:Q29)","v":0},{"$f":"SUM(R28:R29)","v":0}]
{"$rows_left_out":54}
{"sheet":"5.1.4 Exchange Rates","index":6,"n_rows":37,"n_cols":8,"rows_kept":37,"merged":[[0,0,0,1],[0,2,0,4],[1,0,1,1],[1,2,1,4],[2,0,2,1],[2,2,2,4],[3,0,3,1],[3,2,3,4],[8,1,8,6],[9,0,11,0],[9,1,9,6],[9,14,9,19],[10,1,10,6],[11,1,11,6],[12,1,12,6],[13,1,13,6],[14,0,16,0],[14,1,14,6],[15,1,15,6],[16,1,16,6],[21,7,21,12]]}
["Enquiry No.",null,{"$f":"'Tender Cover Sheet'!C12","v":0}]
["Package Name:",null,{"$f":"'Tender Cover Sheet'!C14","v":"Facilities Maintenance and Repairs on Eskom Telecommunications Radio Site in Western Region on an as and when required basis for a period of 36 months"}]
["Tenderer's Name:",null,{"$f":"'Tender Cover Sheet'!C16","v":0}]
["Category of Offer:",null,{"$f":"'Read Me'!C4","v":"Main Offer Only"}]
[]
["5.1.4 EXCHANGE RATES FOR MULTIPLE CURRENCIES"]
[]
["NOTES:"]
[1,"The table below needs to be completed if the Employer will be exposed to any currency fluctuation as stipulated in Secondary Clause X3.  For conversion of the foreign portions to Rand, please use the South African Reserve Bank's (SARB) exchange rate at 12:00 on the day of advertisement of the bid.  This is in terms of the Preferential Procurement Policy Framework Act (PPPFA) with which the Employer has to comply.\nNB: Tenderers must submit proof of the SARB rate(s) of exchange used  "]
[2,"The following URL (electronic route) is to be followed to access the relevant SARB rates on their web pages:\n"]
[null,"www.resbank.co.za"]
[null,"-  Select Research\n-  Then select Rates\n-  Click on \"Select historical exchange rates and other interest rates\"\n-  Clicking on the exchange rate in the following page opens the daily rates per currency and SA Rand"]
[3,"The Employer deals only in the currencies listed below unless other currencies are specifically approved for this tender.  Kindly notify the Employer of any currency that the tenderer intends to use, but is not stipulated in the table, to consider sanctioning such currency.  Sufficient time must be allowed for the assessment and to respond to such request.  The onus is on the tenderer to submit a bid with approved currencies"]
[4,"The format in which the exchange rate must be inserted in the table is:  1 (One) Foreign Currency = R Amount  (i.e. the Rand amount for one of each foreign currency applicable).  Exchange rates must be rounded to 4 decimals\n\nNB :  Only the USD/ZAR, GBP/ZAR and EUR/ZAR are published in this way on the SARB web pages above.  The Rand rate with the other currencies must be inverted (1/Foreign Currency Rate) in order to list it in the required format in the table below\n"]
[5,"All information in the table below must conform with all other equivalent information in the offer. "]
[null,"Payment in terms of Payment Method 2  is considered as a \"foreign payment\" although it will be effected in South African Rand. However, amounts for  \"F.O.R. Price-Goods supplied from Imported Items\", are NOT considered as \"foreign payments\""]
[null,"If more than one payment method apply for a currency, the Tenderer must request an additional row be inserted in the table in order to split the values and identify the relevant method.   "]
[" "]
[" "]
["EXCHANGE RATES PUBLISHED BY SARB"]
["NB: Tenderers must submit proof of the SARB rate (s) of exchange used."]
[{"$nulls":4},"Date for which the rates are published :",null,null,"Date to be inserted in the following format: Day, Month and Year.\n\nMust be the SARB rate at 12:00 on day of advertisement of bid"]
["No","Currency Description","Code","Exchange Rate\nCurrency 1,00 = R Amount","Payment Method 1a, 1b or 2","Source"]
[1,"South African Rand","ZAR",{"v":1,"d":"R 1.00"}]
[2,"Australian Dollar","AUD",{"v":0,"d":"R 0.00"}]
[3,"Canadian Dollar","CAN",{"v":0,"d":"R 0.00"}]
[4,"Swiss Franc","CHF",{"v":0,"d":"R 0.00"}]
[5,"Danish Krone","DKK",{"v":0,"d":"R 0.00"}]
[6,"European Currency","EUR",{"v":0,"d":"R 0.00"}]
[7,"British Pound","GBP",{"v":0,"d":"R 0.00"}]
{"$rows_left_out":7}