{"text_format":"1","workbook":"xlsx","n_sheets":18,"sheets":["Man Hours","Summary","Employee Register","Settings","Manpower Hours BU","Manpower Hours","Incidents BU","Incidents","Closeouts BU","Closeouts","ReportID BU","ReportID","Permanent Employees","Permanent Employees BU","Temporary Employees","Temporary Employees BU","EPWP Employees","EPWP Employees BU"],"not_rendered":{"charts":0,"images":1,"macros":1,"external_links":1,"defined_names":46,"comments":0,"pivot_tables":0},"unopened":[],"bounds":{"document_bytes":16777216,"sheet_cells":100000,"rows_first":2000,"rows_last":500,"rows_between":2000,"halvings":0,"cell_chars":16384,"cell_head_chars":4096},"cells_cut":0,"cells_raw":0,"read":"whole","date_system":"1900"}

{"sheet":"Man Hours","index":0,"n_rows":62,"n_cols":21,"rows_kept":62,"cut":false,"hidden":false,"merged":[[5,0,5,8],[5,10,5,20],[11,0,11,20],[14,13,14,19],[7,0,7,8],[12,7,12,9],[8,0,8,8],[9,14,9,17],[9,0,9,8],[7,14,7,17],[7,9,7,13],[8,9,8,13],[9,9,9,13],[8,18,8,20],[7,18,7,20],[9,18,9,20],[57,11,61,20],[61,4,61,9],[50,0,50,3],[58,0,58,3],[61,0,61,3],[60,0,60,3],[51,16,51,17],[3,18,3,20],[0,14,0,17],[1,14,1,17],[2,14,2,17],[3,14,3,17],[0,5,3,13],[0,0,3,4],[60,4,60,9],[52,12,55,20],[8,14,8,17],[17,16,17,20],[54,0,55,8],[57,4,57,9],[59,0,59,3],[59,4,59,9],[17,10,17,14],[17,4,17,8],[58,4,58,9],[0,18,0,20],[1,18,1,20],[2,18,2,20]]}
[null,null,null,null,null,"Contractor Manpower and OHS Stats Reporting Form",null,null,null,null,null,null,null,null,"Document Identifier",null,null,null,"240-140441286"]
[null,null,null,null,null,null,null,null,null,null,null,null,null,null,"Document Revision",null,null,null,3]
[null,null,null,null,null,null,null,null,null,null,null,null,null,null,"Effective Date",null,null,null,"2021-10-25"]
[null,null,null,null,null,null,null,null,null,null,null,null,null,null,"Review Date",null,null,null,{"$f":"S3+365*3","v":"2024-10-24"}]
[]
["Click here to download the latest copy of this Form",null,null,null,null,null,null,null,null,null,"Click here to send feedback on the form"]
{"$rows_left_out":57}
{"sheet":"Summary","index":1,"n_rows":30,"n_cols":3,"rows_kept":30,"cut":false,"hidden":false,"merged":[[0,0,0,1],[16,0,16,1],[19,0,19,1],[22,0,22,1],[26,0,26,1],[8,0,8,1]]}
["Report Summary",null,"Checks"]
["Contractor Name:",{"$f":"contractorName","v":0},{"$f":"IF(OR(B2=0, B2=\"\"), \"Type in a Contractor Name\", \"Ready\")","v":"Type in a Contractor Name"}]
["Task Order Number:",{"$f":"TEXT(taskorderNumber, \"0\")","v":"0"},{"$f":"IF(OR(B3=0, B3=\"\", LEFT(B3,2)<>\"45\"), \"Verify that the Taskorder number is entered correctly\", \"Ready\")","v":"Verify that the Taskorder number is entered correctly"}]
["Month Worked:",{"$f":"DATE(reportYear, MONTH(selectedMonth), 1)","v":"1900-01-01"},{"$f":"IF(OR(B4=0,B4=\"\",B4=DATE(1900,1,1), reportYear=\"\"),\"Select a Month and Year\",IF(B4>TODAY(),\"The Month you are reporting on is in the future\",\"Ready\"))","v":"Select a Month and Year"}]
["Vendor Number:",{"$f":"vendorNumber","v":0},{"$f":"IF(OR(B5=0, B5=\"\", LEN(B5)<vendorNumberLength, NOT(ISNUMBER(vendorNumber))), \"Type in a valid Vendor Number\", \"Ready\")","v":"Type in a valid Vendor Number"}]
["Department:",{"$f":"capturersDepartment","v":0},{"$f":"IF(OR(B6=0, B6=\"\"), \"Select your department\", \"Ready\")","v":"Select your department"}]
{"$rows_left_out":25}
{"sheet":"Employee Register","index":2,"n_rows":107,"n_cols":128,"rows_kept":107,"cut":false,"hidden":false,"merged":[[0,3,0,5],[1,3,1,5],[2,3,2,5],[3,29,3,37],[1,30,1,31],[1,33,1,34],[1,36,1,37],[3,19,3,23],[3,24,3,27],[0,11,0,13],[1,11,1,13],[0,29,0,46],[1,40,1,41],[1,43,1,44],[3,39,3,45],[5,125,6,125],[0,6,0,9],[1,6,1,9],[2,6,2,9],[0,19,0,23],[1,19,1,23],[0,14,0,17],[1,14,1,17],[0,24,0,27],[1,24,1,27],[2,19,2,23],[2,24,2,27],[5,73,6,73],[5,77,6,77],[5,81,6,81],[5,85,6,85],[5,89,6,89],[5,33,6,33],[5,37,6,37],[5,41,6,41],[5,45,6,45],[5,49,6,49],[5,76,6,76],[5,80,6,80],[5,84,6,84],[5,88,6,88],[5,36,6,36],[5,60,6,60],[5,64,6,64],[5,68,6,68],[5,1,6,1],[5,5,6,5],[5,9,6,9],[5,13,6,13],[5,17,6,17],[5,16,6,16],[5,120,6,120],[5,124,6,124],[5,100,6,100],[5,104,6,104],[5,108,6,108],[5,112,6,112],[5,116,6,116],[5,105,6,105],[5,109,6,109],[5,113,6,113],[5,117,6,117],[5,121,6,121],[5,92,6,92],[5,96,6,96],[5,93,6,93],[5,97,6,97],[5,101,6,101],[5,29,6,29],[5,72,6,72],[5,53,6,53],[5,57,6,57],[5,61,6,61],[5,65,6,65],[5,69,6,69],[5,0,6,0],[5,127,6,127],[5,40,6,40],[5,44,6,44],[5,48,6,48],[5,52,6,52],[5,56,6,56],[5,4,6,4],[5,8,6,8],[5,12,6,12],[5,20,6,20],[5,24,6,24],[5,28,6,28],[5,32,6,32],[5,21,6,21],[5,25,6,25]]}
["Contractor Name:",null,null,"Service Type:",null,null,null,null,null,null,null,"Name of CEO",null,null,null,null,null,null,null,"Name of Site Supervisor",null,null,null,null,null,null,null,null,null,"AUDITS, FINDINGS & INCIDENTS FOR MONTH"]
["Month:",null,null,"Year:",null,null,null,null,null,null,null,"Contact Details of CEO",null,null,null,null,null,null,null,"Contact Details of Site Supervisor",null,null,null,null,null,null,null,null,null,null,"Fatalities   ",null,0,"Lost Time   ",null,0,"Medicals   ",null,0,null,"First Aid   ",null,0,"Near Misses",null,0]
["Task Order Number:",null,null,"Vendor Number:",null,null,null,null,null,null,null,null,null,null,null,null,null,null,null,"Name of Health & Safety Practitioner"]
["Site Name:",null,null,null,null,null,null,null,null,null,null,null,null,null,null,null,null,null,null,"Contact Details of H&S Practitioner",null,null,null,null,null,null,null,null,null,"Status of incidents investigated and recommendations closed out?   ",null,null,null,null,null,null,null,null,"N/A","Status of audits conducted and findings closed out?",null,null,null,null,null,null,"N/A"]
[]
["Employee","ID / Employee Number","Day & Date",{"$f":"TEXT(DATE($G$2,MONTH($B$2),G6),\"DDD\")","v":"Sun"},"Hrs Worked","Temp. Scan",1,{"$f":"TEXT(DATE($G$2,MONTH($B$2),K6),\"DDD\")","v":"Mon"},"Hrs Worked","Temp. Scan",2,{"$f":"TEXT(DATE($G$2,MONTH($B$2),O6),\"DDD\")","v":"Tue"},"Hrs Worked","Temp. Scan",3,{"$f":"TEXT(DATE($G$2,MONTH($B$2),S6),\"DDD\")","v":"Wed"},"Hrs Worked","Temp. Scan",4,{"$f":"TEXT(DATE($G$2,MONTH($B$2),W6),\"DDD\")","v":"Thu"},"Hrs Worked","Temp. Scan",5,{"$f":"TEXT(DATE($G$2,MONTH($B$2),AA6),\"DDD\")","v":"Fri"},"Hrs Worked","Temp. Scan",6,{"$f":"TEXT(DATE($G$2,MONTH($B$2),AE6),\"DDD\")","v":"Sat"},"Hrs Worked","Temp. Scan",7,{"$f":"TEXT(DATE($G$2,MONTH($B$2),AI6),\"DDD\")","v":"Sun"},"Hrs Worked","Temp. Scan",8,{"$f":"TEXT(DATE($G$2,MONTH($B$2),AM6),\"DDD\")","v":"Mon"},"Hrs Worked","Temp. Scan",9,{"$f":"TEXT(DATE($G$2,MONTH($B$2),AQ6),\"DDD\")","v":"Tue"},"Hrs Worked","Temp. Scan",10,{"$f":"TEXT(DATE($G$2,MONTH($B$2),AU6),\"DDD\")","v":"Wed"},"Hrs Worked","Temp. Scan",11,{"$f":"TEXT(DATE($G$2,MONTH($B$2),AY6),\"DDD\")","v":"Thu"},"Hrs Worked","Temp. Scan",12,{"$f":"TEXT(DATE($G$2,MONTH($B$2),BC6),\"DDD\")","v":"Fri"},"Hrs Worked","Temp. Scan",13,{"$f":"TEXT(DATE($G$2,MONTH($B$2),BG6),\"DDD\")","v":"Sat"},"Hrs Worked","Temp. Scan",14,{"$f":"TEXT(DATE($G$2,MONTH($B$2),BK6),\"DDD\")","v":"Sun"},"Hrs Worked","Temp. Scan",15,{"$f":"TEXT(DATE($G$2,MONTH($B$2),BO6),\"DDD\")","v":"Mon"},"Hrs Worked","Temp. Scan",16,{"$f":"TEXT(DATE($G$2,MONTH($B$2),BS6),\"DDD\")","v":"Tue"},"Hrs Worked","Temp. Scan",17,{"$f":"TEXT(DATE($G$2,MONTH($B$2),BW6),\"DDD\")","v":"Wed"},"Hrs Worked","Temp. Scan",18,{"$f":"TEXT(DATE($G$2,MONTH($B$2),CA6),\"DDD\")","v":"Thu"},"Hrs Worked","Temp. Scan",19,{"$f":"TEXT(DATE($G$2,MONTH($B$2),CE6),\"DDD\")","v":"Fri"},"Hrs Worked","Temp. Scan",20,{"$f":"TEXT(DATE($G$2,MONTH($B$2),CI6),\"DDD\")","v":"Sat"},"Hrs Worked","Temp. Scan",21,{"$f":"TEXT(DATE($G$2,MONTH($B$2),CM6),\"DDD\")","v":"Sun"},"Hrs Worked","Temp. Scan",22,{"$f":"TEXT(DATE($G$2,MONTH($B$2),CQ6),\"DDD\")","v":"Mon"},"Hrs Worked","Temp. Scan",23,{"$f":"TEXT(DATE($G$2,MONTH($B$2),CU6),\"DDD\")","v":"Tue"},"Hrs Worked","Temp. Scan",24,{"$f":"TEXT(DATE($G$2,MONTH($B$2),CY6),\"DDD\")","v":"Wed"},"Hrs Worked","Temp. Scan",25,{"$f":"TEXT(DATE($G$2,MONTH($B$2),DC6),\"DDD\")","v":"Thu"},"Hrs Worked","Temp. Scan",26,{"$f":"TEXT(DATE($G$2,MONTH($B$2),DG6),\"DDD\")","v":"Fri"},"Hrs Worked","Temp. Scan",27,{"$f":"TEXT(DATE($G$2,MONTH($B$2),DK6),\"DDD\")","v":"Sat"},"Hrs Worked","Temp. Scan",28,{"$f":"IF(AND(MOD($G$2,4)=0,MONTH($B$2)=2),TEXT(DATE($G$2,MONTH($B$2),DO6),\"DDD\"),IF(MONTH($B$2)<>2,TEXT(DATE($G$2,MONTH($B$2),DO6),\"DDD\"),\" - \"))","v":"Sun"},"Hrs Worked","Temp. Scan",29,{"$f":"IF(MONTH($B$2)<>2,TEXT(DATE($G$2,MONTH($B$2),DS6),\"DDD\"),\" - \")","v":"Mon"},"Hrs Worked","Temp. Scan",30,{"$f":"IF(AND(MONTH($B$2)<>2,MONTH($B$2)<>4,MONTH($B$2)<>6,MONTH($B$2)<>9,MONTH($B$2)<>11),TEXT(DATE($G$2,MONTH($B$2),DW6),\"DDD\"),\" - \")","v":"Tue"},"Hrs Worked","Temp. Scan",31,"∑ Hours Worked"]
{"$rows_left_out":102}
{"sheet":"Settings","index":3,"n_rows":32,"n_cols":80,"rows_kept":32,"cut":false,"hidden":true,"merged":[]}
["Month",null,"Years",null,"Selected Month",null,"Day",null,"Weekday Constants",null,"LastRecordID",null,"Storage Sheets",null,"BU Sheets",null,"Data Tables",null,"ListName","GUID",null,"ID","Item Type","Path","File Type","Workflow Instance ID","URL Path","Encoded Absolute URL",null,null,"Employee Type","Item Type","Path","ID",null,"Site URL",null,"Department","Item Type","Path","ID",null,"Operating Unit","Item Type","Path","ID",null,"Service Type","Item Type","Path","ID",null,null,"Vendor Number Length",null,"Taskorder Length",null,"Ready for upload",null,"Options",null,"Closeout","Item Type","Path","ID",null,"Incident Type","Item Type","Path","ID",null,"Template URL",null,"ID","Item Type","Path","File Type","Workflow Instance ID","URL Path","Encoded Absolute URL"]
[{"$f":"DATE(reportYear,1,1)","v":"1900-01-01"},null,2015,null,{"$f":"IF(selectedMonth=\"\", DATE(reportYear,1,1), selectedMonth)","v":"00:00:00"},null,{"$f":"IF(selectedMonth=\"\", DATE(2018,1,1), dateValue)","v":"1900-01-01"},null,0,null,{"$f":"MAX(BV:BV)+1","v":3794},null,"Manpower Hours",null,{"$f":"M2&\" BU\"","v":"Manpower Hours BU"},null,"tblReportID",null,"ReportId","{56F548F8-27B3-445A-8D42-9ECC2337C90F}",null,7,"Item","sites/dxloucpr/Lists/ReportId",null,null,"sites/dxloucpr/Lists/ReportId/7_.000",null,null,null,"Permanent","Item","sites/dxloucpr/Lists/Employee Type",1,null,"https://portal.eskom.co.za/sites/dxloucpr/",null,"Asset Creation","Item","sites/dxloucpr/Lists/Department",1,null,"Eastern Cape OU","Item","sites/dxloucpr/Lists/Operating Unit",1,null,"Connection - Schools & Clinics","Item","sites/dxloucpr/Lists/Service Type",1,null,null,8,null,8,null,{"$f":"IF(AND(COUNTIF(Summary!C2:C8, \"Ready\")>6, COUNTIF(Summary!C18:C25, \"Ready\")>=2), \"Ready\", \"Not Ready\")","v":"Not Ready"},null,"Yes",null,"Incidents","Item","sites/dxloucpr/Lists/Closeouts",1,null,"Fatalities","Item","sites/dxloucpr/Lists/IncidentType",1,null,"../_layouts/15/download.aspx?SourceUrl=https://portal.eskom.co.za/sites/dxloucpr/Shared%20Documents/20180814_Contractor%20Reporting_Contractor%20Capture%20Form.xlsm",null,3793,"Item","sites/dxloucpr/Lists/ReportId",null,null,"sites/dxloucpr/Lists/ReportId/3793_.000"]
[{"$f":"DATE(reportYear,2,1)","v":"1900-02-01"},null,2016,null,null,null,{"$f":"IF(MONTH($E$2)<>IFERROR(MONTH($G$2+I3),\"\"),\"\",$G$2+I3)","v":"1900-01-02"},null,1,null,null,null,"Incidents",null,"Incidents BU",null,"tblIncidents",null,"Incidents","{B214E8A4-A39F-4CA6-8C1B-3E5D2138F5CE}",null,null,null,null,null,null,null,null,null,null,"Temporary","Item","sites/dxloucpr/Lists/Employee Type",2,null,null,null,"BIPM","Item","sites/dxloucpr/Lists/Department",2,null,"Free State OU","Item","sites/dxloucpr/Lists/Operating Unit",2,null,"Cow Services","Item","sites/dxloucpr/Lists/Service Type",2,null,null,null,null,null,null,{"$f":"MIN(1,AVERAGE(COUNTIF(Summary!C2:C8,\"Ready\")/7,COUNTIF(Summary!C18:C25,\"Ready\")/2))","v":0},null,"No",null,"Findings","Item","sites/dxloucpr/Lists/Closeouts",2,null,"Lost Time","Item","sites/dxloucpr/Lists/IncidentType",2]
[{"$f":"DATE(reportYear,3,1)","v":"1900-03-01"},null,2017,null,null,null,"1900-01-03",null,2,null,null,null,"Closeouts",null,"Closeouts BU",null,"tblCloseouts",null,"Closeouts1","{16B025E0-0D8D-4CA4-B3F6-013BFF9CF553}",null,null,null,null,null,null,null,null,null,null,"Temporary (EPWP)","Item","sites/dxloucpr/Lists/Employee Type",3,null,null,null,"Customer Services","Item","sites/dxloucpr/Lists/Department",3,null,"Gauteng OU","Item","sites/dxloucpr/Lists/Operating Unit",3,null,"Electrification","Item","sites/dxloucpr/Lists/Service Type",3,null,null,null,null,null,null,null,null,"N/A",null,null,null,null,null,null,"Medicals","Item","sites/dxloucpr/Lists/IncidentType",3]
[{"$f":"DATE(reportYear,4,1)","v":"1900-04-01"},null,2018,null,"DateValue",null,"1900-01-04",null,3,null,null,null,"ReportID",null,"ReportID BU",null,"tblManpowerHours",null,"Manpower Hours","{BCB31E87-7565-49DA-B85F-77A2F3BD0A86}",null,null,null,null,null,null,null,null,null,null,null,null,null,null,null,null,null,"M&O","Item","sites/dxloucpr/Lists/Department",4,null,"KZN OU","Item","sites/dxloucpr/Lists/Operating Unit",4,null,"Electrification Design","Item","sites/dxloucpr/Lists/Service Type",22,null,null,null,null,null,null,null,null,null,null,null,null,null,null,null,"First Aid","Item","sites/dxloucpr/Lists/IncidentType",4]
[{"$f":"DATE(reportYear,5,1)","v":"1900-05-01"},null,2019,null,{"$f":"IF(OR(reportYear=\"\", selectedMonth=\"\"), DATE(1986, 9, 24), DATE(reportYear, MONTH(selectedMonth), 1))","v":"1900-01-01"},null,"1900-01-05",null,4,null,null,null,"Permanent Employees",null,"Permanent Employees BU",null,"tblPermanentEmployees",null,"PermanentEmployees","{0DB5E644-D306-4962-9B5C-59D02A6B092C}",null,null,null,null,null,null,null,null,null,null,null,null,null,null,null,null,null,"SHEQS","Item","sites/dxloucpr/Lists/Department",5,null,"Limpopo OU","Item","sites/dxloucpr/Lists/Operating Unit",5,null,"Engineering Survey","Item","sites/dxloucpr/Lists/Service Type",23,null,null,null,null,null,null,null,null,null,null,null,null,null,null,null,"Near Misses","Item","sites/dxloucpr/Lists/IncidentType",5]
{"$rows_left_out":27}
{"sheet":"Manpower Hours BU","index":4,"n_rows":4,"n_cols":4,"rows_kept":4,"cut":false,"hidden":true,"merged":[]}
["ReportID","Employee Type","Number of Employees","Hours Worked"]
[{"$f":"Settings!$K$2","v":3794},{"$f":"INDEX(tblEmployeeType[#All], MATCH(Settings!AE2, tblEmployeeType[[#All],[Employee Type]], 0), 4)","v":1},{"$f":"IF(OR(Summary!B18=0, Summary!B18=\"\"), 0, Summary!B18)","v":0},{"$f":"Summary!B19","v":0}]
[{"$f":"Settings!$K$2","v":3794},{"$f":"INDEX(tblEmployeeType[#All], MATCH(Settings!AE3, tblEmployeeType[[#All],[Employee Type]], 0), 4)","v":2},{"$f":"IF(OR(Summary!B21=0, Summary!B21=\"\"), 0, Summary!B21)","v":0},{"$f":"Summary!B22","v":0}]
[{"$f":"Settings!$K$2","v":3794},{"$f":"INDEX(tblEmployeeType[#All], MATCH(Settings!AE4, tblEmployeeType[[#All],[Employee Type]], 0), 4)","v":3},{"$f":"IF(OR(Summary!B24=0, Summary!B24=\"\"), 0, Summary!B24)","v":0},{"$f":"Summary!B25","v":0}]

{"sheet":"Manpower Hours","index":5,"n_rows":2,"n_cols":4,"rows_kept":2,"cut":false,"hidden":true,"merged":[]}
["ReportID","Employee Type","Number of Employees","Hours Worked"]
[3794,1,4,8]

{"sheet":"Incidents BU","index":6,"n_rows":6,"n_cols":7,"rows_kept":6,"cut":false,"hidden":true,"merged":[]}
["ReportID","Incident Type","Number of Incidents'"]
[{"$f":"Settings!$K$2","v":3794},{"$f":"INDEX(tblIncidentTypes[#All], MATCH(Settings!BO2, tblIncidentTypes[[#All],[Incident Type]], 0), 4)","v":1},{"$f":"IF(OR(fatalities=0, fatalities=\"\"), 0, fatalities)","v":0}]
[{"$f":"Settings!$K$2","v":3794},{"$f":"INDEX(tblIncidentTypes[#All], MATCH(Settings!BO3, tblIncidentTypes[[#All],[Incident Type]], 0), 4)","v":2},{"$f":"IF(OR(firstAid=0, firstAid=\"\"), 0, firstAid)","v":0}]
[{"$f":"Settings!$K$2","v":3794},{"$f":"INDEX(tblIncidentTypes[#All], MATCH(Settings!BO4, tblIncidentTypes[[#All],[Incident Type]], 0), 4)","v":3},{"$f":"IF(OR(ltis=0, ltis=\"\"), 0, ltis)","v":0},null,null,null,"IF(OR(ltis=0, ltis=\"\"), 0, ltis)"]
[{"$f":"Settings!$K$2","v":3794},{"$f":"INDEX(tblIncidentTypes[#All], MATCH(Settings!BO5, tblIncidentTypes[[#All],[Incident Type]], 0), 4)","v":4},{"$f":"IF(OR(medicals=0, medicals=\"\"), 0, medicals)","v":0}]
[{"$f":"Settings!$K$2","v":3794},{"$f":"INDEX(tblIncidentTypes[#All], MATCH(Settings!BO6, tblIncidentTypes[[#All],[Incident Type]], 0), 4)","v":5},{"$f":"IF(OR(nearMisses=0, nearMisses=\"\"), 0, nearMisses)","v":0}]
{"$rows_left_out":1}
{"sheet":"Incidents","index":7,"n_rows":1,"n_cols":3,"rows_kept":1,"cut":false,"hidden":true,"merged":[]}
["ReportID","Incident Type","Number of Incidents"]

{"sheet":"Closeouts BU","index":8,"n_rows":3,"n_cols":3,"rows_kept":3,"cut":false,"hidden":true,"merged":[]}
["ReportID","Closeout Type","Results"]
[{"$f":"Settings!K2","v":3794},{"$f":"INDEX(Table_ExternalData_1[#All], MATCH(Settings!$BJ2,Table_ExternalData_1[[#All],[Closeout]], 0), 4)","v":1},{"$f":"IF(incidentCloseOut=\"N/A\", 0, incidentCloseOut)","v":0}]
[{"$f":"Settings!K2","v":3794},{"$f":"INDEX(Table_ExternalData_1[#All], MATCH(Settings!$BJ3,Table_ExternalData_1[[#All],[Closeout]], 0), 4)","v":2},{"$f":"IF(findingsCloseout=\"N/A\", 0, findingsCloseout)","v":0}]

{"sheet":"Closeouts","index":9,"n_rows":1,"n_cols":3,"rows_kept":1,"cut":false,"hidden":true,"merged":[]}
["ReportID","Closeout Type","Results"]

{"sheet":"ReportID BU","index":10,"n_rows":2,"n_cols":8,"rows_kept":2,"cut":false,"hidden":true,"merged":[]}
["Operating Unit","Department","Vendor Number","Contractor Name","Service Type","Taskorder Number","Month Worked","MyVersion"]
[{"$f":"INDEX(tblOperatingUnit[#All], MATCH(Summary!B7, tblOperatingUnit[[#All],[Operating Unit]], 0), 4)","v":{"$error":"#N/A"}},{"$f":"INDEX(tblDepartment[#All], MATCH(Summary!B6, tblDepartment[[#All],[Department]], 0), 4)","v":{"$error":"#N/A"}},{"$f":"IF(OR(Summary!B5 = 0, Summary!B5=\"\"), 0, Summary!B5)","v":0},{"$f":"Summary!B2","v":0},{"$f":"INDEX(tblServiceType[#All], MATCH(Summary!B8, tblServiceType[[#All],[Service Type]], 0), 4)","v":{"$error":"#N/A"}},{"$f":"Summary!B3","v":"0"},{"$f":"Summary!B4","v":"1900-01-01"},2]

{"sheet":"ReportID","index":11,"n_rows":2,"n_cols":8,"rows_kept":2,"cut":false,"hidden":true,"merged":[]}
["Operating Unit","Department","Vendor Number","Contractor Name","Service Type","Taskorder Number","Month Worked","MyVersion"]
[5,2,11083820,"o0000000000000000",5,"4502875201","2019-08-01",2]

{"sheet":"Permanent Employees","index":12,"n_rows":2,"n_cols":6,"rows_kept":2,"cut":false,"hidden":true,"merged":[]}
["ReportID","Employee_Type","Employees","Start","End","Date"]
[3794,1,4,"08:00:00","16:00:00","2019-08-05"]

{"sheet":"Permanent Employees BU","index":13,"n_rows":32,"n_cols":6,"rows_kept":32,"cut":false,"hidden":true,"merged":[]}
["ReportID","Employee_Type","Employees","Start","End","Date"]
[{"$f":"Settings!$K$2","v":3794},1,{"$f":"'Man Hours'!E20","v":0},{"$f":"'Man Hours'!F20","v":"00:00:00"},{"$f":"'Man Hours'!G20","v":{"$error":"#DIV/0!"}},{"$f":"Settings!G2","v":"1900-01-01"}]
[{"$f":"Settings!$K$2","v":3794},1,{"$f":"'Man Hours'!E21","v":0},{"$f":"'Man Hours'!F21","v":"00:00:00"},{"$f":"'Man Hours'!G21","v":{"$error":"#DIV/0!"}},{"$f":"Settings!G3","v":"1900-01-02"}]
[{"$f":"Settings!$K$2","v":3794},1,{"$f":"'Man Hours'!E22","v":0},{"$f":"'Man Hours'!F22","v":"00:00:00"},{"$f":"'Man Hours'!G22","v":{"$error":"#DIV/0!"}},{"$f":"Settings!G4","v":"1900-01-03"}]
[{"$f":"Settings!$K$2","v":3794},1,{"$f":"'Man Hours'!E23","v":0},{"$f":"'Man Hours'!F23","v":"00:00:00"},{"$f":"'Man Hours'!G23","v":{"$error":"#DIV/0!"}},{"$f":"Settings!G5","v":"1900-01-04"}]
[{"$f":"Settings!$K$2","v":3794},1,{"$f":"'Man Hours'!E24","v":0},{"$f":"'Man Hours'!F24","v":"00:00:00"},{"$f":"'Man Hours'!G24","v":{"$error":"#DIV/0!"}},{"$f":"Settings!G6","v":"1900-01-05"}]
{"$rows_left_out":27}
{"sheet":"Temporary Employees","index":14,"n_rows":1,"n_cols":6,"rows_kept":1,"cut":false,"hidden":true,"merged":[]}
["ReportID","Employee_Type","Employees","Start","End","Date"]

{"sheet":"Temporary Employees BU","index":15,"n_rows":32,"n_cols":6,"rows_kept":32,"cut":false,"hidden":true,"merged":[]}
["ReportID","Employee_Type","Employees","Start","End","Date"]
[{"$f":"Settings!$K$2","v":3794},2,{"$f":"'Man Hours'!K20","v":0},{"$f":"'Man Hours'!L20","v":"00:00:00"},{"$f":"'Man Hours'!M20","v":{"$error":"#DIV/0!"}},{"$f":"Settings!G2","v":"1900-01-01"}]
[{"$f":"Settings!$K$2","v":3794},2,{"$f":"'Man Hours'!K21","v":0},{"$f":"'Man Hours'!L21","v":"00:00:00"},{"$f":"'Man Hours'!M21","v":{"$error":"#DIV/0!"}},{"$f":"Settings!G3","v":"1900-01-02"}]
[{"$f":"Settings!$K$2","v":3794},2,{"$f":"'Man Hours'!K22","v":0},{"$f":"'Man Hours'!L22","v":"00:00:00"},{"$f":"'Man Hours'!M22","v":{"$error":"#DIV/0!"}},{"$f":"Settings!G4","v":"1900-01-03"}]
[{"$f":"Settings!$K$2","v":3794},2,{"$f":"'Man Hours'!K23","v":0},{"$f":"'Man Hours'!L23","v":"00:00:00"},{"$f":"'Man Hours'!M23","v":{"$error":"#DIV/0!"}},{"$f":"Settings!G5","v":"1900-01-04"}]
[{"$f":"Settings!$K$2","v":3794},2,{"$f":"'Man Hours'!K24","v":0},{"$f":"'Man Hours'!L24","v":"00:00:00"},{"$f":"'Man Hours'!M24","v":{"$error":"#DIV/0!"}},{"$f":"Settings!G6","v":"1900-01-05"}]
{"$rows_left_out":27}
{"sheet":"EPWP Employees","index":16,"n_rows":1,"n_cols":6,"rows_kept":1,"cut":false,"hidden":true,"merged":[]}
["ReportID","Employee_Type","Employees","Start","End","Date"]

{"sheet":"EPWP Employees BU","index":17,"n_rows":32,"n_cols":6,"rows_kept":32,"cut":false,"hidden":true,"merged":[]}
["ReportID","Employee_Type","Employees","Start","End","Date"]
[{"$f":"Settings!$K$2","v":3794},3,{"$f":"'Man Hours'!Q20","v":0},{"$f":"'Man Hours'!R20","v":"00:00:00"},{"$f":"'Man Hours'!S20","v":{"$error":"#DIV/0!"}},{"$f":"Settings!G2","v":"1900-01-01"}]
[{"$f":"Settings!$K$2","v":3794},3,{"$f":"'Man Hours'!Q21","v":0},{"$f":"'Man Hours'!R21","v":"00:00:00"},{"$f":"'Man Hours'!S21","v":{"$error":"#DIV/0!"}},{"$f":"Settings!G3","v":"1900-01-02"}]
[{"$f":"Settings!$K$2","v":3794},3,{"$f":"'Man Hours'!Q22","v":0},{"$f":"'Man Hours'!R22","v":"00:00:00"},{"$f":"'Man Hours'!S22","v":{"$error":"#DIV/0!"}},{"$f":"Settings!G4","v":"1900-01-03"}]
[{"$f":"Settings!$K$2","v":3794},3,{"$f":"'Man Hours'!Q23","v":0},{"$f":"'Man Hours'!R23","v":"00:00:00"},{"$f":"'Man Hours'!S23","v":{"$error":"#DIV/0!"}},{"$f":"Settings!G5","v":"1900-01-04"}]
[{"$f":"Settings!$K$2","v":3794},3,{"$f":"'Man Hours'!Q24","v":0},{"$f":"'Man Hours'!R24","v":"00:00:00"},{"$f":"'Man Hours'!S24","v":{"$error":"#DIV/0!"}},{"$f":"Settings!G6","v":"1900-01-05"}]
{"$rows_left_out":26}