{"text_format":"1","workbook":"xlsx","n_sheets":18,"sheets":["Man Hours","Summary","Employee Register","Settings","Manpower Hours BU","Manpower Hours","Incidents BU","Incidents","Closeouts BU","Closeouts","ReportID BU","ReportID","Permanent Employees","Permanent Employees BU","Temporary Employees","Temporary Employees BU","EPWP Employees","EPWP Employees BU"],"not_rendered":{"charts":0,"images":1,"macros":1,"external_links":1,"defined_names":46,"comments":0,"pivot_tables":0},"unopened":[],"bounds":{"document_bytes":16777216,"sheet_cells":100000,"rows_first":2000,"rows_last":500,"rows_between":2000,"halvings":0,"cell_chars":16384,"cell_head_chars":4096},"cells_cut":0,"cells_raw":0,"read":"whole","date_system":"1900"}

{"sheet":"Man Hours","index":0,"n_rows":62,"n_cols":21,"rows_kept":62,"cut":false,"hidden":false,"merged":[[5,0,5,8],[5,10,5,20],[11,0,11,20],[14,13,14,19],[7,0,7,8],[12,7,12,9],[8,0,8,8],[9,14,9,17],[9,0,9,8],[7,14,7,17],[7,9,7,13],[8,9,8,13],[9,9,9,13],[8,18,8,20],[7,18,7,20],[9,18,9,20],[57,11,61,20],[61,4,61,9],[50,0,50,3],[58,0,58,3],[61,0,61,3],[60,0,60,3],[51,16,51,17],[3,18,3,20],[0,14,0,17],[1,14,1,17],[2,14,2,17],[3,14,3,17],[0,5,3,13],[0,0,3,4],[60,4,60,9],[52,12,55,20],[8,14,8,17],[17,16,17,20],[54,0,55,8],[57,4,57,9],[59,0,59,3],[59,4,59,9],[17,10,17,14],[17,4,17,8],[58,4,58,9],[0,18,0,20],[1,18,1,20],[2,18,2,20]]}
[null,null,null,null,null,"Contractor Manpower and OHS Stats Reporting Form",null,null,null,null,null,null,null,null,"Document Identifier",null,null,null,"240-140441286"]
[null,null,null,null,null,null,null,null,null,null,null,null,null,null,"Document Revision",null,null,null,3]
[null,null,null,null,null,null,null,null,null,null,null,null,null,null,"Effective Date",null,null,null,"2021-10-25"]
[null,null,null,null,null,null,null,null,null,null,null,null,null,null,"Review Date",null,null,null,{"$f":"S3+365*3","v":"2024-10-24"}]
[]
["Click here to download the latest copy of this Form",null,null,null,null,null,null,null,null,null,"Click here to send feedback on the form"]
[]
["Contractor Name:",null,null,null,null,null,null,null,null,{"$f":"'Employee Register'!B1","v":0},null,null,null,null,"Service Type:",null,null,null,{"$f":"'Employee Register'!G1","v":0}]
["Select the Month:",null,null,null,null,null,null,null,null,{"$f":"'Employee Register'!B2","v":"00:00:00"},null,null,null,null,"Select the Year:",null,null,null,{"$f":"'Employee Register'!G2","v":0}]
["Type in the Task Order Number:",null,null,null,null,null,null,null,null,{"$f":"'Employee Register'!B3","v":0},null,null,null,null,"Vendor Number:",null,null,null,{"$f":"'Employee Register'!G3","v":0}]
[]
["AUDITS, FINDINGS & INCIDENTS FOR MONTH"]
[null,null,null,null,null,"Fatalities   ",{"$f":"'Employee Register'!AG2","v":0},"Lost Time   ",null,null,{"$f":"'Employee Register'!AJ2","v":0},null,"Medicals   ",{"$f":"'Employee Register'!AM2","v":0},null,null,"First Aid   ",{"$f":"'Employee Register'!AQ2","v":0},null,"Near Misses   ",{"$f":"'Employee Register'!AT2","v":0}]
[]
[null,null,null,null,null,null,null,null,null,null,"Status of incidents investigated and recommendations closed out?   ",{"$f":"'Employee Register'!AM4","v":"N/A"},null,"Status of audits conducted and findings closed out?",null,null,null,null,null,null,{"$f":"'Employee Register'!AU4","v":"N/A"}]
[]
[]
[null,null,null,null,"PERMANENT EMPLOYEES",null,null,null,null,null,"TEMPORARY WORKERS",null,null,null,null,null,"TEMPORARY WORKERS (EPWP)"]
["Day",null,"Date",null,"Total Manpower on project  ","Start Time (e.g. 08:34 AM)","End Time (e.g. 01:39 PM)","Total Hours worked ","Total Man hours Worked ",null,"Total Manpower on project  ","Start Time (e.g. 08:34 AM)","End Time (e.g. 01:39 PM)","Total Hours worked ","Total Man hours Worked ",null,"Total Manpower on project  ","Start Time (e.g. 08:34 AM)","End Time (e.g. 01:39 PM)","Total Hours worked ","Total Man hours Worked "]
[{"$f":"IF(C20=\"\", \"\", TEXT(WEEKDAY(dateValue), \"Ddd\"))","v":"Sun"},null,{"$f":"IF(Settings!G2=\"\", \"\", Settings!G2)","v":"1900-01-01"},null,{"$f":"COUNTIF('Employee Register'!$C$8:$D$1048576,\"Permanent\")","v":0},{"$f":"MIN('Employee Register'!$D$8:$D$107)","v":"00:00:00"},{"$f":"F20+AVERAGE('Employee Register'!$E$8:$E$107)/24","v":{"$error":"#DIV/0!"}},{"$f":"IFERROR(TIME(HOUR(G20)-HOUR(F20), MINUTE(G20)-MINUTE(F20), SECOND(G20)-SECOND(F20))*24, 0)","v":0},{"$f":"E20*H20","v":0},null,{"$f":"COUNTIF('Employee Register'!$C$8:$D$1048576,\"Temporary\")","v":0},{"$f":"MIN('Employee Register'!$D$8:$D$107)","v":"00:00:00"},{"$f":"L20+AVERAGE('Employee Register'!$E$8:$E$107)/24","v":{"$error":"#DIV/0!"}},{"$f":"IFERROR(TIME(HOUR(M20)-HOUR(L20), MINUTE(M20)-MINUTE(L20), SECOND(M20)-SECOND(L20))*24, 0)","v":0},{"$f":"K20*N20","v":0},null,{"$f":"COUNTIF('Employee Register'!$C$8:$D$1048576,\"Temporary EPWP\")","v":0},{"$f":"MIN('Employee Register'!$D$8:$D$107)","v":"00:00:00"},{"$f":"R20+AVERAGE('Employee Register'!$E$8:$E$107)/24","v":{"$error":"#DIV/0!"}},{"$f":"IFERROR(TIME(HOUR(S20)-HOUR(R20), MINUTE(S20)-MINUTE(R20), SECOND(S20)-SECOND(R20))*24, 0)","v":0},{"$f":"Q20*T20","v":0}]
[{"$f":"IF(C21=\"\", \"\", TEXT(WEEKDAY(C21), \"Ddd\"))","v":"Mon"},null,{"$f":"IF(Settings!G3=\"\", \"\", Settings!G3)","v":"1900-01-02"},null,{"$f":"COUNTIF('Employee Register'!$C$8:$H$1048576,\"Permanent\")","v":0},{"$f":"MIN('Employee Register'!$H$8:$H$107)","v":"00:00:00"},{"$f":"F21+AVERAGE('Employee Register'!$I$8:$I$107)/24","v":{"$error":"#DIV/0!"}},{"$f":"IFERROR(TIME(HOUR(G21)-HOUR(F21), MINUTE(G21)-MINUTE(F21), SECOND(G21)-SECOND(F21))*24, 0)","v":0},{"$f":"E21*H21","v":0},null,{"$f":"COUNTIF('Employee Register'!$C$8:$H$1048576,\"Temporary\")","v":0},{"$f":"MIN('Employee Register'!$H$8:$H$107)","v":"00:00:00"},{"$f":"L21+AVERAGE('Employee Register'!$I$8:$I$107)/24","v":{"$error":"#DIV/0!"}},{"$f":"IFERROR(TIME(HOUR(M21)-HOUR(L21), MINUTE(M21)-MINUTE(L21), SECOND(M21)-SECOND(L21))*24, 0)","v":0},{"$f":"K21*N21","v":0},null,{"$f":"COUNTIF('Employee Register'!$C$8:$H$1048576,\"Temporary EPWP\")","v":0},{"$f":"MIN('Employee Register'!$H$8:$H$107)","v":"00:00:00"},{"$f":"R21+AVERAGE('Employee Register'!$I$8:$I$107)/24","v":{"$error":"#DIV/0!"}},{"$f":"IFERROR(TIME(HOUR(S21)-HOUR(R21), MINUTE(S21)-MINUTE(R21), SECOND(S21)-SECOND(R21))*24, 0)","v":0},{"$f":"Q21*T21","v":0}]
["Tue",null,{"$f":"IF(Settings!G4=\"\", \"\", Settings!G4)","v":"1900-01-03"},null,{"$f":"COUNTIF('Employee Register'!$C$8:$L$1048576,\"Permanent\")","v":0},{"$f":"MIN('Employee Register'!$L$8:$L$107)","v":"00:00:00"},{"$f":"F22+AVERAGE('Employee Register'!$M$8:$M$107)/24","v":{"$error":"#DIV/0!"}},0,0,null,{"$f":"COUNTIF('Employee Register'!$C$8:$L$1048576,\"Temporary\")","v":0},{"$f":"MIN('Employee Register'!$L$8:$L$107)","v":"00:00:00"},{"$f":"L22+AVERAGE('Employee Register'!$M$8:$M$107)/24","v":{"$error":"#DIV/0!"}},0,0,null,{"$f":"COUNTIF('Employee Register'!$C$8:$L$1048576,\"Temporary EPWP\")","v":0},{"$f":"MIN('Employee Register'!$L$8:$L$107)","v":"00:00:00"},{"$f":"R22+AVERAGE('Employee Register'!$M$8:$M$107)/24","v":{"$error":"#DIV/0!"}},0,0]
["Wed",null,{"$f":"IF(Settings!G5=\"\", \"\", Settings!G5)","v":"1900-01-04"},null,{"$f":"COUNTIF('Employee Register'!$C$8:$P$1048576,\"Permanent\")","v":0},{"$f":"MIN('Employee Register'!$P$8:$P$107)","v":"00:00:00"},{"$f":"F23+AVERAGE('Employee Register'!$Q$8:$Q$107)/24","v":{"$error":"#DIV/0!"}},0,0,null,{"$f":"COUNTIF('Employee Register'!$C$8:$P$1048576,\"Temporary\")","v":0},{"$f":"MIN('Employee Register'!$P$8:$P$107)","v":"00:00:00"},{"$f":"L23+AVERAGE('Employee Register'!$Q$8:$Q$107)/24","v":{"$error":"#DIV/0!"}},0,0,null,{"$f":"COUNTIF('Employee Register'!$C$8:$P$1048576,\"Temporary EPWP\")","v":0},{"$f":"MIN('Employee Register'!$P$8:$P$107)","v":"00:00:00"},{"$f":"R23+AVERAGE('Employee Register'!$Q$8:$Q$107)/24","v":{"$error":"#DIV/0!"}},0,0]
["Thu",null,{"$f":"IF(Settings!G6=\"\", \"\", Settings!G6)","v":"1900-01-05"},null,{"$f":"COUNTIF('Employee Register'!$C$8:$T$1048576,\"Permanent\")","v":0},{"$f":"MIN('Employee Register'!$T$8:$T$107)","v":"00:00:00"},{"$f":"F24+AVERAGE('Employee Register'!$U$8:$U$107)/24","v":{"$error":"#DIV/0!"}},0,0,null,{"$f":"COUNTIF('Employee Register'!$C$8:$T$1048576,\"Temporary\")","v":0},{"$f":"MIN('Employee Register'!$T$8:$T$107)","v":"00:00:00"},{"$f":"L24+AVERAGE('Employee Register'!$U$8:$U$107)/24","v":{"$error":"#DIV/0!"}},0,0,null,{"$f":"COUNTIF('Employee Register'!$C$8:$T$1048576,\"Temporary EPWP\")","v":0},{"$f":"MIN('Employee Register'!$T$8:$T$107)","v":"00:00:00"},{"$f":"R24+AVERAGE('Employee Register'!$U$8:$U$107)/24","v":{"$error":"#DIV/0!"}},0,0]
["Fri",null,{"$f":"IF(Settings!G7=\"\", \"\", Settings!G7)","v":"1900-01-06"},null,{"$f":"COUNTIF('Employee Register'!$C$8:$X$1048576,\"Permanent\")","v":0},{"$f":"MIN('Employee Register'!$X$8:$X$107)","v":"00:00:00"},{"$f":"F25+AVERAGE('Employee Register'!$Y$8:$Y$107)/24","v":{"$error":"#DIV/0!"}},0,0,null,{"$f":"COUNTIF('Employee Register'!$C$8:$X$1048576,\"Temporary\")","v":0},{"$f":"MIN('Employee Register'!$X$8:$X$107)","v":"00:00:00"},{"$f":"L25+AVERAGE('Employee Register'!$Y$8:$Y$107)/24","v":{"$error":"#DIV/0!"}},0,0,null,{"$f":"COUNTIF('Employee Register'!$C$8:$X$1048576,\"Temporary EPWP\")","v":0},{"$f":"MIN('Employee Register'!$X$8:$X$107)","v":"00:00:00"},{"$f":"R25+AVERAGE('Employee Register'!$Y$8:$Y$107)/24","v":{"$error":"#DIV/0!"}},0,0]
["Sat",null,{"$f":"IF(Settings!G8=\"\", \"\", Settings!G8)","v":"1900-01-07"},null,{"$f":"COUNTIF('Employee Register'!$C$8:$AB$1048576,\"Permanent\")","v":0},{"$f":"MIN('Employee Register'!$AB$8:$AB$107)","v":"00:00:00"},{"$f":"F26+AVERAGE('Employee Register'!$AC$8:$AC$107)/24","v":{"$error":"#DIV/0!"}},0,0,null,{"$f":"COUNTIF('Employee Register'!$C$8:$AB$1048576,\"Temporary\")","v":0},{"$f":"MIN('Employee Register'!$AB$8:$AB$107)","v":"00:00:00"},{"$f":"L26+AVERAGE('Employee Register'!$AC$8:$AC$107)/24","v":{"$error":"#DIV/0!"}},0,0,null,{"$f":"COUNTIF('Employee Register'!$C$8:$AB$1048576,\"Temporary EPWP\")","v":0},{"$f":"MIN('Employee Register'!$AB$8:$AB$107)","v":"00:00:00"},{"$f":"R26+AVERAGE('Employee Register'!$AC$8:$AC$107)/24","v":{"$error":"#DIV/0!"}},0,0]
["Sun",null,{"$f":"IF(Settings!G9=\"\", \"\", Settings!G9)","v":"1900-01-08"},null,{"$f":"COUNTIF('Employee Register'!$C$8:$AF$1048576,\"Permanent\")","v":0},{"$f":"MIN('Employee Register'!$AF$8:$AF$107)","v":"00:00:00"},{"$f":"F27+AVERAGE('Employee Register'!$AG$8:$AG$107)/24","v":{"$error":"#DIV/0!"}},0,0,null,{"$f":"COUNTIF('Employee Register'!$C$8:$AF$1048576,\"Temporary\")","v":0},{"$f":"MIN('Employee Register'!$AF$8:$AF$107)","v":"00:00:00"},{"$f":"L27+AVERAGE('Employee Register'!$AG$8:$AG$107)/24","v":{"$error":"#DIV/0!"}},0,0,null,{"$f":"COUNTIF('Employee Register'!$C$8:$AF$1048576,\"Temporary EPWP\")","v":0},{"$f":"MIN('Employee Register'!$AF$8:$AF$107)","v":"00:00:00"},{"$f":"R27+AVERAGE('Employee Register'!$AG$8:$AG$107)/24","v":{"$error":"#DIV/0!"}},0,0]
["Mon",null,{"$f":"IF(Settings!G10=\"\", \"\", Settings!G10)","v":"1900-01-09"},null,{"$f":"COUNTIF('Employee Register'!$C$8:$AJ$1048576,\"Permanent\")","v":0},{"$f":"MIN('Employee Register'!$AJ$8:$AJ$107)","v":"00:00:00"},{"$f":"F28+AVERAGE('Employee Register'!$AK$8:$AK$107)/24","v":{"$error":"#DIV/0!"}},0,0,null,{"$f":"COUNTIF('Employee Register'!$C$8:$AJ$1048576,\"Temporary\")","v":0},{"$f":"MIN('Employee Register'!$AJ$8:$AJ$107)","v":"00:00:00"},{"$f":"L28+AVERAGE('Employee Register'!$AK$8:$AK$107)/24","v":{"$error":"#DIV/0!"}},0,0,null,{"$f":"COUNTIF('Employee Register'!$C$8:$AJ$1048576,\"Temporary EPWP\")","v":0},{"$f":"MIN('Employee Register'!$AJ$8:$AJ$107)","v":"00:00:00"},{"$f":"R28+AVERAGE('Employee Register'!$AK$8:$AK$107)/24","v":{"$error":"#DIV/0!"}},0,0]
["Tue",null,{"$f":"IF(Settings!G11=\"\", \"\", Settings!G11)","v":"1900-01-10"},null,{"$f":"COUNTIF('Employee Register'!$C$8:$AN$1048576,\"Permanent\")","v":0},{"$f":"MIN('Employee Register'!$AN$8:$AN$107)","v":"00:00:00"},{"$f":"F29+AVERAGE('Employee Register'!$AO$8:$AO$107)/24","v":{"$error":"#DIV/0!"}},0,0,null,{"$f":"COUNTIF('Employee Register'!$C$8:$AN$1048576,\"Temporary\")","v":0},{"$f":"MIN('Employee Register'!$AN$8:$AN$107)","v":"00:00:00"},{"$f":"L29+AVERAGE('Employee Register'!$AO$8:$AO$107)/24","v":{"$error":"#DIV/0!"}},0,0,null,{"$f":"COUNTIF('Employee Register'!$C$8:$AN$1048576,\"Temporary EPWP\")","v":0},{"$f":"MIN('Employee Register'!$AN$8:$AN$107)","v":"00:00:00"},{"$f":"R29+AVERAGE('Employee Register'!$AO$8:$AO$107)/24","v":{"$error":"#DIV/0!"}},0,0]
["Wed",null,{"$f":"IF(Settings!G12=\"\", \"\", Settings!G12)","v":"1900-01-11"},null,{"$f":"COUNTIF('Employee Register'!$C$8:$AR$1048576,\"Permanent\")","v":0},{"$f":"MIN('Employee Register'!$AR$8:$AR$107)","v":"00:00:00"},{"$f":"F30+AVERAGE('Employee Register'!$AS$8:$AS$107)/24","v":{"$error":"#DIV/0!"}},0,0,null,{"$f":"COUNTIF('Employee Register'!$C$8:$AR$1048576,\"Temporary\")","v":0},{"$f":"MIN('Employee Register'!$AR$8:$AR$107)","v":"00:00:00"},{"$f":"L30+AVERAGE('Employee Register'!$AS$8:$AS$107)/24","v":{"$error":"#DIV/0!"}},0,0,null,{"$f":"COUNTIF('Employee Register'!$C$8:$AR$1048576,\"Temporary EPWP\")","v":0},{"$f":"MIN('Employee Register'!$AR$8:$AR$107)","v":"00:00:00"},{"$f":"R30+AVERAGE('Employee Register'!$AS$8:$AS$107)/24","v":{"$error":"#DIV/0!"}},0,0]
["Thu",null,{"$f":"IF(Settings!G13=\"\", \"\", Settings!G13)","v":"1900-01-12"},null,{"$f":"COUNTIF('Employee Register'!$C$8:$AV$1048576,\"Permanent\")","v":0},{"$f":"MIN('Employee Register'!$AV$8:$AV$107)","v":"00:00:00"},{"$f":"F31+AVERAGE('Employee Register'!$AW$8:$AW$107)/24","v":{"$error":"#DIV/0!"}},0,0,null,{"$f":"COUNTIF('Employee Register'!$C$8:$AV$1048576,\"Temporary\")","v":0},{"$f":"MIN('Employee Register'!$AV$8:$AV$107)","v":"00:00:00"},{"$f":"L31+AVERAGE('Employee Register'!$AW$8:$AW$107)/24","v":{"$error":"#DIV/0!"}},0,0,null,{"$f":"COUNTIF('Employee Register'!$C$8:$AV$1048576,\"Temporary EPWP\")","v":0},{"$f":"MIN('Employee Register'!$AV$8:$AV$107)","v":"00:00:00"},{"$f":"R31+AVERAGE('Employee Register'!$AW$8:$AW$107)/24","v":{"$error":"#DIV/0!"}},0,0]
["Fri",null,{"$f":"IF(Settings!G14=\"\", \"\", Settings!G14)","v":"1900-01-13"},null,{"$f":"COUNTIF('Employee Register'!$C$8:$AZ$1048576,\"Permanent\")","v":0},{"$f":"MIN('Employee Register'!$AZ$8:$AZ$107)","v":"00:00:00"},{"$f":"F32+AVERAGE('Employee Register'!$BA$8:$BA$107)/24","v":{"$error":"#DIV/0!"}},0,0,null,{"$f":"COUNTIF('Employee Register'!$C$8:$AZ$1048576,\"Temporary\")","v":0},{"$f":"MIN('Employee Register'!$AZ$8:$AZ$107)","v":"00:00:00"},{"$f":"L32+AVERAGE('Employee Register'!$BA$8:$BA$107)/24","v":{"$error":"#DIV/0!"}},0,0,null,{"$f":"COUNTIF('Employee Register'!$C$8:$AZ$1048576,\"Temporary EPWP\")","v":0},{"$f":"MIN('Employee Register'!$AZ$8:$AZ$107)","v":"00:00:00"},{"$f":"R32+AVERAGE('Employee Register'!$BA$8:$BA$107)/24","v":{"$error":"#DIV/0!"}},0,0]
["Sat",null,{"$f":"IF(Settings!G15=\"\", \"\", Settings!G15)","v":"1900-01-14"},null,{"$f":"COUNTIF('Employee Register'!$C$8:$BD$1048576,\"Permanent\")","v":0},{"$f":"MIN('Employee Register'!$BD$8:$BD$107)","v":"00:00:00"},{"$f":"F33+AVERAGE('Employee Register'!$BE$8:$BE$107)/24","v":{"$error":"#DIV/0!"}},0,0,null,{"$f":"COUNTIF('Employee Register'!$C$8:$BD$1048576,\"Temporary\")","v":0},{"$f":"MIN('Employee Register'!$BD$8:$BD$107)","v":"00:00:00"},{"$f":"L33+AVERAGE('Employee Register'!$BE$8:$BE$107)/24","v":{"$error":"#DIV/0!"}},0,0,null,{"$f":"COUNTIF('Employee Register'!$C$8:$BD$1048576,\"Temporary EPWP\")","v":0},{"$f":"MIN('Employee Register'!$BD$8:$BD$107)","v":"00:00:00"},{"$f":"R33+AVERAGE('Employee Register'!$BE$8:$BE$107)/24","v":{"$error":"#DIV/0!"}},0,0]
["Sun",null,{"$f":"IF(Settings!G16=\"\", \"\", Settings!G16)","v":"1900-01-15"},null,{"$f":"COUNTIF('Employee Register'!$C$8:$BH$1048576,\"Permanent\")","v":0},{"$f":"MIN('Employee Register'!$BH$8:$BH$107)","v":"00:00:00"},{"$f":"F34+AVERAGE('Employee Register'!$BI$8:$BI$107)/24","v":{"$error":"#DIV/0!"}},0,0,null,{"$f":"COUNTIF('Employee Register'!$C$8:$BH$1048576,\"Temporary\")","v":0},{"$f":"MIN('Employee Register'!$BH$8:$BH$107)","v":"00:00:00"},{"$f":"L34+AVERAGE('Employee Register'!$BI$8:$BI$107)/24","v":{"$error":"#DIV/0!"}},0,0,null,{"$f":"COUNTIF('Employee Register'!$C$8:$BH$1048576,\"Temporary EPWP\")","v":0},{"$f":"MIN('Employee Register'!$BH$8:$BH$107)","v":"00:00:00"},{"$f":"R34+AVERAGE('Employee Register'!$BI$8:$BI$107)/24","v":{"$error":"#DIV/0!"}},0,0]
["Mon",null,{"$f":"IF(Settings!G17=\"\", \"\", Settings!G17)","v":"1900-01-16"},null,{"$f":"COUNTIF('Employee Register'!$C$8:$BL$1048576,\"Permanent\")","v":0},{"$f":"MIN('Employee Register'!$BL$8:$BL$107)","v":"00:00:00"},{"$f":"F35+AVERAGE('Employee Register'!$BM$8:$BM$107)/24","v":{"$error":"#DIV/0!"}},0,0,null,{"$f":"COUNTIF('Employee Register'!$C$8:$BL$1048576,\"Temporary\")","v":0},{"$f":"MIN('Employee Register'!$BL$8:$BL$107)","v":"00:00:00"},{"$f":"L35+AVERAGE('Employee Register'!$BM$8:$BM$107)/24","v":{"$error":"#DIV/0!"}},0,0,null,{"$f":"COUNTIF('Employee Register'!$C$8:$BL$1048576,\"Temporary EPWP\")","v":0},{"$f":"MIN('Employee Register'!$BL$8:$BL$107)","v":"00:00:00"},{"$f":"R35+AVERAGE('Employee Register'!$BM$8:$BM$107)/24","v":{"$error":"#DIV/0!"}},0,0]
["Tue",null,{"$f":"IF(Settings!G18=\"\", \"\", Settings!G18)","v":"1900-01-17"},null,{"$f":"COUNTIF('Employee Register'!$C$8:$BP$1048576,\"Permanent\")","v":0},{"$f":"MIN('Employee Register'!$BP$8:$BP$107)","v":"00:00:00"},{"$f":"F36+AVERAGE('Employee Register'!$BQ$8:$BQ$107)/24","v":{"$error":"#DIV/0!"}},0,0,null,{"$f":"COUNTIF('Employee Register'!$C$8:$BP$1048576,\"Temporary\")","v":0},{"$f":"MIN('Employee Register'!$BP$8:$BP$107)","v":"00:00:00"},{"$f":"L36+AVERAGE('Employee Register'!$BQ$8:$BQ$107)/24","v":{"$error":"#DIV/0!"}},0,0,null,{"$f":"COUNTIF('Employee Register'!$C$8:$BP$1048576,\"Temporary EPWP\")","v":0},{"$f":"MIN('Employee Register'!$BP$8:$BP$107)","v":"00:00:00"},{"$f":"R36+AVERAGE('Employee Register'!$BQ$8:$BQ$107)/24","v":{"$error":"#DIV/0!"}},0,0]
["Wed",null,{"$f":"IF(Settings!G19=\"\", \"\", Settings!G19)","v":"1900-01-18"},null,{"$f":"COUNTIF('Employee Register'!$C$8:$BT$1048576,\"Permanent\")","v":0},{"$f":"MIN('Employee Register'!$BT$8:$BT$107)","v":"00:00:00"},{"$f":"F37+AVERAGE('Employee Register'!$BU$8:$BU$107)/24","v":{"$error":"#DIV/0!"}},0,0,null,{"$f":"COUNTIF('Employee Register'!$C$8:$BT$1048576,\"Temporary\")","v":0},{"$f":"MIN('Employee Register'!$BT$8:$BT$107)","v":"00:00:00"},{"$f":"L37+AVERAGE('Employee Register'!$BU$8:$BU$107)/24","v":{"$error":"#DIV/0!"}},0,0,null,{"$f":"COUNTIF('Employee Register'!$C$8:$BT$1048576,\"Temporary EPWP\")","v":0},{"$f":"MIN('Employee Register'!$BT$8:$BT$107)","v":"00:00:00"},{"$f":"R37+AVERAGE('Employee Register'!$BU$8:$BU$107)/24","v":{"$error":"#DIV/0!"}},0,0]
["Thu",null,{"$f":"IF(Settings!G20=\"\", \"\", Settings!G20)","v":"1900-01-19"},null,{"$f":"COUNTIF('Employee Register'!$C$8:$BX$1048576,\"Permanent\")","v":0},{"$f":"MIN('Employee Register'!$BX$8:$BX$107)","v":"00:00:00"},{"$f":"F38+AVERAGE('Employee Register'!$BY$8:$BY$107)/24","v":{"$error":"#DIV/0!"}},0,0,null,{"$f":"COUNTIF('Employee Register'!$C$8:$BX$1048576,\"Temporary\")","v":0},{"$f":"MIN('Employee Register'!$BX$8:$BX$107)","v":"00:00:00"},{"$f":"L38+AVERAGE('Employee Register'!$BY$8:$BY$107)/24","v":{"$error":"#DIV/0!"}},0,0,null,{"$f":"COUNTIF('Employee Register'!$C$8:$BX$1048576,\"Temporary EPWP\")","v":0},{"$f":"MIN('Employee Register'!$BX$8:$BX$107)","v":"00:00:00"},{"$f":"R38+AVERAGE('Employee Register'!$BY$8:$BY$107)/24","v":{"$error":"#DIV/0!"}},0,0]
["Fri",null,{"$f":"IF(Settings!G21=\"\", \"\", Settings!G21)","v":"1900-01-20"},null,{"$f":"COUNTIF('Employee Register'!$C$8:$CB$1048576,\"Permanent\")","v":0},{"$f":"MIN('Employee Register'!$CB$8:$CB$107)","v":"00:00:00"},{"$f":"F39+AVERAGE('Employee Register'!$CC$8:$CC$107)/24","v":{"$error":"#DIV/0!"}},0,0,null,{"$f":"COUNTIF('Employee Register'!$C$8:$CB$1048576,\"Temporary\")","v":0},{"$f":"MIN('Employee Register'!$CB$8:$CB$107)","v":"00:00:00"},{"$f":"L39+AVERAGE('Employee Register'!$CC$8:$CC$107)/24","v":{"$error":"#DIV/0!"}},0,0,null,{"$f":"COUNTIF('Employee Register'!$C$8:$CB$1048576,\"Temporary EPWP\")","v":0},{"$f":"MIN('Employee Register'!$CB$8:$CB$107)","v":"00:00:00"},{"$f":"R39+AVERAGE('Employee Register'!$CC$8:$CC$107)/24","v":{"$error":"#DIV/0!"}},0,0]
["Sat",null,{"$f":"IF(Settings!G22=\"\", \"\", Settings!G22)","v":"1900-01-21"},null,{"$f":"COUNTIF('Employee Register'!$C$8:$CF$1048576,\"Permanent\")","v":0},{"$f":"MIN('Employee Register'!$CF$8:$CF$107)","v":"00:00:00"},{"$f":"F40+AVERAGE('Employee Register'!$CG$8:$CG$107)/24","v":{"$error":"#DIV/0!"}},0,0,null,{"$f":"COUNTIF('Employee Register'!$C$8:$CF$1048576,\"Temporary\")","v":0},{"$f":"MIN('Employee Register'!$CF$8:$CF$107)","v":"00:00:00"},{"$f":"L40+AVERAGE('Employee Register'!$CG$8:$CG$107)/24","v":{"$error":"#DIV/0!"}},0,0,null,{"$f":"COUNTIF('Employee Register'!$C$8:$CF$1048576,\"Temporary EPWP\")","v":0},{"$f":"MIN('Employee Register'!$CF$8:$CF$107)","v":"00:00:00"},{"$f":"R40+AVERAGE('Employee Register'!$CG$8:$CG$107)/24","v":{"$error":"#DIV/0!"}},0,0]
["Sun",null,{"$f":"IF(Settings!G23=\"\", \"\", Settings!G23)","v":"1900-01-22"},null,{"$f":"COUNTIF('Employee Register'!$C$8:$CJ$1048576,\"Permanent\")","v":0},{"$f":"MIN('Employee Register'!$CJ$8:$CJ$107)","v":"00:00:00"},{"$f":"F41+AVERAGE('Employee Register'!$CK$8:$CK$107)/24","v":{"$error":"#DIV/0!"}},0,0,null,{"$f":"COUNTIF('Employee Register'!$C$8:$CJ$1048576,\"Temporary\")","v":0},{"$f":"MIN('Employee Register'!$CJ$8:$CJ$107)","v":"00:00:00"},{"$f":"L41+AVERAGE('Employee Register'!$CK$8:$CK$107)/24","v":{"$error":"#DIV/0!"}},0,0,null,{"$f":"COUNTIF('Employee Register'!$C$8:$CJ$1048576,\"Temporary EPWP\")","v":0},{"$f":"MIN('Employee Register'!$CJ$8:$CJ$107)","v":"00:00:00"},{"$f":"R41+AVERAGE('Employee Register'!$CK$8:$CK$107)/24","v":{"$error":"#DIV/0!"}},0,0]
["Mon",null,{"$f":"IF(Settings!G24=\"\", \"\", Settings!G24)","v":"1900-01-23"},null,{"$f":"COUNTIF('Employee Register'!$C$8:$CN$1048576,\"Permanent\")","v":0},{"$f":"MIN('Employee Register'!$CN$8:$CN$107)","v":"00:00:00"},{"$f":"F42+AVERAGE('Employee Register'!$CO$8:$CO$107)/24","v":{"$error":"#DIV/0!"}},0,{"$f":"E42*H42","v":0},null,{"$f":"COUNTIF('Employee Register'!$C$8:$CN$1048576,\"Temporary\")","v":0},{"$f":"MIN('Employee Register'!$CN$8:$CN$107)","v":"00:00:00"},{"$f":"L42+AVERAGE('Employee Register'!$CO$8:$CO$107)/24","v":{"$error":"#DIV/0!"}},0,0,null,{"$f":"COUNTIF('Employee Register'!$C$8:$CN$1048576,\"Temporary EPWP\")","v":0},{"$f":"MIN('Employee Register'!$CN$8:$CN$107)","v":"00:00:00"},{"$f":"R42+AVERAGE('Employee Register'!$CO$8:$CO$107)/24","v":{"$error":"#DIV/0!"}},0,0]
["Tue",null,{"$f":"IF(Settings!G25=\"\", \"\", Settings!G25)","v":"1900-01-24"},null,{"$f":"COUNTIF('Employee Register'!$C$8:$CR$1048576,\"Permanent\")","v":0},{"$f":"MIN('Employee Register'!$CR$8:$CR$107)","v":"00:00:00"},{"$f":"F43+AVERAGE('Employee Register'!$CS$8:$CS$107)/24","v":{"$error":"#DIV/0!"}},0,0,null,{"$f":"COUNTIF('Employee Register'!$C$8:$CR$1048576,\"Temporary\")","v":0},{"$f":"MIN('Employee Register'!$CR$8:$CR$107)","v":"00:00:00"},{"$f":"L43+AVERAGE('Employee Register'!$CS$8:$CS$107)/24","v":{"$error":"#DIV/0!"}},0,0,null,{"$f":"COUNTIF('Employee Register'!$C$8:$CR$1048576,\"Temporary EPWP\")","v":0},{"$f":"MIN('Employee Register'!$CR$8:$CR$107)","v":"00:00:00"},{"$f":"R43+AVERAGE('Employee Register'!$CS$8:$CS$107)/24","v":{"$error":"#DIV/0!"}},0,0]
["Wed",null,{"$f":"IF(Settings!G26=\"\", \"\", Settings!G26)","v":"1900-01-25"},null,{"$f":"COUNTIF('Employee Register'!$C$8:$CV$1048576,\"Permanent\")","v":0},{"$f":"MIN('Employee Register'!$CV$8:$CV$107)","v":"00:00:00"},{"$f":"F44+AVERAGE('Employee Register'!$CW$8:$CW$107)/24","v":{"$error":"#DIV/0!"}},0,0,null,{"$f":"COUNTIF('Employee Register'!$C$8:$CV$1048576,\"Temporary\")","v":0},{"$f":"MIN('Employee Register'!$CV$8:$CV$107)","v":"00:00:00"},{"$f":"L44+AVERAGE('Employee Register'!$CW$8:$CW$107)/24","v":{"$error":"#DIV/0!"}},0,0,null,{"$f":"COUNTIF('Employee Register'!$C$8:$CV$1048576,\"Temporary EPWP\")","v":0},{"$f":"MIN('Employee Register'!$CV$8:$CV$107)","v":"00:00:00"},{"$f":"R44+AVERAGE('Employee Register'!$CW$8:$CW$107)/24","v":{"$error":"#DIV/0!"}},0,0]
["Thu",null,{"$f":"IF(Settings!G27=\"\", \"\", Settings!G27)","v":"1900-01-26"},null,{"$f":"COUNTIF('Employee Register'!$C$8:$CZ$1048576,\"Permanent\")","v":0},{"$f":"MIN('Employee Register'!$CZ$8:$CZ$107)","v":"00:00:00"},{"$f":"F45+AVERAGE('Employee Register'!$DA$8:$DA$107)/24","v":{"$error":"#DIV/0!"}},0,0,null,{"$f":"COUNTIF('Employee Register'!$C$8:$CZ$1048576,\"Temporary\")","v":0},{"$f":"MIN('Employee Register'!$CZ$8:$CZ$107)","v":"00:00:00"},{"$f":"L45+AVERAGE('Employee Register'!$DA$8:$DA$107)/24","v":{"$error":"#DIV/0!"}},0,0,null,{"$f":"COUNTIF('Employee Register'!$C$8:$CZ$1048576,\"Temporary EPWP\")","v":0},{"$f":"MIN('Employee Register'!$CZ$8:$CZ$107)","v":"00:00:00"},{"$f":"R45+AVERAGE('Employee Register'!$DA$8:$DA$107)/24","v":{"$error":"#DIV/0!"}},0,0]
["Fri",null,{"$f":"IF(Settings!G28=\"\", \"\", Settings!G28)","v":"1900-01-27"},null,{"$f":"COUNTIF('Employee Register'!$C$8:$DD$1048576,\"Permanent\")","v":0},{"$f":"MIN('Employee Register'!$DD$8:$DD$107)","v":"00:00:00"},{"$f":"F46+AVERAGE('Employee Register'!$DE$8:$DE$107)/24","v":{"$error":"#DIV/0!"}},0,0,null,{"$f":"COUNTIF('Employee Register'!$C$8:$DD$1048576,\"Temporary\")","v":0},{"$f":"MIN('Employee Register'!$DD$8:$DD$107)","v":"00:00:00"},{"$f":"L46+AVERAGE('Employee Register'!$DE$8:$DE$107)/24","v":{"$error":"#DIV/0!"}},0,0,null,{"$f":"COUNTIF('Employee Register'!$C$8:$DD$1048576,\"Temporary EPWP\")","v":0},{"$f":"MIN('Employee Register'!$DD$8:$DD$107)","v":"00:00:00"},{"$f":"R46+AVERAGE('Employee Register'!$DE$8:$DE$107)/24","v":{"$error":"#DIV/0!"}},0,0]
["Sat",null,{"$f":"IF(Settings!G29=\"\", \"\", Settings!G29)","v":"1900-01-28"},null,{"$f":"COUNTIF('Employee Register'!$C$8:$DH$1048576,\"Permanent\")","v":0},{"$f":"MIN('Employee Register'!$DH$8:$DH$107)","v":"00:00:00"},{"$f":"F47+AVERAGE('Employee Register'!$DI$8:$DI$107)/24","v":{"$error":"#DIV/0!"}},0,0,null,{"$f":"COUNTIF('Employee Register'!$C$8:$DH$1048576,\"Temporary\")","v":0},{"$f":"MIN('Employee Register'!$DH$8:$DH$107)","v":"00:00:00"},{"$f":"L47+AVERAGE('Employee Register'!$DI$8:$DI$107)/24","v":{"$error":"#DIV/0!"}},0,0,null,{"$f":"COUNTIF('Employee Register'!$C$8:$DH$1048576,\"Temporary EPWP\")","v":0},{"$f":"MIN('Employee Register'!$DH$8:$DH$107)","v":"00:00:00"},{"$f":"R47+AVERAGE('Employee Register'!$DI$8:$DI$107)/24","v":{"$error":"#DIV/0!"}},0,0]
["Sun",null,{"$f":"IF(Settings!G30=\"\", \"\", Settings!G30)","v":"1900-01-29"},null,{"$f":"COUNTIF('Employee Register'!$C$8:$DL$1048576,\"Permanent\")","v":0},{"$f":"MIN('Employee Register'!$DL$8:$DL$107)","v":"00:00:00"},{"$f":"F48+AVERAGE('Employee Register'!$DM$8:$DM$107)/24","v":{"$error":"#DIV/0!"}},0,0,null,{"$f":"COUNTIF('Employee Register'!$C$8:$DL$1048576,\"Temporary\")","v":0},{"$f":"MIN('Employee Register'!$DL$8:$DL$107)","v":"00:00:00"},{"$f":"L48+AVERAGE('Employee Register'!$DM$8:$DM$107)/24","v":{"$error":"#DIV/0!"}},0,0,null,{"$f":"COUNTIF('Employee Register'!$C$8:$DL$1048576,\"Temporary EPWP\")","v":0},{"$f":"MIN('Employee Register'!$DL$8:$DL$107)","v":"00:00:00"},{"$f":"R48+AVERAGE('Employee Register'!$DM$8:$DM$107)/24","v":{"$error":"#DIV/0!"}},0,0]
["Mon",null,{"$f":"IF(Settings!G31=\"\", \"\", Settings!G31)","v":"1900-01-30"},null,{"$f":"COUNTIF('Employee Register'!$C$8:$DP$1048576,\"Permanent\")","v":0},{"$f":"MIN('Employee Register'!$DP$8:$DP$107)","v":"00:00:00"},{"$f":"F49+AVERAGE('Employee Register'!$DQ$8:$DQ$107)/24","v":{"$error":"#DIV/0!"}},0,0,null,{"$f":"COUNTIF('Employee Register'!$C$8:$DP$1048576,\"Temporary\")","v":0},{"$f":"MIN('Employee Register'!$DP$8:$DP$107)","v":"00:00:00"},{"$f":"L49+AVERAGE('Employee Register'!$DQ$8:$DQ$107)/24","v":{"$error":"#DIV/0!"}},0,0,null,{"$f":"COUNTIF('Employee Register'!$C$8:$DP$1048576,\"Temporary EPWP\")","v":0},{"$f":"MIN('Employee Register'!$DP$8:$DP$107)","v":"00:00:00"},{"$f":"R49+AVERAGE('Employee Register'!$DQ$8:$DQ$107)/24","v":{"$error":"#DIV/0!"}},0,0]
["Tue",null,{"$f":"IF(Settings!G32=\"\", \"\", Settings!G32)","v":"1900-01-31"},null,{"$f":"COUNTIF('Employee Register'!$C$8:$DT$1048576,\"Permanent\")","v":0},{"$f":"MIN('Employee Register'!$DT$8:$DT$107)","v":"00:00:00"},{"$f":"F50+AVERAGE('Employee Register'!$DU$8:$DU$107)/24","v":{"$error":"#DIV/0!"}},0,0,null,{"$f":"COUNTIF('Employee Register'!$C$8:$DT$1048576,\"Temporary\")","v":0},{"$f":"MIN('Employee Register'!$DT$8:$DT$107)","v":"00:00:00"},{"$f":"L50+AVERAGE('Employee Register'!$DU$8:$DU$107)/24","v":{"$error":"#DIV/0!"}},0,0,null,{"$f":"COUNTIF('Employee Register'!$C$8:$DT$1048576,\"Temporary EPWP\")","v":0},{"$f":"MIN('Employee Register'!$DT$8:$DT$107)","v":"00:00:00"},{"$f":"R50+AVERAGE('Employee Register'!$DU$8:$DU$107)/24","v":{"$error":"#DIV/0!"}},0,0]
["Summaries",null,null,null,{"$f":"IFERROR(AVERAGE(E20:E50), 0)","v":0},"-","-",{"$f":"SUM(H20:H50)","v":0},"-",null,{"$f":"IFERROR(AVERAGE(K20:K50), 0)","v":0},"-","-",{"$f":"SUM(N20:N50)","v":0},"-",null,{"$f":"IFERROR(AVERAGE(Q20:Q50), 0)","v":0},"-","-",{"$f":"SUM(T20:T50)","v":0},"-"]
["Explanatory Notes: "]
["- Each task order number to be listed per form for that particular month. ",null,null,null,null,null,null,null,null,null,null,null,"- Start time and End Time are the times that the work was started on the day as well as the time that the workers were pulled off the site. Their format is HH:MM, e.g. 07:32 AM, 04:03 PM "]
["- \"Total manpower\" column to include the total number of resources/people working per day"]
["- \"Total hours worked\" column to include the total number of hours worked per day & summed per month by a formula at the bottom"]
[]
[]
[null,null,null,null,"For Eskom Office Use only:",null,null,null,null,null,null,"To Upload the Contractor Manhours\n- Click on the Summary Tab, \n- Scroll down until you see the Upload Manhours Button\n- Ensure that there are no Errors,\n- Click the Upload Manhours button"]
[" Checked by:",null,null,null,{"$f":"getEskomRepresentative()","v":"Larissa Wesi"}]
["Department:"]
["OU:"]
["Date:",null,null,null,{"$f":"TODAY()","v":"2022-03-30"}]

{"sheet":"Summary","index":1,"n_rows":30,"n_cols":3,"rows_kept":30,"cut":false,"hidden":false,"merged":[[0,0,0,1],[16,0,16,1],[19,0,19,1],[22,0,22,1],[26,0,26,1],[8,0,8,1]]}
["Report Summary",null,"Checks"]
["Contractor Name:",{"$f":"contractorName","v":0},{"$f":"IF(OR(B2=0, B2=\"\"), \"Type in a Contractor Name\", \"Ready\")","v":"Type in a Contractor Name"}]
["Task Order Number:",{"$f":"TEXT(taskorderNumber, \"0\")","v":"0"},{"$f":"IF(OR(B3=0, B3=\"\", LEFT(B3,2)<>\"45\"), \"Verify that the Taskorder number is entered correctly\", \"Ready\")","v":"Verify that the Taskorder number is entered correctly"}]
["Month Worked:",{"$f":"DATE(reportYear, MONTH(selectedMonth), 1)","v":"1900-01-01"},{"$f":"IF(OR(B4=0,B4=\"\",B4=DATE(1900,1,1), reportYear=\"\"),\"Select a Month and Year\",IF(B4>TODAY(),\"The Month you are reporting on is in the future\",\"Ready\"))","v":"Select a Month and Year"}]
["Vendor Number:",{"$f":"vendorNumber","v":0},{"$f":"IF(OR(B5=0, B5=\"\", LEN(B5)<vendorNumberLength, NOT(ISNUMBER(vendorNumber))), \"Type in a valid Vendor Number\", \"Ready\")","v":"Type in a valid Vendor Number"}]
["Department:",{"$f":"capturersDepartment","v":0},{"$f":"IF(OR(B6=0, B6=\"\"), \"Select your department\", \"Ready\")","v":"Select your department"}]
["Operating Unit:",{"$f":"OU","v":0},{"$f":"IF(OR(B7=0, B7=\"\"), \"Select your OU\", \"Ready\")","v":"Select your OU"}]
["Service Type:",{"$f":"selectedServiceType","v":0},{"$f":"IF(OR(B8=0, B8=\"\"), \"Select your Service Type provided by the Contractor\", \"Ready\")","v":"Select your Service Type provided by the Contractor"}]
["Incidents"]
["Fatalities:",{"$f":"fatalities","v":0},{"$f":"IF(OR(B10=0, B10=\"\"), \"No \" & LEFT(A10, LEN(A10)-1) & \" reported in \" & TEXT(selectedMonth, \"Mmmm\"), \"Ready\")","v":"No Fatalities reported in January"}]
["LTIs:",{"$f":"ltis","v":0},{"$f":"IF(OR(B11=0, B11=\"\"), \"No \" & LEFT(A11, LEN(A11)-1) & \" reported in \" & TEXT(selectedMonth, \"Mmmm\"), \"Ready\")","v":"No LTIs reported in January"}]
["Medicals:",{"$f":"medicals","v":0},{"$f":"IF(OR(B12=0, B12=\"\"), \"No \" & LEFT(A12, LEN(A12)-1) & \" reported in \" & TEXT(selectedMonth, \"Mmmm\"), \"Ready\")","v":"No Medicals reported in January"}]
["First Aid:",{"$f":"firstAid","v":0},{"$f":"IF(OR(B13=0, B13=\"\"), \"No \" & LEFT(A13, LEN(A13)-1) & \" reported in \" & TEXT(selectedMonth, \"Mmmm\"), \"Ready\")","v":"No First Aid reported in January"}]
["Near Misses:",{"$f":"nearMisses","v":0},{"$f":"IF(OR(B14=0, B14=\"\"), \"No \" & LEFT(A14, LEN(A14)-1) & \" reported in \" & TEXT(selectedMonth, \"Mmmm\"), \"Ready\")","v":"No Near Misses reported in January"}]
["Incident Closeout:",{"$f":"incidentCloseOut","v":"N/A"},{"$f":"IF(OR(B15=0, B15=\"\", B15=\"No\", B15=\"N/A\"), \"No \" & LEFT(A15, LEN(A15)-1) & \" reported in \" & TEXT(selectedMonth, \"Mmmm\"), \"Ready\")","v":"No Incident Closeout reported in January"}]
["Findings Closeout:",{"$f":"findingsCloseout","v":"N/A"},{"$f":"IF(OR(B16=0, B16=\"\", B16=\"No\", B16=\"N/A\"), \"No \" & LEFT(A16, LEN(A16)-1) & \" reported in \" & TEXT(selectedMonth, \"Mmmm\"), \"Ready\")","v":"No Findings Closeout reported in January"}]
["Permanent Employees Manhours"]
["Average Number of Employees:",{"$f":"ROUND(totalPermEmployees, 0)","v":0},{"$f":"IF(OR(B18=0, B18=\"\", B19=0, B19=\"\"), \"No Numbers Provided\", \"Ready\")","v":"No Numbers Provided"}]
["Sum of Hours Worked:",{"$f":"totalPermHoursWorked","v":0},{"$f":"IF(OR(B19=0, B19=\"\", B18=0, B18=\"\"), \"No Numbers Provided\", \"Ready\")","v":"No Numbers Provided"}]
["Temporary Employees Manhours"]
["Average Number of Employees:",{"$f":"ROUND(totTempManPower, 0)","v":0},{"$f":"IF(OR(B21=0, B21=\"\", B22=0, B22=\"\"), \"No Numbers Provided\", \"Ready\")","v":"No Numbers Provided"}]
["Sum of Hours Worked:",{"$f":"totTempHours","v":0},{"$f":"IF(OR(B22=0, B22=\"\", B21=0, B21=\"\"), \"No Numbers Provided\", \"Ready\")","v":"No Numbers Provided"}]
["Temporary (EPWP) Employees Manhours"]
["Average Number of Employees:",{"$f":"ROUND(totEPWPManpower, 0)","v":0},{"$f":"IF(OR(B24=0, B24=\"\", B25=0, B25=\"\"), \"No Numbers Provided\", \"Ready\")","v":"No Numbers Provided"}]
["Sum of Hours Worked:",{"$f":"totEPWPHours","v":0},{"$f":"IF(OR(B25=0, B25=\"\", B24=0, B24=\"\"), \"No Numbers Provided\", \"Ready\")","v":"No Numbers Provided"}]
[{"$f":"\"Readiness to Upload (\" & ROUND(Settings!BF3*100, 1) & \"%)\"","v":"Readiness to Upload (0%)"},{"$f":"Settings!BF3","v":0},{"$f":"IF(AND(B26=1, validateData=\"Ready\"), \"You Can Upload\", \"Fix Errors before uploading\")","v":"Fix Errors before uploading"}]
["Click the button below to upload report summary"]
[]
[]
["Click here to confirm that the data was uploaded successfully"]

{"sheet":"Employee Register","index":2,"n_rows":107,"n_cols":128,"rows_kept":107,"cut":false,"hidden":false,"merged":[[0,3,0,5],[1,3,1,5],[2,3,2,5],[3,29,3,37],[1,30,1,31],[1,33,1,34],[1,36,1,37],[3,19,3,23],[3,24,3,27],[0,11,0,13],[1,11,1,13],[0,29,0,46],[1,40,1,41],[1,43,1,44],[3,39,3,45],[5,125,6,125],[0,6,0,9],[1,6,1,9],[2,6,2,9],[0,19,0,23],[1,19,1,23],[0,14,0,17],[1,14,1,17],[0,24,0,27],[1,24,1,27],[2,19,2,23],[2,24,2,27],[5,73,6,73],[5,77,6,77],[5,81,6,81],[5,85,6,85],[5,89,6,89],[5,33,6,33],[5,37,6,37],[5,41,6,41],[5,45,6,45],[5,49,6,49],[5,76,6,76],[5,80,6,80],[5,84,6,84],[5,88,6,88],[5,36,6,36],[5,60,6,60],[5,64,6,64],[5,68,6,68],[5,1,6,1],[5,5,6,5],[5,9,6,9],[5,13,6,13],[5,17,6,17],[5,16,6,16],[5,120,6,120],[5,124,6,124],[5,100,6,100],[5,104,6,104],[5,108,6,108],[5,112,6,112],[5,116,6,116],[5,105,6,105],[5,109,6,109],[5,113,6,113],[5,117,6,117],[5,121,6,121],[5,92,6,92],[5,96,6,96],[5,93,6,93],[5,97,6,97],[5,101,6,101],[5,29,6,29],[5,72,6,72],[5,53,6,53],[5,57,6,57],[5,61,6,61],[5,65,6,65],[5,69,6,69],[5,0,6,0],[5,127,6,127],[5,40,6,40],[5,44,6,44],[5,48,6,48],[5,52,6,52],[5,56,6,56],[5,4,6,4],[5,8,6,8],[5,12,6,12],[5,20,6,20],[5,24,6,24],[5,28,6,28],[5,32,6,32],[5,21,6,21],[5,25,6,25]]}
["Contractor Name:",null,null,"Service Type:",null,null,null,null,null,null,null,"Name of CEO",null,null,null,null,null,null,null,"Name of Site Supervisor",null,null,null,null,null,null,null,null,null,"AUDITS, FINDINGS & INCIDENTS FOR MONTH"]
["Month:",null,null,"Year:",null,null,null,null,null,null,null,"Contact Details of CEO",null,null,null,null,null,null,null,"Contact Details of Site Supervisor",null,null,null,null,null,null,null,null,null,null,"Fatalities   ",null,0,"Lost Time   ",null,0,"Medicals   ",null,0,null,"First Aid   ",null,0,"Near Misses",null,0]
["Task Order Number:",null,null,"Vendor Number:",null,null,null,null,null,null,null,null,null,null,null,null,null,null,null,"Name of Health & Safety Practitioner"]
["Site Name:",null,null,null,null,null,null,null,null,null,null,null,null,null,null,null,null,null,null,"Contact Details of H&S Practitioner",null,null,null,null,null,null,null,null,null,"Status of incidents investigated and recommendations closed out?   ",null,null,null,null,null,null,null,null,"N/A","Status of audits conducted and findings closed out?",null,null,null,null,null,null,"N/A"]
[]
["Employee","ID / Employee Number","Day & Date",{"$f":"TEXT(DATE($G$2,MONTH($B$2),G6),\"DDD\")","v":"Sun"},"Hrs Worked","Temp. Scan",1,{"$f":"TEXT(DATE($G$2,MONTH($B$2),K6),\"DDD\")","v":"Mon"},"Hrs Worked","Temp. Scan",2,{"$f":"TEXT(DATE($G$2,MONTH($B$2),O6),\"DDD\")","v":"Tue"},"Hrs Worked","Temp. Scan",3,{"$f":"TEXT(DATE($G$2,MONTH($B$2),S6),\"DDD\")","v":"Wed"},"Hrs Worked","Temp. Scan",4,{"$f":"TEXT(DATE($G$2,MONTH($B$2),W6),\"DDD\")","v":"Thu"},"Hrs Worked","Temp. Scan",5,{"$f":"TEXT(DATE($G$2,MONTH($B$2),AA6),\"DDD\")","v":"Fri"},"Hrs Worked","Temp. Scan",6,{"$f":"TEXT(DATE($G$2,MONTH($B$2),AE6),\"DDD\")","v":"Sat"},"Hrs Worked","Temp. Scan",7,{"$f":"TEXT(DATE($G$2,MONTH($B$2),AI6),\"DDD\")","v":"Sun"},"Hrs Worked","Temp. Scan",8,{"$f":"TEXT(DATE($G$2,MONTH($B$2),AM6),\"DDD\")","v":"Mon"},"Hrs Worked","Temp. Scan",9,{"$f":"TEXT(DATE($G$2,MONTH($B$2),AQ6),\"DDD\")","v":"Tue"},"Hrs Worked","Temp. Scan",10,{"$f":"TEXT(DATE($G$2,MONTH($B$2),AU6),\"DDD\")","v":"Wed"},"Hrs Worked","Temp. Scan",11,{"$f":"TEXT(DATE($G$2,MONTH($B$2),AY6),\"DDD\")","v":"Thu"},"Hrs Worked","Temp. Scan",12,{"$f":"TEXT(DATE($G$2,MONTH($B$2),BC6),\"DDD\")","v":"Fri"},"Hrs Worked","Temp. Scan",13,{"$f":"TEXT(DATE($G$2,MONTH($B$2),BG6),\"DDD\")","v":"Sat"},"Hrs Worked","Temp. Scan",14,{"$f":"TEXT(DATE($G$2,MONTH($B$2),BK6),\"DDD\")","v":"Sun"},"Hrs Worked","Temp. Scan",15,{"$f":"TEXT(DATE($G$2,MONTH($B$2),BO6),\"DDD\")","v":"Mon"},"Hrs Worked","Temp. Scan",16,{"$f":"TEXT(DATE($G$2,MONTH($B$2),BS6),\"DDD\")","v":"Tue"},"Hrs Worked","Temp. Scan",17,{"$f":"TEXT(DATE($G$2,MONTH($B$2),BW6),\"DDD\")","v":"Wed"},"Hrs Worked","Temp. Scan",18,{"$f":"TEXT(DATE($G$2,MONTH($B$2),CA6),\"DDD\")","v":"Thu"},"Hrs Worked","Temp. Scan",19,{"$f":"TEXT(DATE($G$2,MONTH($B$2),CE6),\"DDD\")","v":"Fri"},"Hrs Worked","Temp. Scan",20,{"$f":"TEXT(DATE($G$2,MONTH($B$2),CI6),\"DDD\")","v":"Sat"},"Hrs Worked","Temp. Scan",21,{"$f":"TEXT(DATE($G$2,MONTH($B$2),CM6),\"DDD\")","v":"Sun"},"Hrs Worked","Temp. Scan",22,{"$f":"TEXT(DATE($G$2,MONTH($B$2),CQ6),\"DDD\")","v":"Mon"},"Hrs Worked","Temp. Scan",23,{"$f":"TEXT(DATE($G$2,MONTH($B$2),CU6),\"DDD\")","v":"Tue"},"Hrs Worked","Temp. Scan",24,{"$f":"TEXT(DATE($G$2,MONTH($B$2),CY6),\"DDD\")","v":"Wed"},"Hrs Worked","Temp. Scan",25,{"$f":"TEXT(DATE($G$2,MONTH($B$2),DC6),\"DDD\")","v":"Thu"},"Hrs Worked","Temp. Scan",26,{"$f":"TEXT(DATE($G$2,MONTH($B$2),DG6),\"DDD\")","v":"Fri"},"Hrs Worked","Temp. Scan",27,{"$f":"TEXT(DATE($G$2,MONTH($B$2),DK6),\"DDD\")","v":"Sat"},"Hrs Worked","Temp. Scan",28,{"$f":"IF(AND(MOD($G$2,4)=0,MONTH($B$2)=2),TEXT(DATE($G$2,MONTH($B$2),DO6),\"DDD\"),IF(MONTH($B$2)<>2,TEXT(DATE($G$2,MONTH($B$2),DO6),\"DDD\"),\" - \"))","v":"Sun"},"Hrs Worked","Temp. Scan",29,{"$f":"IF(MONTH($B$2)<>2,TEXT(DATE($G$2,MONTH($B$2),DS6),\"DDD\"),\" - \")","v":"Mon"},"Hrs Worked","Temp. Scan",30,{"$f":"IF(AND(MONTH($B$2)<>2,MONTH($B$2)<>4,MONTH($B$2)<>6,MONTH($B$2)<>9,MONTH($B$2)<>11),TEXT(DATE($G$2,MONTH($B$2),DW6),\"DDD\"),\" - \")","v":"Tue"},"Hrs Worked","Temp. Scan",31,"∑ Hours Worked"]
[null,null,"Employment Type","Start",null,null,"End","Start",null,null,"End","Start",null,null,"End","Start",null,null,"End","Start",null,null,"End","Start",null,null,"End","Start",null,null,"End","Start",null,null,"End","Start",null,null,"End","Start",null,null,"End","Start",null,null,"End","Start",null,null,"End","Start",null,null,"End","Start",null,null,"End","Start",null,null,"End","Start",null,null,"End","Start",null,null,"End","Start",null,null,"End","Start",null,null,"End","Start",null,null,"End","Start",null,null,"End","Start",null,null,"End","Start",null,null,"End","Start",null,null,"End","Start",null,null,"End","Start",null,null,"End","Start",null,null,"End","Start",null,null,"End","Start",null,null,"End","Start",null,null,"End","Start",null,null,"End"]
[null,null,null,null,null,null,{"$f":"IF(NOT(ISBLANK(E8)),(TEXT(DATE($G$2,MONTH($B$2),G$6),\"YYYY/MM/DD\")&\" \"&TEXT(D8,\"hh:mm\"))+(E8+0.5)/24,\"00:00\")","v":"00:00"},null,null,null,{"$f":"IF(NOT(ISBLANK(I8)),(TEXT(DATE($G$2,MONTH($B$2),K$6),\"YYYY/MM/DD\")&\" \"&TEXT(H8,\"hh:mm\"))+(I8+0.5)/24,\"00:00\")","v":"00:00"},null,null,null,{"$f":"IF(NOT(ISBLANK(M8)),(TEXT(DATE($G$2,MONTH($B$2),O$6),\"YYYY/MM/DD\")&\" \"&TEXT(L8,\"hh:mm\"))+(M8+0.5)/24,\"00:00\")","v":"00:00"},null,null,null,{"$f":"IF(NOT(ISBLANK(Q8)),(TEXT(DATE($G$2,MONTH($B$2),S$6),\"YYYY/MM/DD\")&\" \"&TEXT(P8,\"hh:mm\"))+(Q8+0.5)/24,\"00:00\")","v":"00:00"},null,null,null,{"$f":"IF(NOT(ISBLANK(U8)),(TEXT(DATE($G$2,MONTH($B$2),W$6),\"YYYY/MM/DD\")&\" \"&TEXT(T8,\"hh:mm\"))+(U8+0.5)/24,\"00:00\")","v":"00:00"},null,null,null,{"$f":"IF(NOT(ISBLANK(Y8)),(TEXT(DATE($G$2,MONTH($B$2),AA$6),\"YYYY/MM/DD\")&\" \"&TEXT(X8,\"hh:mm\"))+(Y8+0.5)/24,\"00:00\")","v":"00:00"},null,null,null,{"$f":"IF(NOT(ISBLANK(AC8)),(TEXT(DATE($G$2,MONTH($B$2),AE$6),\"YYYY/MM/DD\")&\" \"&TEXT(AB8,\"hh:mm\"))+(AC8+0.5)/24,\"00:00\")","v":"00:00"},null,null,null,{"$f":"IF(NOT(ISBLANK(AG8)),(TEXT(DATE($G$2,MONTH($B$2),AI$6),\"YYYY/MM/DD\")&\" \"&TEXT(AF8,\"hh:mm\"))+(AG8+0.5)/24,\"00:00\")","v":"00:00"},null,null,null,{"$f":"IF(NOT(ISBLANK(AK8)),(TEXT(DATE($G$2,MONTH($B$2),AM$6),\"YYYY/MM/DD\")&\" \"&TEXT(AJ8,\"hh:mm\"))+(AK8+0.5)/24,\"00:00\")","v":"00:00"},null,null,null,{"$f":"IF(NOT(ISBLANK(AO8)),(TEXT(DATE($G$2,MONTH($B$2),AQ$6),\"YYYY/MM/DD\")&\" \"&TEXT(AN8,\"hh:mm\"))+(AO8+0.5)/24,\"00:00\")","v":"00:00"},null,null,null,{"$f":"IF(NOT(ISBLANK(AS8)),(TEXT(DATE($G$2,MONTH($B$2),AU$6),\"YYYY/MM/DD\")&\" \"&TEXT(AR8,\"hh:mm\"))+(AS8+0.5)/24,\"00:00\")","v":"00:00"},null,null,null,{"$f":"IF(NOT(ISBLANK(AW8)),(TEXT(DATE($G$2,MONTH($B$2),AY$6),\"YYYY/MM/DD\")&\" \"&TEXT(AV8,\"hh:mm\"))+(AW8+0.5)/24,\"00:00\")","v":"00:00"},null,null,null,{"$f":"IF(NOT(ISBLANK(BA8)),(TEXT(DATE($G$2,MONTH($B$2),BC$6),\"YYYY/MM/DD\")&\" \"&TEXT(AZ8,\"hh:mm\"))+(BA8+0.5)/24,\"00:00\")","v":"00:00"},null,null,null,{"$f":"IF(NOT(ISBLANK(BE8)),(TEXT(DATE($G$2,MONTH($B$2),BG$6),\"YYYY/MM/DD\")&\" \"&TEXT(BD8,\"hh:mm\"))+(BE8+0.5)/24,\"00:00\")","v":"00:00"},null,null,null,{"$f":"IF(NOT(ISBLANK(BI8)),(TEXT(DATE($G$2,MONTH($B$2),BK$6),\"YYYY/MM/DD\")&\" \"&TEXT(BH8,\"hh:mm\"))+(BI8+0.5)/24,\"00:00\")","v":"00:00"},null,null,null,{"$f":"IF(NOT(ISBLANK(BM8)),(TEXT(DATE($G$2,MONTH($B$2),BO$6),\"YYYY/MM/DD\")&\" \"&TEXT(BL8,\"hh:mm\"))+(BM8+0.5)/24,\"00:00\")","v":"00:00"},null,null,null,{"$f":"IF(NOT(ISBLANK(BQ8)),(TEXT(DATE($G$2,MONTH($B$2),BS$6),\"YYYY/MM/DD\")&\" \"&TEXT(BP8,\"hh:mm\"))+(BQ8+0.5)/24,\"00:00\")","v":"00:00"},null,null,null,{"$f":"IF(NOT(ISBLANK(BU8)),(TEXT(DATE($G$2,MONTH($B$2),BW$6),\"YYYY/MM/DD\")&\" \"&TEXT(BT8,\"hh:mm\"))+(BU8+0.5)/24,\"00:00\")","v":"00:00"},null,null,null,{"$f":"IF(NOT(ISBLANK(BY8)),(TEXT(DATE($G$2,MONTH($B$2),CA$6),\"YYYY/MM/DD\")&\" \"&TEXT(BX8,\"hh:mm\"))+(BY8+0.5)/24,\"00:00\")","v":"00:00"},null,null,null,{"$f":"IF(NOT(ISBLANK(CC8)),(TEXT(DATE($G$2,MONTH($B$2),CE$6),\"YYYY/MM/DD\")&\" \"&TEXT(CB8,\"hh:mm\"))+(CC8+0.5)/24,\"00:00\")","v":"00:00"},null,null,null,{"$f":"IF(NOT(ISBLANK(CG8)),(TEXT(DATE($G$2,MONTH($B$2),CI$6),\"YYYY/MM/DD\")&\" \"&TEXT(CF8,\"hh:mm\"))+(CG8+0.5)/24,\"00:00\")","v":"00:00"},null,null,null,{"$f":"IF(NOT(ISBLANK(CK8)),(TEXT(DATE($G$2,MONTH($B$2),CM$6),\"YYYY/MM/DD\")&\" \"&TEXT(CJ8,\"hh:mm\"))+(CK8+0.5)/24,\"00:00\")","v":"00:00"},null,null,null,{"$f":"IF(NOT(ISBLANK(CO8)),(TEXT(DATE($G$2,MONTH($B$2),CQ$6),\"YYYY/MM/DD\")&\" \"&TEXT(CN8,\"hh:mm\"))+(CO8+0.5)/24,\"00:00\")","v":"00:00"},null,null,null,{"$f":"IF(NOT(ISBLANK(CS8)),(TEXT(DATE($G$2,MONTH($B$2),CU$6),\"YYYY/MM/DD\")&\" \"&TEXT(CR8,\"hh:mm\"))+(CS8+0.5)/24,\"00:00\")","v":"00:00"},null,null,null,{"$f":"IF(NOT(ISBLANK(CW8)),(TEXT(DATE($G$2,MONTH($B$2),CY$6),\"YYYY/MM/DD\")&\" \"&TEXT(CV8,\"hh:mm\"))+(CW8+0.5)/24,\"00:00\")","v":"00:00"},null,null,null,{"$f":"IF(NOT(ISBLANK(DA8)),(TEXT(DATE($G$2,MONTH($B$2),DC$6),\"YYYY/MM/DD\")&\" \"&TEXT(CZ8,\"hh:mm\"))+(DA8+0.5)/24,\"00:00\")","v":"00:00"},null,null,null,{"$f":"IF(NOT(ISBLANK(DE8)),(TEXT(DATE($G$2,MONTH($B$2),DG$6),\"YYYY/MM/DD\")&\" \"&TEXT(DD8,\"hh:mm\"))+(DE8+0.5)/24,\"00:00\")","v":"00:00"},null,null,null,{"$f":"IF(NOT(ISBLANK(DI8)),(TEXT(DATE($G$2,MONTH($B$2),DK$6),\"YYYY/MM/DD\")&\" \"&TEXT(DH8,\"hh:mm\"))+(DI8+0.5)/24,\"00:00\")","v":"00:00"},null,null,null,{"$f":"IF(NOT(ISBLANK(DM8)),(TEXT(DATE($G$2,MONTH($B$2),DO$6),\"YYYY/MM/DD\")&\" \"&TEXT(DL8,\"hh:mm\"))+(DM8+0.5)/24,\"00:00\")","v":"00:00"},null,null,null,{"$f":"IF(NOT(ISBLANK(DQ8)),(TEXT(DATE($G$2,MONTH($B$2),DS$6),\"YYYY/MM/DD\")&\" \"&TEXT(DP8,\"hh:mm\"))+(DQ8+0.5)/24,\"00:00\")","v":"00:00"},null,null,null,{"$f":"IF(NOT(ISBLANK(DU8)),(TEXT(DATE($G$2,MONTH($B$2),DW$6),\"YYYY/MM/DD\")&\" \"&TEXT(DT8,\"hh:mm\"))+(DU8+0.5)/24,\"00:00\")","v":"00:00"},{"$f":"SUM(E8,I8,M8,Q8,U8,Y8,AC8,AG8,AK8,AO8,AS8,AW8,BA8,BE8,BI8,BM8,BQ8,BU8,BY8,CC8,CG8,CK8,CO8,CS8,CW8,DA8,DE8,DI8,DM8,DQ8,DU8)","v":0}]
[null,null,null,null,null,null,"00:00",null,null,null,"00:00",null,null,null,"00:00",null,null,null,"00:00",null,null,null,"00:00",null,null,null,"00:00",null,null,null,"00:00",null,null,null,"00:00",null,null,null,"00:00",null,null,null,"00:00",null,null,null,"00:00",null,null,null,"00:00",null,null,null,"00:00",null,null,null,"00:00",null,null,null,"00:00",null,null,null,"00:00",null,null,null,"00:00",null,null,null,"00:00",null,null,null,"00:00",null,null,null,"00:00",null,null,null,"00:00",null,null,null,"00:00",null,null,null,"00:00",null,null,null,"00:00",null,null,null,"00:00",null,null,null,"00:00",null,null,null,"00:00",null,null,null,"00:00",null,null,null,"00:00",null,null,null,"00:00",null,null,null,"00:00",0]
[null,null,null,null,null,null,"00:00",null,null,null,"00:00",null,null,null,"00:00",null,null,null,"00:00",null,null,null,"00:00",null,null,null,"00:00",null,null,null,"00:00",null,null,null,"00:00",null,null,null,"00:00",null,null,null,"00:00",null,null,null,"00:00",null,null,null,"00:00",null,null,null,"00:00",null,null,null,"00:00",null,null,null,"00:00",null,null,null,"00:00",null,null,null,"00:00",null,null,null,"00:00",null,null,null,"00:00",null,null,null,"00:00",null,null,null,"00:00",null,null,null,"00:00",null,null,null,"00:00",null,null,null,"00:00",null,null,null,"00:00",null,null,null,"00:00",null,null,null,"00:00",null,null,null,"00:00",null,null,null,"00:00",null,null,null,"00:00",null,null,null,"00:00",0]
[null,null,null,null,null,null,"00:00",null,null,null,"00:00",null,null,null,"00:00",null,null,null,"00:00",null,null,null,"00:00",null,null,null,"00:00",null,null,null,"00:00",null,null,null,"00:00",null,null,null,"00:00",null,null,null,"00:00",null,null,null,"00:00",null,null,null,"00:00",null,null,null,"00:00",null,null,null,"00:00",null,null,null,"00:00",null,null,null,"00:00",null,null,null,"00:00",null,null,null,"00:00",null,null,null,"00:00",null,null,null,"00:00",null,null,null,"00:00",null,null,null,"00:00",null,null,null,"00:00",null,null,null,"00:00",null,null,null,"00:00",null,null,null,"00:00",null,null,null,"00:00",null,null,null,"00:00",null,null,null,"00:00",null,null,null,"00:00",null,null,null,"00:00",0]
[null,null,null,null,null,null,"00:00",null,null,null,"00:00",null,null,null,"00:00",null,null,null,"00:00",null,null,null,"00:00",null,null,null,"00:00",null,null,null,"00:00",null,null,null,"00:00",null,null,null,"00:00",null,null,null,"00:00",null,null,null,"00:00",null,null,null,"00:00",null,null,null,"00:00",null,null,null,"00:00",null,null,null,"00:00",null,null,null,"00:00",null,null,null,"00:00",null,null,null,"00:00",null,null,null,"00:00",null,null,null,"00:00",null,null,null,"00:00",null,null,null,"00:00",null,null,null,"00:00",null,null,null,"00:00",null,null,null,"00:00",null,null,null,"00:00",null,null,null,"00:00",null,null,null,"00:00",null,null,null,"00:00",null,null,null,"00:00",null,null,null,"00:00",0]
[null,null,null,null,null,null,"00:00",null,null,null,"00:00",null,null,null,"00:00",null,null,null,"00:00",null,null,null,"00:00",null,null,null,"00:00",null,null,null,"00:00",null,null,null,"00:00",null,null,null,"00:00",null,null,null,"00:00",null,null,null,"00:00",null,null,null,"00:00",null,null,null,"00:00",null,null,null,"00:00",null,null,null,"00:00",null,null,null,"00:00",null,null,null,"00:00",null,null,null,"00:00",null,null,null,"00:00",null,null,null,"00:00",null,null,null,"00:00",null,null,null,"00:00",null,null,null,"00:00",null,null,null,"00:00",null,null,null,"00:00",null,null,null,"00:00",null,null,null,"00:00",null,null,null,"00:00",null,null,null,"00:00",null,null,null,"00:00",null,null,null,"00:00",0]
[null,null,null,null,null,null,"00:00",null,null,null,"00:00",null,null,null,"00:00",null,null,null,"00:00",null,null,null,"00:00",null,null,null,"00:00",null,null,null,"00:00",null,null,null,"00:00",null,null,null,"00:00",null,null,null,"00:00",null,null,null,"00:00",null,null,null,"00:00",null,null,null,"00:00",null,null,null,"00:00",null,null,null,"00:00",null,null,null,"00:00",null,null,null,"00:00",null,null,null,"00:00",null,null,null,"00:00",null,null,null,"00:00",null,null,null,"00:00",null,null,null,"00:00",null,null,null,"00:00",null,null,null,"00:00",null,null,null,"00:00",null,null,null,"00:00",null,null,null,"00:00",null,null,null,"00:00",null,null,null,"00:00",null,null,null,"00:00",null,null,null,"00:00",0]
[null,null,null,null,null,null,"00:00",null,null,null,"00:00",null,null,null,"00:00",null,null,null,"00:00",null,null,null,"00:00",null,null,null,"00:00",null,null,null,"00:00",null,null,null,"00:00",null,null,null,"00:00",null,null,null,"00:00",null,null,null,"00:00",null,null,null,"00:00",null,null,null,"00:00",null,null,null,"00:00",null,null,null,"00:00",null,null,null,"00:00",null,null,null,"00:00",null,null,null,"00:00",null,null,null,"00:00",null,null,null,"00:00",null,null,null,"00:00",null,null,null,"00:00",null,null,null,"00:00",null,null,null,"00:00",null,null,null,"00:00",null,null,null,"00:00",null,null,null,"00:00",null,null,null,"00:00",null,null,null,"00:00",null,null,null,"00:00",null,null,null,"00:00",0]
[null,null,null,null,null,null,"00:00",null,null,null,"00:00",null,null,null,"00:00",null,null,null,"00:00",null,null,null,"00:00",null,null,null,"00:00",null,null,null,"00:00",null,null,null,"00:00",null,null,null,"00:00",null,null,null,"00:00",null,null,null,"00:00",null,null,null,"00:00",null,null,null,"00:00",null,null,null,"00:00",null,null,null,"00:00",null,null,null,"00:00",null,null,null,"00:00",null,null,null,"00:00",null,null,null,"00:00",null,null,null,"00:00",null,null,null,"00:00",null,null,null,"00:00",null,null,null,"00:00",null,null,null,"00:00",null,null,null,"00:00",null,null,null,"00:00",null,null,null,"00:00",null,null,null,"00:00",null,null,null,"00:00",null,null,null,"00:00",null,null,null,"00:00",0]
[null,null,null,null,null,null,"00:00",null,null,null,"00:00",null,null,null,"00:00",null,null,null,"00:00",null,null,null,"00:00",null,null,null,"00:00",null,null,null,"00:00",null,null,null,"00:00",null,null,null,"00:00",null,null,null,"00:00",null,null,null,"00:00",null,null,null,"00:00",null,null,null,"00:00",null,null,null,"00:00",null,null,null,"00:00",null,null,null,"00:00",null,null,null,"00:00",null,null,null,"00:00",null,null,null,"00:00",null,null,null,"00:00",null,null,null,"00:00",null,null,null,"00:00",null,null,null,"00:00",null,null,null,"00:00",null,null,null,"00:00",null,null,null,"00:00",null,null,null,"00:00",null,null,null,"00:00",null,null,null,"00:00",null,null,null,"00:00",null,null,null,"00:00",0]
[null,null,null,null,null,null,"00:00",null,null,null,"00:00",null,null,null,"00:00",null,null,null,"00:00",null,null,null,"00:00",null,null,null,"00:00",null,null,null,"00:00",null,null,null,"00:00",null,null,null,"00:00",null,null,null,"00:00",null,null,null,"00:00",null,null,null,"00:00",null,null,null,"00:00",null,null,null,"00:00",null,null,null,"00:00",null,null,null,"00:00",null,null,null,"00:00",null,null,null,"00:00",null,null,null,"00:00",null,null,null,"00:00",null,null,null,"00:00",null,null,null,"00:00",null,null,null,"00:00",null,null,null,"00:00",null,null,null,"00:00",null,null,null,"00:00",null,null,null,"00:00",null,null,null,"00:00",null,null,null,"00:00",null,null,null,"00:00",null,null,null,"00:00",0]
[null,null,null,null,null,null,"00:00",null,null,null,"00:00",null,null,null,"00:00",null,null,null,"00:00",null,null,null,"00:00",null,null,null,"00:00",null,null,null,"00:00",null,null,null,"00:00",null,null,null,"00:00",null,null,null,"00:00",null,null,null,"00:00",null,null,null,"00:00",null,null,null,"00:00",null,null,null,"00:00",null,null,null,"00:00",null,null,null,"00:00",null,null,null,"00:00",null,null,null,"00:00",null,null,null,"00:00",null,null,null,"00:00",null,null,null,"00:00",null,null,null,"00:00",null,null,null,"00:00",null,null,null,"00:00",null,null,null,"00:00",null,null,null,"00:00",null,null,null,"00:00",null,null,null,"00:00",null,null,null,"00:00",null,null,null,"00:00",null,null,null,"00:00",0]
[null,null,null,null,null,null,"00:00",null,null,null,"00:00",null,null,null,"00:00",null,null,null,"00:00",null,null,null,"00:00",null,null,null,"00:00",null,null,null,"00:00",null,null,null,"00:00",null,null,null,"00:00",null,null,null,"00:00",null,null,null,"00:00",null,null,null,"00:00",null,null,null,"00:00",null,null,null,"00:00",null,null,null,"00:00",null,null,null,"00:00",null,null,null,"00:00",null,null,null,"00:00",null,null,null,"00:00",null,null,null,"00:00",null,null,null,"00:00",null,null,null,"00:00",null,null,null,"00:00",null,null,null,"00:00",null,null,null,"00:00",null,null,null,"00:00",null,null,null,"00:00",null,null,null,"00:00",null,null,null,"00:00",null,null,null,"00:00",null,null,null,"00:00",0]
[null,null,null,null,null,null,"00:00",null,null,null,"00:00",null,null,null,"00:00",null,null,null,"00:00",null,null,null,"00:00",null,null,null,"00:00",null,null,null,"00:00",null,null,null,"00:00",null,null,null,"00:00",null,null,null,"00:00",null,null,null,"00:00",null,null,null,"00:00",null,null,null,"00:00",null,null,null,"00:00",null,null,null,"00:00",null,null,null,"00:00",null,null,null,"00:00",null,null,null,"00:00",null,null,null,"00:00",null,null,null,"00:00",null,null,null,"00:00",null,null,null,"00:00",null,null,null,"00:00",null,null,null,"00:00",null,null,null,"00:00",null,null,null,"00:00",null,null,null,"00:00",null,null,null,"00:00",null,null,null,"00:00",null,null,null,"00:00",null,null,null,"00:00",0]
[null,null,null,null,null,null,"00:00",null,null,null,"00:00",null,null,null,"00:00",null,null,null,"00:00",null,null,null,"00:00",null,null,null,"00:00",null,null,null,"00:00",null,null,null,"00:00",null,null,null,"00:00",null,null,null,"00:00",null,null,null,"00:00",null,null,null,"00:00",null,null,null,"00:00",null,null,null,"00:00",null,null,null,"00:00",null,null,null,"00:00",null,null,null,"00:00",null,null,null,"00:00",null,null,null,"00:00",null,null,null,"00:00",null,null,null,"00:00",null,null,null,"00:00",null,null,null,"00:00",null,null,null,"00:00",null,null,null,"00:00",null,null,null,"00:00",null,null,null,"00:00",null,null,null,"00:00",null,null,null,"00:00",null,null,null,"00:00",null,null,null,"00:00",0]
[null,null,null,null,null,null,"00:00",null,null,null,"00:00",null,null,null,"00:00",null,null,null,"00:00",null,null,null,"00:00",null,null,null,"00:00",null,null,null,"00:00",null,null,null,"00:00",null,null,null,"00:00",null,null,null,"00:00",null,null,null,"00:00",null,null,null,"00:00",null,null,null,"00:00",null,null,null,"00:00",null,null,null,"00:00",null,null,null,"00:00",null,null,null,"00:00",null,null,null,"00:00",null,null,null,"00:00",null,null,null,"00:00",null,null,null,"00:00",null,null,null,"00:00",null,null,null,"00:00",null,null,null,"00:00",null,null,null,"00:00",null,null,null,"00:00",null,null,null,"00:00",null,null,null,"00:00",null,null,null,"00:00",null,null,null,"00:00",null,null,null,"00:00",0]
[null,null,null,null,null,null,"00:00",null,null,null,"00:00",null,null,null,"00:00",null,null,null,"00:00",null,null,null,"00:00",null,null,null,"00:00",null,null,null,"00:00",null,null,null,"00:00",null,null,null,"00:00",null,null,null,"00:00",null,null,null,"00:00",null,null,null,"00:00",null,null,null,"00:00",null,null,null,"00:00",null,null,null,"00:00",null,null,null,"00:00",null,null,null,"00:00",null,null,null,"00:00",null,null,null,"00:00",null,null,null,"00:00",null,null,null,"00:00",null,null,null,"00:00",null,null,null,"00:00",null,null,null,"00:00",null,null,null,"00:00",null,null,null,"00:00",null,null,null,"00:00",null,null,null,"00:00",null,null,null,"00:00",null,null,null,"00:00",null,null,null,"00:00",0]
[null,null,null,null,null,null,"00:00",null,null,null,"00:00",null,null,null,"00:00",null,null,null,"00:00",null,null,null,"00:00",null,null,null,"00:00",null,null,null,"00:00",null,null,null,"00:00",null,null,null,"00:00",null,null,null,"00:00",null,null,null,"00:00",null,null,null,"00:00",null,null,null,"00:00",null,null,null,"00:00",null,null,null,"00:00",null,null,null,"00:00",null,null,null,"00:00",null,null,null,"00:00",null,null,null,"00:00",null,null,null,"00:00",null,null,null,"00:00",null,null,null,"00:00",null,null,null,"00:00",null,null,null,"00:00",null,null,null,"00:00",null,null,null,"00:00",null,null,null,"00:00",null,null,null,"00:00",null,null,null,"00:00",null,null,null,"00:00",null,null,null,"00:00",0]
[null,null,null,null,null,null,"00:00",null,null,null,"00:00",null,null,null,"00:00",null,null,null,"00:00",null,null,null,"00:00",null,null,null,"00:00",null,null,null,"00:00",null,null,null,"00:00",null,null,null,"00:00",null,null,null,"00:00",null,null,null,"00:00",null,null,null,"00:00",null,null,null,"00:00",null,null,null,"00:00",null,null,null,"00:00",null,null,null,"00:00",null,null,null,"00:00",null,null,null,"00:00",null,null,null,"00:00",null,null,null,"00:00",null,null,null,"00:00",null,null,null,"00:00",null,null,null,"00:00",null,null,null,"00:00",null,null,null,"00:00",null,null,null,"00:00",null,null,null,"00:00",null,null,null,"00:00",null,null,null,"00:00",null,null,null,"00:00",null,null,null,"00:00",0]
[null,null,null,null,null,null,"00:00",null,null,null,"00:00",null,null,null,"00:00",null,null,null,"00:00",null,null,null,"00:00",null,null,null,"00:00",null,null,null,"00:00",null,null,null,"00:00",null,null,null,"00:00",null,null,null,"00:00",null,null,null,"00:00",null,null,null,"00:00",null,null,null,"00:00",null,null,null,"00:00",null,null,null,"00:00",null,null,null,"00:00",null,null,null,"00:00",null,null,null,"00:00",null,null,null,"00:00",null,null,null,"00:00",null,null,null,"00:00",null,null,null,"00:00",null,null,null,"00:00",null,null,null,"00:00",null,null,null,"00:00",null,null,null,"00:00",null,null,null,"00:00",null,null,null,"00:00",null,null,null,"00:00",null,null,null,"00:00",null,null,null,"00:00",0]
[null,null,null,null,null,null,"00:00",null,null,null,"00:00",null,null,null,"00:00",null,null,null,"00:00",null,null,null,"00:00",null,null,null,"00:00",null,null,null,"00:00",null,null,null,"00:00",null,null,null,"00:00",null,null,null,"00:00",null,null,null,"00:00",null,null,null,"00:00",null,null,null,"00:00",null,null,null,"00:00",null,null,null,"00:00",null,null,null,"00:00",null,null,null,"00:00",null,null,null,"00:00",null,null,null,"00:00",null,null,null,"00:00",null,null,null,"00:00",null,null,null,"00:00",null,null,null,"00:00",null,null,null,"00:00",null,null,null,"00:00",null,null,null,"00:00",null,null,null,"00:00",null,null,null,"00:00",null,null,null,"00:00",null,null,null,"00:00",null,null,null,"00:00",0]
[null,null,null,null,null,null,"00:00",null,null,null,"00:00",null,null,null,"00:00",null,null,null,"00:00",null,null,null,"00:00",null,null,null,"00:00",null,null,null,"00:00",null,null,null,"00:00",null,null,null,"00:00",null,null,null,"00:00",null,null,null,"00:00",null,null,null,"00:00",null,null,null,"00:00",null,null,null,"00:00",null,null,null,"00:00",null,null,null,"00:00",null,null,null,"00:00",null,null,null,"00:00",null,null,null,"00:00",null,null,null,"00:00",null,null,null,"00:00",null,null,null,"00:00",null,null,null,"00:00",null,null,null,"00:00",null,null,null,"00:00",null,null,null,"00:00",null,null,null,"00:00",null,null,null,"00:00",null,null,null,"00:00",null,null,null,"00:00",null,null,null,"00:00",0]
[null,null,null,null,null,null,"00:00",null,null,null,"00:00",null,null,null,"00:00",null,null,null,"00:00",null,null,null,"00:00",null,null,null,"00:00",null,null,null,"00:00",null,null,null,"00:00",null,null,null,"00:00",null,null,null,"00:00",null,null,null,"00:00",null,null,null,"00:00",null,null,null,"00:00",null,null,null,"00:00",null,null,null,"00:00",null,null,null,"00:00",null,null,null,"00:00",null,null,null,"00:00",null,null,null,"00:00",null,null,null,"00:00",null,null,null,"00:00",null,null,null,"00:00",null,null,null,"00:00",null,null,null,"00:00",null,null,null,"00:00",null,null,null,"00:00",null,null,null,"00:00",null,null,null,"00:00",null,null,null,"00:00",null,null,null,"00:00",null,null,null,"00:00",0]
[null,null,null,null,null,null,"00:00",null,null,null,"00:00",null,null,null,"00:00",null,null,null,"00:00",null,null,null,"00:00",null,null,null,"00:00",null,null,null,"00:00",null,null,null,"00:00",null,null,null,"00:00",null,null,null,"00:00",null,null,null,"00:00",null,null,null,"00:00",null,null,null,"00:00",null,null,null,"00:00",null,null,null,"00:00",null,null,null,"00:00",null,null,null,"00:00",null,null,null,"00:00",null,null,null,"00:00",null,null,null,"00:00",null,null,null,"00:00",null,null,null,"00:00",null,null,null,"00:00",null,null,null,"00:00",null,null,null,"00:00",null,null,null,"00:00",null,null,null,"00:00",null,null,null,"00:00",null,null,null,"00:00",null,null,null,"00:00",null,null,null,"00:00",0]
[null,null,null,null,null,null,"00:00",null,null,null,"00:00",null,null,null,"00:00",null,null,null,"00:00",null,null,null,"00:00",null,null,null,"00:00",null,null,null,"00:00",null,null,null,"00:00",null,null,null,"00:00",null,null,null,"00:00",null,null,null,"00:00",null,null,null,"00:00",null,null,null,"00:00",null,null,null,"00:00",null,null,null,"00:00",null,null,null,"00:00",null,null,null,"00:00",null,null,null,"00:00",null,null,null,"00:00",null,null,null,"00:00",null,null,null,"00:00",null,null,null,"00:00",null,null,null,"00:00",null,null,null,"00:00",null,null,null,"00:00",null,null,null,"00:00",null,null,null,"00:00",null,null,null,"00:00",null,null,null,"00:00",null,null,null,"00:00",null,null,null,"00:00",0]
[null,null,null,null,null,null,"00:00",null,null,null,"00:00",null,null,null,"00:00",null,null,null,"00:00",null,null,null,"00:00",null,null,null,"00:00",null,null,null,"00:00",null,null,null,"00:00",null,null,null,"00:00",null,null,null,"00:00",null,null,null,"00:00",null,null,null,"00:00",null,null,null,"00:00",null,null,null,"00:00",null,null,null,"00:00",null,null,null,"00:00",null,null,null,"00:00",null,null,null,"00:00",null,null,null,"00:00",null,null,null,"00:00",null,null,null,"00:00",null,null,null,"00:00",null,null,null,"00:00",null,null,null,"00:00",null,null,null,"00:00",null,null,null,"00:00",null,null,null,"00:00",null,null,null,"00:00",null,null,null,"00:00",null,null,null,"00:00",null,null,null,"00:00",0]
[null,null,null,null,null,null,"00:00",null,null,null,"00:00",null,null,null,"00:00",null,null,null,"00:00",null,null,null,"00:00",null,null,null,"00:00",null,null,null,"00:00",null,null,null,"00:00",null,null,null,"00:00",null,null,null,"00:00",null,null,null,"00:00",null,null,null,"00:00",null,null,null,"00:00",null,null,null,"00:00",null,null,null,"00:00",null,null,null,"00:00",null,null,null,"00:00",null,null,null,"00:00",null,null,null,"00:00",null,null,null,"00:00",null,null,null,"00:00",null,null,null,"00:00",null,null,null,"00:00",null,null,null,"00:00",null,null,null,"00:00",null,null,null,"00:00",null,null,null,"00:00",null,null,null,"00:00",null,null,null,"00:00",null,null,null,"00:00",null,null,null,"00:00",0]
[null,null,null,null,null,null,"00:00",null,null,null,"00:00",null,null,null,"00:00",null,null,null,"00:00",null,null,null,"00:00",null,null,null,"00:00",null,null,null,"00:00",null,null,null,"00:00",null,null,null,"00:00",null,null,null,"00:00",null,null,null,"00:00",null,null,null,"00:00",null,null,null,"00:00",null,null,null,"00:00",null,null,null,"00:00",null,null,null,"00:00",null,null,null,"00:00",null,null,null,"00:00",null,null,null,"00:00",null,null,null,"00:00",null,null,null,"00:00",null,null,null,"00:00",null,null,null,"00:00",null,null,null,"00:00",null,null,null,"00:00",null,null,null,"00:00",null,null,null,"00:00",null,null,null,"00:00",null,null,null,"00:00",null,null,null,"00:00",null,null,null,"00:00",0]
[null,null,null,null,null,null,"00:00",null,null,null,"00:00",null,null,null,"00:00",null,null,null,"00:00",null,null,null,"00:00",null,null,null,"00:00",null,null,null,"00:00",null,null,null,"00:00",null,null,null,"00:00",null,null,null,"00:00",null,null,null,"00:00",null,null,null,"00:00",null,null,null,"00:00",null,null,null,"00:00",null,null,null,"00:00",null,null,null,"00:00",null,null,null,"00:00",null,null,null,"00:00",null,null,null,"00:00",null,null,null,"00:00",null,null,null,"00:00",null,null,null,"00:00",null,null,null,"00:00",null,null,null,"00:00",null,null,null,"00:00",null,null,null,"00:00",null,null,null,"00:00",null,null,null,"00:00",null,null,null,"00:00",null,null,null,"00:00",null,null,null,"00:00",0]
[null,null,null,null,null,null,"00:00",null,null,null,"00:00",null,null,null,"00:00",null,null,null,"00:00",null,null,null,"00:00",null,null,null,"00:00",null,null,null,"00:00",null,null,null,"00:00",null,null,null,"00:00",null,null,null,"00:00",null,null,null,"00:00",null,null,null,"00:00",null,null,null,"00:00",null,null,null,"00:00",null,null,null,"00:00",null,null,null,"00:00",null,null,null,"00:00",null,null,null,"00:00",null,null,null,"00:00",null,null,null,"00:00",null,null,null,"00:00",null,null,null,"00:00",null,null,null,"00:00",null,null,null,"00:00",null,null,null,"00:00",null,null,null,"00:00",null,null,null,"00:00",null,null,null,"00:00",null,null,null,"00:00",null,null,null,"00:00",null,null,null,"00:00",0]
[null,null,null,null,null,null,"00:00",null,null,null,"00:00",null,null,null,"00:00",null,null,null,"00:00",null,null,null,"00:00",null,null,null,"00:00",null,null,null,"00:00",null,null,null,"00:00",null,null,null,"00:00",null,null,null,"00:00",null,null,null,"00:00",null,null,null,"00:00",null,null,null,"00:00",null,null,null,"00:00",null,null,null,"00:00",null,null,null,"00:00",null,null,null,"00:00",null,null,null,"00:00",null,null,null,"00:00",null,null,null,"00:00",null,null,null,"00:00",null,null,null,"00:00",null,null,null,"00:00",null,null,null,"00:00",null,null,null,"00:00",null,null,null,"00:00",null,null,null,"00:00",null,null,null,"00:00",null,null,null,"00:00",null,null,null,"00:00",null,null,null,"00:00",0]
[null,null,null,null,null,null,"00:00",null,null,null,"00:00",null,null,null,"00:00",null,null,null,"00:00",null,null,null,"00:00",null,null,null,"00:00",null,null,null,"00:00",null,null,null,"00:00",null,null,null,"00:00",null,null,null,"00:00",null,null,null,"00:00",null,null,null,"00:00",null,null,null,"00:00",null,null,null,"00:00",null,null,null,"00:00",null,null,null,"00:00",null,null,null,"00:00",null,null,null,"00:00",null,null,null,"00:00",null,null,null,"00:00",null,null,null,"00:00",null,null,null,"00:00",null,null,null,"00:00",null,null,null,"00:00",null,null,null,"00:00",null,null,null,"00:00",null,null,null,"00:00",null,null,null,"00:00",null,null,null,"00:00",null,null,null,"00:00",null,null,null,"00:00",0]
[null,null,null,null,null,null,{"$f":"IF(NOT(ISBLANK(E40)),(TEXT(DATE($G$2,MONTH($B$2),G$6),\"YYYY/MM/DD\")&\" \"&TEXT(D40,\"hh:mm\"))+(E40+0.5)/24,\"00:00\")","v":"00:00"},null,null,null,{"$f":"IF(NOT(ISBLANK(I40)),(TEXT(DATE($G$2,MONTH($B$2),K$6),\"YYYY/MM/DD\")&\" \"&TEXT(H40,\"hh:mm\"))+(I40+0.5)/24,\"00:00\")","v":"00:00"},null,null,null,{"$f":"IF(NOT(ISBLANK(M40)),(TEXT(DATE($G$2,MONTH($B$2),O$6),\"YYYY/MM/DD\")&\" \"&TEXT(L40,\"hh:mm\"))+(M40+0.5)/24,\"00:00\")","v":"00:00"},null,null,null,{"$f":"IF(NOT(ISBLANK(Q40)),(TEXT(DATE($G$2,MONTH($B$2),S$6),\"YYYY/MM/DD\")&\" \"&TEXT(P40,\"hh:mm\"))+(Q40+0.5)/24,\"00:00\")","v":"00:00"},null,null,null,{"$f":"IF(NOT(ISBLANK(U40)),(TEXT(DATE($G$2,MONTH($B$2),W$6),\"YYYY/MM/DD\")&\" \"&TEXT(T40,\"hh:mm\"))+(U40+0.5)/24,\"00:00\")","v":"00:00"},null,null,null,{"$f":"IF(NOT(ISBLANK(Y40)),(TEXT(DATE($G$2,MONTH($B$2),AA$6),\"YYYY/MM/DD\")&\" \"&TEXT(X40,\"hh:mm\"))+(Y40+0.5)/24,\"00:00\")","v":"00:00"},null,null,null,{"$f":"IF(NOT(ISBLANK(AC40)),(TEXT(DATE($G$2,MONTH($B$2),AE$6),\"YYYY/MM/DD\")&\" \"&TEXT(AB40,\"hh:mm\"))+(AC40+0.5)/24,\"00:00\")","v":"00:00"},null,null,null,{"$f":"IF(NOT(ISBLANK(AG40)),(TEXT(DATE($G$2,MONTH($B$2),AI$6),\"YYYY/MM/DD\")&\" \"&TEXT(AF40,\"hh:mm\"))+(AG40+0.5)/24,\"00:00\")","v":"00:00"},null,null,null,{"$f":"IF(NOT(ISBLANK(AK40)),(TEXT(DATE($G$2,MONTH($B$2),AM$6),\"YYYY/MM/DD\")&\" \"&TEXT(AJ40,\"hh:mm\"))+(AK40+0.5)/24,\"00:00\")","v":"00:00"},null,null,null,{"$f":"IF(NOT(ISBLANK(AO40)),(TEXT(DATE($G$2,MONTH($B$2),AQ$6),\"YYYY/MM/DD\")&\" \"&TEXT(AN40,\"hh:mm\"))+(AO40+0.5)/24,\"00:00\")","v":"00:00"},null,null,null,{"$f":"IF(NOT(ISBLANK(AS40)),(TEXT(DATE($G$2,MONTH($B$2),AU$6),\"YYYY/MM/DD\")&\" \"&TEXT(AR40,\"hh:mm\"))+(AS40+0.5)/24,\"00:00\")","v":"00:00"},null,null,null,{"$f":"IF(NOT(ISBLANK(AW40)),(TEXT(DATE($G$2,MONTH($B$2),AY$6),\"YYYY/MM/DD\")&\" \"&TEXT(AV40,\"hh:mm\"))+(AW40+0.5)/24,\"00:00\")","v":"00:00"},null,null,null,{"$f":"IF(NOT(ISBLANK(BA40)),(TEXT(DATE($G$2,MONTH($B$2),BC$6),\"YYYY/MM/DD\")&\" \"&TEXT(AZ40,\"hh:mm\"))+(BA40+0.5)/24,\"00:00\")","v":"00:00"},null,null,null,{"$f":"IF(NOT(ISBLANK(BE40)),(TEXT(DATE($G$2,MONTH($B$2),BG$6),\"YYYY/MM/DD\")&\" \"&TEXT(BD40,\"hh:mm\"))+(BE40+0.5)/24,\"00:00\")","v":"00:00"},null,null,null,{"$f":"IF(NOT(ISBLANK(BI40)),(TEXT(DATE($G$2,MONTH($B$2),BK$6),\"YYYY/MM/DD\")&\" \"&TEXT(BH40,\"hh:mm\"))+(BI40+0.5)/24,\"00:00\")","v":"00:00"},null,null,null,{"$f":"IF(NOT(ISBLANK(BM40)),(TEXT(DATE($G$2,MONTH($B$2),BO$6),\"YYYY/MM/DD\")&\" \"&TEXT(BL40,\"hh:mm\"))+(BM40+0.5)/24,\"00:00\")","v":"00:00"},null,null,null,{"$f":"IF(NOT(ISBLANK(BQ40)),(TEXT(DATE($G$2,MONTH($B$2),BS$6),\"YYYY/MM/DD\")&\" \"&TEXT(BP40,\"hh:mm\"))+(BQ40+0.5)/24,\"00:00\")","v":"00:00"},null,null,null,{"$f":"IF(NOT(ISBLANK(BU40)),(TEXT(DATE($G$2,MONTH($B$2),BW$6),\"YYYY/MM/DD\")&\" \"&TEXT(BT40,\"hh:mm\"))+(BU40+0.5)/24,\"00:00\")","v":"00:00"},null,null,null,{"$f":"IF(NOT(ISBLANK(BY40)),(TEXT(DATE($G$2,MONTH($B$2),CA$6),\"YYYY/MM/DD\")&\" \"&TEXT(BX40,\"hh:mm\"))+(BY40+0.5)/24,\"00:00\")","v":"00:00"},null,null,null,{"$f":"IF(NOT(ISBLANK(CC40)),(TEXT(DATE($G$2,MONTH($B$2),CE$6),\"YYYY/MM/DD\")&\" \"&TEXT(CB40,\"hh:mm\"))+(CC40+0.5)/24,\"00:00\")","v":"00:00"},null,null,null,{"$f":"IF(NOT(ISBLANK(CG40)),(TEXT(DATE($G$2,MONTH($B$2),CI$6),\"YYYY/MM/DD\")&\" \"&TEXT(CF40,\"hh:mm\"))+(CG40+0.5)/24,\"00:00\")","v":"00:00"},null,null,null,{"$f":"IF(NOT(ISBLANK(CK40)),(TEXT(DATE($G$2,MONTH($B$2),CM$6),\"YYYY/MM/DD\")&\" \"&TEXT(CJ40,\"hh:mm\"))+(CK40+0.5)/24,\"00:00\")","v":"00:00"},null,null,null,{"$f":"IF(NOT(ISBLANK(CO40)),(TEXT(DATE($G$2,MONTH($B$2),CQ$6),\"YYYY/MM/DD\")&\" \"&TEXT(CN40,\"hh:mm\"))+(CO40+0.5)/24,\"00:00\")","v":"00:00"},null,null,null,{"$f":"IF(NOT(ISBLANK(CS40)),(TEXT(DATE($G$2,MONTH($B$2),CU$6),\"YYYY/MM/DD\")&\" \"&TEXT(CR40,\"hh:mm\"))+(CS40+0.5)/24,\"00:00\")","v":"00:00"},null,null,null,{"$f":"IF(NOT(ISBLANK(CW40)),(TEXT(DATE($G$2,MONTH($B$2),CY$6),\"YYYY/MM/DD\")&\" \"&TEXT(CV40,\"hh:mm\"))+(CW40+0.5)/24,\"00:00\")","v":"00:00"},null,null,null,{"$f":"IF(NOT(ISBLANK(DA40)),(TEXT(DATE($G$2,MONTH($B$2),DC$6),\"YYYY/MM/DD\")&\" \"&TEXT(CZ40,\"hh:mm\"))+(DA40+0.5)/24,\"00:00\")","v":"00:00"},null,null,null,{"$f":"IF(NOT(ISBLANK(DE40)),(TEXT(DATE($G$2,MONTH($B$2),DG$6),\"YYYY/MM/DD\")&\" \"&TEXT(DD40,\"hh:mm\"))+(DE40+0.5)/24,\"00:00\")","v":"00:00"},null,null,null,{"$f":"IF(NOT(ISBLANK(DI40)),(TEXT(DATE($G$2,MONTH($B$2),DK$6),\"YYYY/MM/DD\")&\" \"&TEXT(DH40,\"hh:mm\"))+(DI40+0.5)/24,\"00:00\")","v":"00:00"},null,null,null,{"$f":"IF(NOT(ISBLANK(DM40)),(TEXT(DATE($G$2,MONTH($B$2),DO$6),\"YYYY/MM/DD\")&\" \"&TEXT(DL40,\"hh:mm\"))+(DM40+0.5)/24,\"00:00\")","v":"00:00"},null,null,null,{"$f":"IF(NOT(ISBLANK(DQ40)),(TEXT(DATE($G$2,MONTH($B$2),DS$6),\"YYYY/MM/DD\")&\" \"&TEXT(DP40,\"hh:mm\"))+(DQ40+0.5)/24,\"00:00\")","v":"00:00"},null,null,null,{"$f":"IF(NOT(ISBLANK(DU40)),(TEXT(DATE($G$2,MONTH($B$2),DW$6),\"YYYY/MM/DD\")&\" \"&TEXT(DT40,\"hh:mm\"))+(DU40+0.5)/24,\"00:00\")","v":"00:00"},{"$f":"SUM(E40,I40,M40,Q40,U40,Y40,AC40,AG40,AK40,AO40,AS40,AW40,BA40,BE40,BI40,BM40,BQ40,BU40,BY40,CC40,CG40,CK40,CO40,CS40,CW40,DA40,DE40,DI40,DM40,DQ40,DU40)","v":0}]
[null,null,null,null,null,null,"00:00",null,null,null,"00:00",null,null,null,"00:00",null,null,null,"00:00",null,null,null,"00:00",null,null,null,"00:00",null,null,null,"00:00",null,null,null,"00:00",null,null,null,"00:00",null,null,null,"00:00",null,null,null,"00:00",null,null,null,"00:00",null,null,null,"00:00",null,null,null,"00:00",null,null,null,"00:00",null,null,null,"00:00",null,null,null,"00:00",null,null,null,"00:00",null,null,null,"00:00",null,null,null,"00:00",null,null,null,"00:00",null,null,null,"00:00",null,null,null,"00:00",null,null,null,"00:00",null,null,null,"00:00",null,null,null,"00:00",null,null,null,"00:00",null,null,null,"00:00",null,null,null,"00:00",null,null,null,"00:00",null,null,null,"00:00",0]
[null,null,null,null,null,null,"00:00",null,null,null,"00:00",null,null,null,"00:00",null,null,null,"00:00",null,null,null,"00:00",null,null,null,"00:00",null,null,null,"00:00",null,null,null,"00:00",null,null,null,"00:00",null,null,null,"00:00",null,null,null,"00:00",null,null,null,"00:00",null,null,null,"00:00",null,null,null,"00:00",null,null,null,"00:00",null,null,null,"00:00",null,null,null,"00:00",null,null,null,"00:00",null,null,null,"00:00",null,null,null,"00:00",null,null,null,"00:00",null,null,null,"00:00",null,null,null,"00:00",null,null,null,"00:00",null,null,null,"00:00",null,null,null,"00:00",null,null,null,"00:00",null,null,null,"00:00",null,null,null,"00:00",null,null,null,"00:00",null,null,null,"00:00",0]
[null,null,null,null,null,null,"00:00",null,null,null,"00:00",null,null,null,"00:00",null,null,null,"00:00",null,null,null,"00:00",null,null,null,"00:00",null,null,null,"00:00",null,null,null,"00:00",null,null,null,"00:00",null,null,null,"00:00",null,null,null,"00:00",null,null,null,"00:00",null,null,null,"00:00",null,null,null,"00:00",null,null,null,"00:00",null,null,null,"00:00",null,null,null,"00:00",null,null,null,"00:00",null,null,null,"00:00",null,null,null,"00:00",null,null,null,"00:00",null,null,null,"00:00",null,null,null,"00:00",null,null,null,"00:00",null,null,null,"00:00",null,null,null,"00:00",null,null,null,"00:00",null,null,null,"00:00",null,null,null,"00:00",null,null,null,"00:00",null,null,null,"00:00",0]
[null,null,null,null,null,null,"00:00",null,null,null,"00:00",null,null,null,"00:00",null,null,null,"00:00",null,null,null,"00:00",null,null,null,"00:00",null,null,null,"00:00",null,null,null,"00:00",null,null,null,"00:00",null,null,null,"00:00",null,null,null,"00:00",null,null,null,"00:00",null,null,null,"00:00",null,null,null,"00:00",null,null,null,"00:00",null,null,null,"00:00",null,null,null,"00:00",null,null,null,"00:00",null,null,null,"00:00",null,null,null,"00:00",null,null,null,"00:00",null,null,null,"00:00",null,null,null,"00:00",null,null,null,"00:00",null,null,null,"00:00",null,null,null,"00:00",null,null,null,"00:00",null,null,null,"00:00",null,null,null,"00:00",null,null,null,"00:00",null,null,null,"00:00",0]
[null,null,null,null,null,null,"00:00",null,null,null,"00:00",null,null,null,"00:00",null,null,null,"00:00",null,null,null,"00:00",null,null,null,"00:00",null,null,null,"00:00",null,null,null,"00:00",null,null,null,"00:00",null,null,null,"00:00",null,null,null,"00:00",null,null,null,"00:00",null,null,null,"00:00",null,null,null,"00:00",null,null,null,"00:00",null,null,null,"00:00",null,null,null,"00:00",null,null,null,"00:00",null,null,null,"00:00",null,null,null,"00:00",null,null,null,"00:00",null,null,null,"00:00",null,null,null,"00:00",null,null,null,"00:00",null,null,null,"00:00",null,null,null,"00:00",null,null,null,"00:00",null,null,null,"00:00",null,null,null,"00:00",null,null,null,"00:00",null,null,null,"00:00",0]
[null,null,null,null,null,null,"00:00",null,null,null,"00:00",null,null,null,"00:00",null,null,null,"00:00",null,null,null,"00:00",null,null,null,"00:00",null,null,null,"00:00",null,null,null,"00:00",null,null,null,"00:00",null,null,null,"00:00",null,null,null,"00:00",null,null,null,"00:00",null,null,null,"00:00",null,null,null,"00:00",null,null,null,"00:00",null,null,null,"00:00",null,null,null,"00:00",null,null,null,"00:00",null,null,null,"00:00",null,null,null,"00:00",null,null,null,"00:00",null,null,null,"00:00",null,null,null,"00:00",null,null,null,"00:00",null,null,null,"00:00",null,null,null,"00:00",null,null,null,"00:00",null,null,null,"00:00",null,null,null,"00:00",null,null,null,"00:00",null,null,null,"00:00",0]
[null,null,null,null,null,null,"00:00",null,null,null,"00:00",null,null,null,"00:00",null,null,null,"00:00",null,null,null,"00:00",null,null,null,"00:00",null,null,null,"00:00",null,null,null,"00:00",null,null,null,"00:00",null,null,null,"00:00",null,null,null,"00:00",null,null,null,"00:00",null,null,null,"00:00",null,null,null,"00:00",null,null,null,"00:00",null,null,null,"00:00",null,null,null,"00:00",null,null,null,"00:00",null,null,null,"00:00",null,null,null,"00:00",null,null,null,"00:00",null,null,null,"00:00",null,null,null,"00:00",null,null,null,"00:00",null,null,null,"00:00",null,null,null,"00:00",null,null,null,"00:00",null,null,null,"00:00",null,null,null,"00:00",null,null,null,"00:00",null,null,null,"00:00",0]
[null,null,null,null,null,null,"00:00",null,null,null,"00:00",null,null,null,"00:00",null,null,null,"00:00",null,null,null,"00:00",null,null,null,"00:00",null,null,null,"00:00",null,null,null,"00:00",null,null,null,"00:00",null,null,null,"00:00",null,null,null,"00:00",null,null,null,"00:00",null,null,null,"00:00",null,null,null,"00:00",null,null,null,"00:00",null,null,null,"00:00",null,null,null,"00:00",null,null,null,"00:00",null,null,null,"00:00",null,null,null,"00:00",null,null,null,"00:00",null,null,null,"00:00",null,null,null,"00:00",null,null,null,"00:00",null,null,null,"00:00",null,null,null,"00:00",null,null,null,"00:00",null,null,null,"00:00",null,null,null,"00:00",null,null,null,"00:00",null,null,null,"00:00",0]
[null,null,null,null,null,null,"00:00",null,null,null,"00:00",null,null,null,"00:00",null,null,null,"00:00",null,null,null,"00:00",null,null,null,"00:00",null,null,null,"00:00",null,null,null,"00:00",null,null,null,"00:00",null,null,null,"00:00",null,null,null,"00:00",null,null,null,"00:00",null,null,null,"00:00",null,null,null,"00:00",null,null,null,"00:00",null,null,null,"00:00",null,null,null,"00:00",null,null,null,"00:00",null,null,null,"00:00",null,null,null,"00:00",null,null,null,"00:00",null,null,null,"00:00",null,null,null,"00:00",null,null,null,"00:00",null,null,null,"00:00",null,null,null,"00:00",null,null,null,"00:00",null,null,null,"00:00",null,null,null,"00:00",null,null,null,"00:00",null,null,null,"00:00",0]
[null,null,null,null,null,null,"00:00",null,null,null,"00:00",null,null,null,"00:00",null,null,null,"00:00",null,null,null,"00:00",null,null,null,"00:00",null,null,null,"00:00",null,null,null,"00:00",null,null,null,"00:00",null,null,null,"00:00",null,null,null,"00:00",null,null,null,"00:00",null,null,null,"00:00",null,null,null,"00:00",null,null,null,"00:00",null,null,null,"00:00",null,null,null,"00:00",null,null,null,"00:00",null,null,null,"00:00",null,null,null,"00:00",null,null,null,"00:00",null,null,null,"00:00",null,null,null,"00:00",null,null,null,"00:00",null,null,null,"00:00",null,null,null,"00:00",null,null,null,"00:00",null,null,null,"00:00",null,null,null,"00:00",null,null,null,"00:00",null,null,null,"00:00",0]
[null,null,null,null,null,null,"00:00",null,null,null,"00:00",null,null,null,"00:00",null,null,null,"00:00",null,null,null,"00:00",null,null,null,"00:00",null,null,null,"00:00",null,null,null,"00:00",null,null,null,"00:00",null,null,null,"00:00",null,null,null,"00:00",null,null,null,"00:00",null,null,null,"00:00",null,null,null,"00:00",null,null,null,"00:00",null,null,null,"00:00",null,null,null,"00:00",null,null,null,"00:00",null,null,null,"00:00",null,null,null,"00:00",null,null,null,"00:00",null,null,null,"00:00",null,null,null,"00:00",null,null,null,"00:00",null,null,null,"00:00",null,null,null,"00:00",null,null,null,"00:00",null,null,null,"00:00",null,null,null,"00:00",null,null,null,"00:00",null,null,null,"00:00",0]
[null,null,null,null,null,null,"00:00",null,null,null,"00:00",null,null,null,"00:00",null,null,null,"00:00",null,null,null,"00:00",null,null,null,"00:00",null,null,null,"00:00",null,null,null,"00:00",null,null,null,"00:00",null,null,null,"00:00",null,null,null,"00:00",null,null,null,"00:00",null,null,null,"00:00",null,null,null,"00:00",null,null,null,"00:00",null,null,null,"00:00",null,null,null,"00:00",null,null,null,"00:00",null,null,null,"00:00",null,null,null,"00:00",null,null,null,"00:00",null,null,null,"00:00",null,null,null,"00:00",null,null,null,"00:00",null,null,null,"00:00",null,null,null,"00:00",null,null,null,"00:00",null,null,null,"00:00",null,null,null,"00:00",null,null,null,"00:00",null,null,null,"00:00",0]
[null,null,null,null,null,null,"00:00",null,null,null,"00:00",null,null,null,"00:00",null,null,null,"00:00",null,null,null,"00:00",null,null,null,"00:00",null,null,null,"00:00",null,null,null,"00:00",null,null,null,"00:00",null,null,null,"00:00",null,null,null,"00:00",null,null,null,"00:00",null,null,null,"00:00",null,null,null,"00:00",null,null,null,"00:00",null,null,null,"00:00",null,null,null,"00:00",null,null,null,"00:00",null,null,null,"00:00",null,null,null,"00:00",null,null,null,"00:00",null,null,null,"00:00",null,null,null,"00:00",null,null,null,"00:00",null,null,null,"00:00",null,null,null,"00:00",null,null,null,"00:00",null,null,null,"00:00",null,null,null,"00:00",null,null,null,"00:00",null,null,null,"00:00",0]
[null,null,null,null,null,null,"00:00",null,null,null,"00:00",null,null,null,"00:00",null,null,null,"00:00",null,null,null,"00:00",null,null,null,"00:00",null,null,null,"00:00",null,null,null,"00:00",null,null,null,"00:00",null,null,null,"00:00",null,null,null,"00:00",null,null,null,"00:00",null,null,null,"00:00",null,null,null,"00:00",null,null,null,"00:00",null,null,null,"00:00",null,null,null,"00:00",null,null,null,"00:00",null,null,null,"00:00",null,null,null,"00:00",null,null,null,"00:00",null,null,null,"00:00",null,null,null,"00:00",null,null,null,"00:00",null,null,null,"00:00",null,null,null,"00:00",null,null,null,"00:00",null,null,null,"00:00",null,null,null,"00:00",null,null,null,"00:00",null,null,null,"00:00",0]
[null,null,null,null,null,null,"00:00",null,null,null,"00:00",null,null,null,"00:00",null,null,null,"00:00",null,null,null,"00:00",null,null,null,"00:00",null,null,null,"00:00",null,null,null,"00:00",null,null,null,"00:00",null,null,null,"00:00",null,null,null,"00:00",null,null,null,"00:00",null,null,null,"00:00",null,null,null,"00:00",null,null,null,"00:00",null,null,null,"00:00",null,null,null,"00:00",null,null,null,"00:00",null,null,null,"00:00",null,null,null,"00:00",null,null,null,"00:00",null,null,null,"00:00",null,null,null,"00:00",null,null,null,"00:00",null,null,null,"00:00",null,null,null,"00:00",null,null,null,"00:00",null,null,null,"00:00",null,null,null,"00:00",null,null,null,"00:00",null,null,null,"00:00",0]
[null,null,null,null,null,null,"00:00",null,null,null,"00:00",null,null,null,"00:00",null,null,null,"00:00",null,null,null,"00:00",null,null,null,"00:00",null,null,null,"00:00",null,null,null,"00:00",null,null,null,"00:00",null,null,null,"00:00",null,null,null,"00:00",null,null,null,"00:00",null,null,null,"00:00",null,null,null,"00:00",null,null,null,"00:00",null,null,null,"00:00",null,null,null,"00:00",null,null,null,"00:00",null,null,null,"00:00",null,null,null,"00:00",null,null,null,"00:00",null,null,null,"00:00",null,null,null,"00:00",null,null,null,"00:00",null,null,null,"00:00",null,null,null,"00:00",null,null,null,"00:00",null,null,null,"00:00",null,null,null,"00:00",null,null,null,"00:00",null,null,null,"00:00",0]
[null,null,null,null,null,null,"00:00",null,null,null,"00:00",null,null,null,"00:00",null,null,null,"00:00",null,null,null,"00:00",null,null,null,"00:00",null,null,null,"00:00",null,null,null,"00:00",null,null,null,"00:00",null,null,null,"00:00",null,null,null,"00:00",null,null,null,"00:00",null,null,null,"00:00",null,null,null,"00:00",null,null,null,"00:00",null,null,null,"00:00",null,null,null,"00:00",null,null,null,"00:00",null,null,null,"00:00",null,null,null,"00:00",null,null,null,"00:00",null,null,null,"00:00",null,null,null,"00:00",null,null,null,"00:00",null,null,null,"00:00",null,null,null,"00:00",null,null,null,"00:00",null,null,null,"00:00",null,null,null,"00:00",null,null,null,"00:00",null,null,null,"00:00",0]
[null,null,null,null,null,null,"00:00",null,null,null,"00:00",null,null,null,"00:00",null,null,null,"00:00",null,null,null,"00:00",null,null,null,"00:00",null,null,null,"00:00",null,null,null,"00:00",null,null,null,"00:00",null,null,null,"00:00",null,null,null,"00:00",null,null,null,"00:00",null,null,null,"00:00",null,null,null,"00:00",null,null,null,"00:00",null,null,null,"00:00",null,null,null,"00:00",null,null,null,"00:00",null,null,null,"00:00",null,null,null,"00:00",null,null,null,"00:00",null,null,null,"00:00",null,null,null,"00:00",null,null,null,"00:00",null,null,null,"00:00",null,null,null,"00:00",null,null,null,"00:00",null,null,null,"00:00",null,null,null,"00:00",null,null,null,"00:00",null,null,null,"00:00",0]
[null,null,null,null,null,null,"00:00",null,null,null,"00:00",null,null,null,"00:00",null,null,null,"00:00",null,null,null,"00:00",null,null,null,"00:00",null,null,null,"00:00",null,null,null,"00:00",null,null,null,"00:00",null,null,null,"00:00",null,null,null,"00:00",null,null,null,"00:00",null,null,null,"00:00",null,null,null,"00:00",null,null,null,"00:00",null,null,null,"00:00",null,null,null,"00:00",null,null,null,"00:00",null,null,null,"00:00",null,null,null,"00:00",null,null,null,"00:00",null,null,null,"00:00",null,null,null,"00:00",null,null,null,"00:00",null,null,null,"00:00",null,null,null,"00:00",null,null,null,"00:00",null,null,null,"00:00",null,null,null,"00:00",null,null,null,"00:00",null,null,null,"00:00",0]
[null,null,null,null,null,null,"00:00",null,null,null,"00:00",null,null,null,"00:00",null,null,null,"00:00",null,null,null,"00:00",null,null,null,"00:00",null,null,null,"00:00",null,null,null,"00:00",null,null,null,"00:00",null,null,null,"00:00",null,null,null,"00:00",null,null,null,"00:00",null,null,null,"00:00",null,null,null,"00:00",null,null,null,"00:00",null,null,null,"00:00",null,null,null,"00:00",null,null,null,"00:00",null,null,null,"00:00",null,null,null,"00:00",null,null,null,"00:00",null,null,null,"00:00",null,null,null,"00:00",null,null,null,"00:00",null,null,null,"00:00",null,null,null,"00:00",null,null,null,"00:00",null,null,null,"00:00",null,null,null,"00:00",null,null,null,"00:00",null,null,null,"00:00",0]
[null,null,null,null,null,null,"00:00",null,null,null,"00:00",null,null,null,"00:00",null,null,null,"00:00",null,null,null,"00:00",null,null,null,"00:00",null,null,null,"00:00",null,null,null,"00:00",null,null,null,"00:00",null,null,null,"00:00",null,null,null,"00:00",null,null,null,"00:00",null,null,null,"00:00",null,null,null,"00:00",null,null,null,"00:00",null,null,null,"00:00",null,null,null,"00:00",null,null,null,"00:00",null,null,null,"00:00",null,null,null,"00:00",null,null,null,"00:00",null,null,null,"00:00",null,null,null,"00:00",null,null,null,"00:00",null,null,null,"00:00",null,null,null,"00:00",null,null,null,"00:00",null,null,null,"00:00",null,null,null,"00:00",null,null,null,"00:00",null,null,null,"00:00",0]
[null,null,null,null,null,null,"00:00",null,null,null,"00:00",null,null,null,"00:00",null,null,null,"00:00",null,null,null,"00:00",null,null,null,"00:00",null,null,null,"00:00",null,null,null,"00:00",null,null,null,"00:00",null,null,null,"00:00",null,null,null,"00:00",null,null,null,"00:00",null,null,null,"00:00",null,null,null,"00:00",null,null,null,"00:00",null,null,null,"00:00",null,null,null,"00:00",null,null,null,"00:00",null,null,null,"00:00",null,null,null,"00:00",null,null,null,"00:00",null,null,null,"00:00",null,null,null,"00:00",null,null,null,"00:00",null,null,null,"00:00",null,null,null,"00:00",null,null,null,"00:00",null,null,null,"00:00",null,null,null,"00:00",null,null,null,"00:00",null,null,null,"00:00",0]
[null,null,null,null,null,null,"00:00",null,null,null,"00:00",null,null,null,"00:00",null,null,null,"00:00",null,null,null,"00:00",null,null,null,"00:00",null,null,null,"00:00",null,null,null,"00:00",null,null,null,"00:00",null,null,null,"00:00",null,null,null,"00:00",null,null,null,"00:00",null,null,null,"00:00",null,null,null,"00:00",null,null,null,"00:00",null,null,null,"00:00",null,null,null,"00:00",null,null,null,"00:00",null,null,null,"00:00",null,null,null,"00:00",null,null,null,"00:00",null,null,null,"00:00",null,null,null,"00:00",null,null,null,"00:00",null,null,null,"00:00",null,null,null,"00:00",null,null,null,"00:00",null,null,null,"00:00",null,null,null,"00:00",null,null,null,"00:00",null,null,null,"00:00",0]
[null,null,null,null,null,null,"00:00",null,null,null,"00:00",null,null,null,"00:00",null,null,null,"00:00",null,null,null,"00:00",null,null,null,"00:00",null,null,null,"00:00",null,null,null,"00:00",null,null,null,"00:00",null,null,null,"00:00",null,null,null,"00:00",null,null,null,"00:00",null,null,null,"00:00",null,null,null,"00:00",null,null,null,"00:00",null,null,null,"00:00",null,null,null,"00:00",null,null,null,"00:00",null,null,null,"00:00",null,null,null,"00:00",null,null,null,"00:00",null,null,null,"00:00",null,null,null,"00:00",null,null,null,"00:00",null,null,null,"00:00",null,null,null,"00:00",null,null,null,"00:00",null,null,null,"00:00",null,null,null,"00:00",null,null,null,"00:00",null,null,null,"00:00",0]
[null,null,null,null,null,null,"00:00",null,null,null,"00:00",null,null,null,"00:00",null,null,null,"00:00",null,null,null,"00:00",null,null,null,"00:00",null,null,null,"00:00",null,null,null,"00:00",null,null,null,"00:00",null,null,null,"00:00",null,null,null,"00:00",null,null,null,"00:00",null,null,null,"00:00",null,null,null,"00:00",null,null,null,"00:00",null,null,null,"00:00",null,null,null,"00:00",null,null,null,"00:00",null,null,null,"00:00",null,null,null,"00:00",null,null,null,"00:00",null,null,null,"00:00",null,null,null,"00:00",null,null,null,"00:00",null,null,null,"00:00",null,null,null,"00:00",null,null,null,"00:00",null,null,null,"00:00",null,null,null,"00:00",null,null,null,"00:00",null,null,null,"00:00",0]
[null,null,null,null,null,null,"00:00",null,null,null,"00:00",null,null,null,"00:00",null,null,null,"00:00",null,null,null,"00:00",null,null,null,"00:00",null,null,null,"00:00",null,null,null,"00:00",null,null,null,"00:00",null,null,null,"00:00",null,null,null,"00:00",null,null,null,"00:00",null,null,null,"00:00",null,null,null,"00:00",null,null,null,"00:00",null,null,null,"00:00",null,null,null,"00:00",null,null,null,"00:00",null,null,null,"00:00",null,null,null,"00:00",null,null,null,"00:00",null,null,null,"00:00",null,null,null,"00:00",null,null,null,"00:00",null,null,null,"00:00",null,null,null,"00:00",null,null,null,"00:00",null,null,null,"00:00",null,null,null,"00:00",null,null,null,"00:00",null,null,null,"00:00",0]
[null,null,null,null,null,null,"00:00",null,null,null,"00:00",null,null,null,"00:00",null,null,null,"00:00",null,null,null,"00:00",null,null,null,"00:00",null,null,null,"00:00",null,null,null,"00:00",null,null,null,"00:00",null,null,null,"00:00",null,null,null,"00:00",null,null,null,"00:00",null,null,null,"00:00",null,null,null,"00:00",null,null,null,"00:00",null,null,null,"00:00",null,null,null,"00:00",null,null,null,"00:00",null,null,null,"00:00",null,null,null,"00:00",null,null,null,"00:00",null,null,null,"00:00",null,null,null,"00:00",null,null,null,"00:00",null,null,null,"00:00",null,null,null,"00:00",null,null,null,"00:00",null,null,null,"00:00",null,null,null,"00:00",null,null,null,"00:00",null,null,null,"00:00",0]
[null,null,null,null,null,null,"00:00",null,null,null,"00:00",null,null,null,"00:00",null,null,null,"00:00",null,null,null,"00:00",null,null,null,"00:00",null,null,null,"00:00",null,null,null,"00:00",null,null,null,"00:00",null,null,null,"00:00",null,null,null,"00:00",null,null,null,"00:00",null,null,null,"00:00",null,null,null,"00:00",null,null,null,"00:00",null,null,null,"00:00",null,null,null,"00:00",null,null,null,"00:00",null,null,null,"00:00",null,null,null,"00:00",null,null,null,"00:00",null,null,null,"00:00",null,null,null,"00:00",null,null,null,"00:00",null,null,null,"00:00",null,null,null,"00:00",null,null,null,"00:00",null,null,null,"00:00",null,null,null,"00:00",null,null,null,"00:00",null,null,null,"00:00",0]
[null,null,null,null,null,null,"00:00",null,null,null,"00:00",null,null,null,"00:00",null,null,null,"00:00",null,null,null,"00:00",null,null,null,"00:00",null,null,null,"00:00",null,null,null,"00:00",null,null,null,"00:00",null,null,null,"00:00",null,null,null,"00:00",null,null,null,"00:00",null,null,null,"00:00",null,null,null,"00:00",null,null,null,"00:00",null,null,null,"00:00",null,null,null,"00:00",null,null,null,"00:00",null,null,null,"00:00",null,null,null,"00:00",null,null,null,"00:00",null,null,null,"00:00",null,null,null,"00:00",null,null,null,"00:00",null,null,null,"00:00",null,null,null,"00:00",null,null,null,"00:00",null,null,null,"00:00",null,null,null,"00:00",null,null,null,"00:00",null,null,null,"00:00",0]
[null,null,null,null,null,null,"00:00",null,null,null,"00:00",null,null,null,"00:00",null,null,null,"00:00",null,null,null,"00:00",null,null,null,"00:00",null,null,null,"00:00",null,null,null,"00:00",null,null,null,"00:00",null,null,null,"00:00",null,null,null,"00:00",null,null,null,"00:00",null,null,null,"00:00",null,null,null,"00:00",null,null,null,"00:00",null,null,null,"00:00",null,null,null,"00:00",null,null,null,"00:00",null,null,null,"00:00",null,null,null,"00:00",null,null,null,"00:00",null,null,null,"00:00",null,null,null,"00:00",null,null,null,"00:00",null,null,null,"00:00",null,null,null,"00:00",null,null,null,"00:00",null,null,null,"00:00",null,null,null,"00:00",null,null,null,"00:00",null,null,null,"00:00",0]
[null,null,null,null,null,null,"00:00",null,null,null,"00:00",null,null,null,"00:00",null,null,null,"00:00",null,null,null,"00:00",null,null,null,"00:00",null,null,null,"00:00",null,null,null,"00:00",null,null,null,"00:00",null,null,null,"00:00",null,null,null,"00:00",null,null,null,"00:00",null,null,null,"00:00",null,null,null,"00:00",null,null,null,"00:00",null,null,null,"00:00",null,null,null,"00:00",null,null,null,"00:00",null,null,null,"00:00",null,null,null,"00:00",null,null,null,"00:00",null,null,null,"00:00",null,null,null,"00:00",null,null,null,"00:00",null,null,null,"00:00",null,null,null,"00:00",null,null,null,"00:00",null,null,null,"00:00",null,null,null,"00:00",null,null,null,"00:00",null,null,null,"00:00",0]
[null,null,null,null,null,null,{"$f":"IF(NOT(ISBLANK(E72)),(TEXT(DATE($G$2,MONTH($B$2),G$6),\"YYYY/MM/DD\")&\" \"&TEXT(D72,\"hh:mm\"))+(E72+0.5)/24,\"00:00\")","v":"00:00"},null,null,null,{"$f":"IF(NOT(ISBLANK(I72)),(TEXT(DATE($G$2,MONTH($B$2),K$6),\"YYYY/MM/DD\")&\" \"&TEXT(H72,\"hh:mm\"))+(I72+0.5)/24,\"00:00\")","v":"00:00"},null,null,null,{"$f":"IF(NOT(ISBLANK(M72)),(TEXT(DATE($G$2,MONTH($B$2),O$6),\"YYYY/MM/DD\")&\" \"&TEXT(L72,\"hh:mm\"))+(M72+0.5)/24,\"00:00\")","v":"00:00"},null,null,null,{"$f":"IF(NOT(ISBLANK(Q72)),(TEXT(DATE($G$2,MONTH($B$2),S$6),\"YYYY/MM/DD\")&\" \"&TEXT(P72,\"hh:mm\"))+(Q72+0.5)/24,\"00:00\")","v":"00:00"},null,null,null,{"$f":"IF(NOT(ISBLANK(U72)),(TEXT(DATE($G$2,MONTH($B$2),W$6),\"YYYY/MM/DD\")&\" \"&TEXT(T72,\"hh:mm\"))+(U72+0.5)/24,\"00:00\")","v":"00:00"},null,null,null,{"$f":"IF(NOT(ISBLANK(Y72)),(TEXT(DATE($G$2,MONTH($B$2),AA$6),\"YYYY/MM/DD\")&\" \"&TEXT(X72,\"hh:mm\"))+(Y72+0.5)/24,\"00:00\")","v":"00:00"},null,null,null,{"$f":"IF(NOT(ISBLANK(AC72)),(TEXT(DATE($G$2,MONTH($B$2),AE$6),\"YYYY/MM/DD\")&\" \"&TEXT(AB72,\"hh:mm\"))+(AC72+0.5)/24,\"00:00\")","v":"00:00"},null,null,null,{"$f":"IF(NOT(ISBLANK(AG72)),(TEXT(DATE($G$2,MONTH($B$2),AI$6),\"YYYY/MM/DD\")&\" \"&TEXT(AF72,\"hh:mm\"))+(AG72+0.5)/24,\"00:00\")","v":"00:00"},null,null,null,{"$f":"IF(NOT(ISBLANK(AK72)),(TEXT(DATE($G$2,MONTH($B$2),AM$6),\"YYYY/MM/DD\")&\" \"&TEXT(AJ72,\"hh:mm\"))+(AK72+0.5)/24,\"00:00\")","v":"00:00"},null,null,null,{"$f":"IF(NOT(ISBLANK(AO72)),(TEXT(DATE($G$2,MONTH($B$2),AQ$6),\"YYYY/MM/DD\")&\" \"&TEXT(AN72,\"hh:mm\"))+(AO72+0.5)/24,\"00:00\")","v":"00:00"},null,null,null,{"$f":"IF(NOT(ISBLANK(AS72)),(TEXT(DATE($G$2,MONTH($B$2),AU$6),\"YYYY/MM/DD\")&\" \"&TEXT(AR72,\"hh:mm\"))+(AS72+0.5)/24,\"00:00\")","v":"00:00"},null,null,null,{"$f":"IF(NOT(ISBLANK(AW72)),(TEXT(DATE($G$2,MONTH($B$2),AY$6),\"YYYY/MM/DD\")&\" \"&TEXT(AV72,\"hh:mm\"))+(AW72+0.5)/24,\"00:00\")","v":"00:00"},null,null,null,{"$f":"IF(NOT(ISBLANK(BA72)),(TEXT(DATE($G$2,MONTH($B$2),BC$6),\"YYYY/MM/DD\")&\" \"&TEXT(AZ72,\"hh:mm\"))+(BA72+0.5)/24,\"00:00\")","v":"00:00"},null,null,null,{"$f":"IF(NOT(ISBLANK(BE72)),(TEXT(DATE($G$2,MONTH($B$2),BG$6),\"YYYY/MM/DD\")&\" \"&TEXT(BD72,\"hh:mm\"))+(BE72+0.5)/24,\"00:00\")","v":"00:00"},null,null,null,{"$f":"IF(NOT(ISBLANK(BI72)),(TEXT(DATE($G$2,MONTH($B$2),BK$6),\"YYYY/MM/DD\")&\" \"&TEXT(BH72,\"hh:mm\"))+(BI72+0.5)/24,\"00:00\")","v":"00:00"},null,null,null,{"$f":"IF(NOT(ISBLANK(BM72)),(TEXT(DATE($G$2,MONTH($B$2),BO$6),\"YYYY/MM/DD\")&\" \"&TEXT(BL72,\"hh:mm\"))+(BM72+0.5)/24,\"00:00\")","v":"00:00"},null,null,null,{"$f":"IF(NOT(ISBLANK(BQ72)),(TEXT(DATE($G$2,MONTH($B$2),BS$6),\"YYYY/MM/DD\")&\" \"&TEXT(BP72,\"hh:mm\"))+(BQ72+0.5)/24,\"00:00\")","v":"00:00"},null,null,null,{"$f":"IF(NOT(ISBLANK(BU72)),(TEXT(DATE($G$2,MONTH($B$2),BW$6),\"YYYY/MM/DD\")&\" \"&TEXT(BT72,\"hh:mm\"))+(BU72+0.5)/24,\"00:00\")","v":"00:00"},null,null,null,{"$f":"IF(NOT(ISBLANK(BY72)),(TEXT(DATE($G$2,MONTH($B$2),CA$6),\"YYYY/MM/DD\")&\" \"&TEXT(BX72,\"hh:mm\"))+(BY72+0.5)/24,\"00:00\")","v":"00:00"},null,null,null,{"$f":"IF(NOT(ISBLANK(CC72)),(TEXT(DATE($G$2,MONTH($B$2),CE$6),\"YYYY/MM/DD\")&\" \"&TEXT(CB72,\"hh:mm\"))+(CC72+0.5)/24,\"00:00\")","v":"00:00"},null,null,null,{"$f":"IF(NOT(ISBLANK(CG72)),(TEXT(DATE($G$2,MONTH($B$2),CI$6),\"YYYY/MM/DD\")&\" \"&TEXT(CF72,\"hh:mm\"))+(CG72+0.5)/24,\"00:00\")","v":"00:00"},null,null,null,{"$f":"IF(NOT(ISBLANK(CK72)),(TEXT(DATE($G$2,MONTH($B$2),CM$6),\"YYYY/MM/DD\")&\" \"&TEXT(CJ72,\"hh:mm\"))+(CK72+0.5)/24,\"00:00\")","v":"00:00"},null,null,null,{"$f":"IF(NOT(ISBLANK(CO72)),(TEXT(DATE($G$2,MONTH($B$2),CQ$6),\"YYYY/MM/DD\")&\" \"&TEXT(CN72,\"hh:mm\"))+(CO72+0.5)/24,\"00:00\")","v":"00:00"},null,null,null,{"$f":"IF(NOT(ISBLANK(CS72)),(TEXT(DATE($G$2,MONTH($B$2),CU$6),\"YYYY/MM/DD\")&\" \"&TEXT(CR72,\"hh:mm\"))+(CS72+0.5)/24,\"00:00\")","v":"00:00"},null,null,null,{"$f":"IF(NOT(ISBLANK(CW72)),(TEXT(DATE($G$2,MONTH($B$2),CY$6),\"YYYY/MM/DD\")&\" \"&TEXT(CV72,\"hh:mm\"))+(CW72+0.5)/24,\"00:00\")","v":"00:00"},null,null,null,{"$f":"IF(NOT(ISBLANK(DA72)),(TEXT(DATE($G$2,MONTH($B$2),DC$6),\"YYYY/MM/DD\")&\" \"&TEXT(CZ72,\"hh:mm\"))+(DA72+0.5)/24,\"00:00\")","v":"00:00"},null,null,null,{"$f":"IF(NOT(ISBLANK(DE72)),(TEXT(DATE($G$2,MONTH($B$2),DG$6),\"YYYY/MM/DD\")&\" \"&TEXT(DD72,\"hh:mm\"))+(DE72+0.5)/24,\"00:00\")","v":"00:00"},null,null,null,{"$f":"IF(NOT(ISBLANK(DI72)),(TEXT(DATE($G$2,MONTH($B$2),DK$6),\"YYYY/MM/DD\")&\" \"&TEXT(DH72,\"hh:mm\"))+(DI72+0.5)/24,\"00:00\")","v":"00:00"},null,null,null,{"$f":"IF(NOT(ISBLANK(DM72)),(TEXT(DATE($G$2,MONTH($B$2),DO$6),\"YYYY/MM/DD\")&\" \"&TEXT(DL72,\"hh:mm\"))+(DM72+0.5)/24,\"00:00\")","v":"00:00"},null,null,null,{"$f":"IF(NOT(ISBLANK(DQ72)),(TEXT(DATE($G$2,MONTH($B$2),DS$6),\"YYYY/MM/DD\")&\" \"&TEXT(DP72,\"hh:mm\"))+(DQ72+0.5)/24,\"00:00\")","v":"00:00"},null,null,null,{"$f":"IF(NOT(ISBLANK(DU72)),(TEXT(DATE($G$2,MONTH($B$2),DW$6),\"YYYY/MM/DD\")&\" \"&TEXT(DT72,\"hh:mm\"))+(DU72+0.5)/24,\"00:00\")","v":"00:00"},{"$f":"SUM(E72,I72,M72,Q72,U72,Y72,AC72,AG72,AK72,AO72,AS72,AW72,BA72,BE72,BI72,BM72,BQ72,BU72,BY72,CC72,CG72,CK72,CO72,CS72,CW72,DA72,DE72,DI72,DM72,DQ72,DU72)","v":0}]
[null,null,null,null,null,null,"00:00",null,null,null,"00:00",null,null,null,"00:00",null,null,null,"00:00",null,null,null,"00:00",null,null,null,"00:00",null,null,null,"00:00",null,null,null,"00:00",null,null,null,"00:00",null,null,null,"00:00",null,null,null,"00:00",null,null,null,"00:00",null,null,null,"00:00",null,null,null,"00:00",null,null,null,"00:00",null,null,null,"00:00",null,null,null,"00:00",null,null,null,"00:00",null,null,null,"00:00",null,null,null,"00:00",null,null,null,"00:00",null,null,null,"00:00",null,null,null,"00:00",null,null,null,"00:00",null,null,null,"00:00",null,null,null,"00:00",null,null,null,"00:00",null,null,null,"00:00",null,null,null,"00:00",null,null,null,"00:00",null,null,null,"00:00",0]
[null,null,null,null,null,null,"00:00",null,null,null,"00:00",null,null,null,"00:00",null,null,null,"00:00",null,null,null,"00:00",null,null,null,"00:00",null,null,null,"00:00",null,null,null,"00:00",null,null,null,"00:00",null,null,null,"00:00",null,null,null,"00:00",null,null,null,"00:00",null,null,null,"00:00",null,null,null,"00:00",null,null,null,"00:00",null,null,null,"00:00",null,null,null,"00:00",null,null,null,"00:00",null,null,null,"00:00",null,null,null,"00:00",null,null,null,"00:00",null,null,null,"00:00",null,null,null,"00:00",null,null,null,"00:00",null,null,null,"00:00",null,null,null,"00:00",null,null,null,"00:00",null,null,null,"00:00",null,null,null,"00:00",null,null,null,"00:00",null,null,null,"00:00",0]
[null,null,null,null,null,null,"00:00",null,null,null,"00:00",null,null,null,"00:00",null,null,null,"00:00",null,null,null,"00:00",null,null,null,"00:00",null,null,null,"00:00",null,null,null,"00:00",null,null,null,"00:00",null,null,null,"00:00",null,null,null,"00:00",null,null,null,"00:00",null,null,null,"00:00",null,null,null,"00:00",null,null,null,"00:00",null,null,null,"00:00",null,null,null,"00:00",null,null,null,"00:00",null,null,null,"00:00",null,null,null,"00:00",null,null,null,"00:00",null,null,null,"00:00",null,null,null,"00:00",null,null,null,"00:00",null,null,null,"00:00",null,null,null,"00:00",null,null,null,"00:00",null,null,null,"00:00",null,null,null,"00:00",null,null,null,"00:00",null,null,null,"00:00",0]
[null,null,null,null,null,null,"00:00",null,null,null,"00:00",null,null,null,"00:00",null,null,null,"00:00",null,null,null,"00:00",null,null,null,"00:00",null,null,null,"00:00",null,null,null,"00:00",null,null,null,"00:00",null,null,null,"00:00",null,null,null,"00:00",null,null,null,"00:00",null,null,null,"00:00",null,null,null,"00:00",null,null,null,"00:00",null,null,null,"00:00",null,null,null,"00:00",null,null,null,"00:00",null,null,null,"00:00",null,null,null,"00:00",null,null,null,"00:00",null,null,null,"00:00",null,null,null,"00:00",null,null,null,"00:00",null,null,null,"00:00",null,null,null,"00:00",null,null,null,"00:00",null,null,null,"00:00",null,null,null,"00:00",null,null,null,"00:00",null,null,null,"00:00",0]
[null,null,null,null,null,null,"00:00",null,null,null,"00:00",null,null,null,"00:00",null,null,null,"00:00",null,null,null,"00:00",null,null,null,"00:00",null,null,null,"00:00",null,null,null,"00:00",null,null,null,"00:00",null,null,null,"00:00",null,null,null,"00:00",null,null,null,"00:00",null,null,null,"00:00",null,null,null,"00:00",null,null,null,"00:00",null,null,null,"00:00",null,null,null,"00:00",null,null,null,"00:00",null,null,null,"00:00",null,null,null,"00:00",null,null,null,"00:00",null,null,null,"00:00",null,null,null,"00:00",null,null,null,"00:00",null,null,null,"00:00",null,null,null,"00:00",null,null,null,"00:00",null,null,null,"00:00",null,null,null,"00:00",null,null,null,"00:00",null,null,null,"00:00",0]
[null,null,null,null,null,null,"00:00",null,null,null,"00:00",null,null,null,"00:00",null,null,null,"00:00",null,null,null,"00:00",null,null,null,"00:00",null,null,null,"00:00",null,null,null,"00:00",null,null,null,"00:00",null,null,null,"00:00",null,null,null,"00:00",null,null,null,"00:00",null,null,null,"00:00",null,null,null,"00:00",null,null,null,"00:00",null,null,null,"00:00",null,null,null,"00:00",null,null,null,"00:00",null,null,null,"00:00",null,null,null,"00:00",null,null,null,"00:00",null,null,null,"00:00",null,null,null,"00:00",null,null,null,"00:00",null,null,null,"00:00",null,null,null,"00:00",null,null,null,"00:00",null,null,null,"00:00",null,null,null,"00:00",null,null,null,"00:00",null,null,null,"00:00",0]
[null,null,null,null,null,null,"00:00",null,null,null,"00:00",null,null,null,"00:00",null,null,null,"00:00",null,null,null,"00:00",null,null,null,"00:00",null,null,null,"00:00",null,null,null,"00:00",null,null,null,"00:00",null,null,null,"00:00",null,null,null,"00:00",null,null,null,"00:00",null,null,null,"00:00",null,null,null,"00:00",null,null,null,"00:00",null,null,null,"00:00",null,null,null,"00:00",null,null,null,"00:00",null,null,null,"00:00",null,null,null,"00:00",null,null,null,"00:00",null,null,null,"00:00",null,null,null,"00:00",null,null,null,"00:00",null,null,null,"00:00",null,null,null,"00:00",null,null,null,"00:00",null,null,null,"00:00",null,null,null,"00:00",null,null,null,"00:00",null,null,null,"00:00",0]
[null,null,null,null,null,null,"00:00",null,null,null,"00:00",null,null,null,"00:00",null,null,null,"00:00",null,null,null,"00:00",null,null,null,"00:00",null,null,null,"00:00",null,null,null,"00:00",null,null,null,"00:00",null,null,null,"00:00",null,null,null,"00:00",null,null,null,"00:00",null,null,null,"00:00",null,null,null,"00:00",null,null,null,"00:00",null,null,null,"00:00",null,null,null,"00:00",null,null,null,"00:00",null,null,null,"00:00",null,null,null,"00:00",null,null,null,"00:00",null,null,null,"00:00",null,null,null,"00:00",null,null,null,"00:00",null,null,null,"00:00",null,null,null,"00:00",null,null,null,"00:00",null,null,null,"00:00",null,null,null,"00:00",null,null,null,"00:00",null,null,null,"00:00",0]
[null,null,null,null,null,null,"00:00",null,null,null,"00:00",null,null,null,"00:00",null,null,null,"00:00",null,null,null,"00:00",null,null,null,"00:00",null,null,null,"00:00",null,null,null,"00:00",null,null,null,"00:00",null,null,null,"00:00",null,null,null,"00:00",null,null,null,"00:00",null,null,null,"00:00",null,null,null,"00:00",null,null,null,"00:00",null,null,null,"00:00",null,null,null,"00:00",null,null,null,"00:00",null,null,null,"00:00",null,null,null,"00:00",null,null,null,"00:00",null,null,null,"00:00",null,null,null,"00:00",null,null,null,"00:00",null,null,null,"00:00",null,null,null,"00:00",null,null,null,"00:00",null,null,null,"00:00",null,null,null,"00:00",null,null,null,"00:00",null,null,null,"00:00",0]
[null,null,null,null,null,null,"00:00",null,null,null,"00:00",null,null,null,"00:00",null,null,null,"00:00",null,null,null,"00:00",null,null,null,"00:00",null,null,null,"00:00",null,null,null,"00:00",null,null,null,"00:00",null,null,null,"00:00",null,null,null,"00:00",null,null,null,"00:00",null,null,null,"00:00",null,null,null,"00:00",null,null,null,"00:00",null,null,null,"00:00",null,null,null,"00:00",null,null,null,"00:00",null,null,null,"00:00",null,null,null,"00:00",null,null,null,"00:00",null,null,null,"00:00",null,null,null,"00:00",null,null,null,"00:00",null,null,null,"00:00",null,null,null,"00:00",null,null,null,"00:00",null,null,null,"00:00",null,null,null,"00:00",null,null,null,"00:00",null,null,null,"00:00",0]
[null,null,null,null,null,null,"00:00",null,null,null,"00:00",null,null,null,"00:00",null,null,null,"00:00",null,null,null,"00:00",null,null,null,"00:00",null,null,null,"00:00",null,null,null,"00:00",null,null,null,"00:00",null,null,null,"00:00",null,null,null,"00:00",null,null,null,"00:00",null,null,null,"00:00",null,null,null,"00:00",null,null,null,"00:00",null,null,null,"00:00",null,null,null,"00:00",null,null,null,"00:00",null,null,null,"00:00",null,null,null,"00:00",null,null,null,"00:00",null,null,null,"00:00",null,null,null,"00:00",null,null,null,"00:00",null,null,null,"00:00",null,null,null,"00:00",null,null,null,"00:00",null,null,null,"00:00",null,null,null,"00:00",null,null,null,"00:00",null,null,null,"00:00",0]
[null,null,null,null,null,null,"00:00",null,null,null,"00:00",null,null,null,"00:00",null,null,null,"00:00",null,null,null,"00:00",null,null,null,"00:00",null,null,null,"00:00",null,null,null,"00:00",null,null,null,"00:00",null,null,null,"00:00",null,null,null,"00:00",null,null,null,"00:00",null,null,null,"00:00",null,null,null,"00:00",null,null,null,"00:00",null,null,null,"00:00",null,null,null,"00:00",null,null,null,"00:00",null,null,null,"00:00",null,null,null,"00:00",null,null,null,"00:00",null,null,null,"00:00",null,null,null,"00:00",null,null,null,"00:00",null,null,null,"00:00",null,null,null,"00:00",null,null,null,"00:00",null,null,null,"00:00",null,null,null,"00:00",null,null,null,"00:00",null,null,null,"00:00",0]
[null,null,null,null,null,null,"00:00",null,null,null,"00:00",null,null,null,"00:00",null,null,null,"00:00",null,null,null,"00:00",null,null,null,"00:00",null,null,null,"00:00",null,null,null,"00:00",null,null,null,"00:00",null,null,null,"00:00",null,null,null,"00:00",null,null,null,"00:00",null,null,null,"00:00",null,null,null,"00:00",null,null,null,"00:00",null,null,null,"00:00",null,null,null,"00:00",null,null,null,"00:00",null,null,null,"00:00",null,null,null,"00:00",null,null,null,"00:00",null,null,null,"00:00",null,null,null,"00:00",null,null,null,"00:00",null,null,null,"00:00",null,null,null,"00:00",null,null,null,"00:00",null,null,null,"00:00",null,null,null,"00:00",null,null,null,"00:00",null,null,null,"00:00",0]
[null,null,null,null,null,null,"00:00",null,null,null,"00:00",null,null,null,"00:00",null,null,null,"00:00",null,null,null,"00:00",null,null,null,"00:00",null,null,null,"00:00",null,null,null,"00:00",null,null,null,"00:00",null,null,null,"00:00",null,null,null,"00:00",null,null,null,"00:00",null,null,null,"00:00",null,null,null,"00:00",null,null,null,"00:00",null,null,null,"00:00",null,null,null,"00:00",null,null,null,"00:00",null,null,null,"00:00",null,null,null,"00:00",null,null,null,"00:00",null,null,null,"00:00",null,null,null,"00:00",null,null,null,"00:00",null,null,null,"00:00",null,null,null,"00:00",null,null,null,"00:00",null,null,null,"00:00",null,null,null,"00:00",null,null,null,"00:00",null,null,null,"00:00",0]
[null,null,null,null,null,null,"00:00",null,null,null,"00:00",null,null,null,"00:00",null,null,null,"00:00",null,null,null,"00:00",null,null,null,"00:00",null,null,null,"00:00",null,null,null,"00:00",null,null,null,"00:00",null,null,null,"00:00",null,null,null,"00:00",null,null,null,"00:00",null,null,null,"00:00",null,null,null,"00:00",null,null,null,"00:00",null,null,null,"00:00",null,null,null,"00:00",null,null,null,"00:00",null,null,null,"00:00",null,null,null,"00:00",null,null,null,"00:00",null,null,null,"00:00",null,null,null,"00:00",null,null,null,"00:00",null,null,null,"00:00",null,null,null,"00:00",null,null,null,"00:00",null,null,null,"00:00",null,null,null,"00:00",null,null,null,"00:00",null,null,null,"00:00",0]
[null,null,null,null,null,null,"00:00",null,null,null,"00:00",null,null,null,"00:00",null,null,null,"00:00",null,null,null,"00:00",null,null,null,"00:00",null,null,null,"00:00",null,null,null,"00:00",null,null,null,"00:00",null,null,null,"00:00",null,null,null,"00:00",null,null,null,"00:00",null,null,null,"00:00",null,null,null,"00:00",null,null,null,"00:00",null,null,null,"00:00",null,null,null,"00:00",null,null,null,"00:00",null,null,null,"00:00",null,null,null,"00:00",null,null,null,"00:00",null,null,null,"00:00",null,null,null,"00:00",null,null,null,"00:00",null,null,null,"00:00",null,null,null,"00:00",null,null,null,"00:00",null,null,null,"00:00",null,null,null,"00:00",null,null,null,"00:00",null,null,null,"00:00",0]
[null,null,null,null,null,null,"00:00",null,null,null,"00:00",null,null,null,"00:00",null,null,null,"00:00",null,null,null,"00:00",null,null,null,"00:00",null,null,null,"00:00",null,null,null,"00:00",null,null,null,"00:00",null,null,null,"00:00",null,null,null,"00:00",null,null,null,"00:00",null,null,null,"00:00",null,null,null,"00:00",null,null,null,"00:00",null,null,null,"00:00",null,null,null,"00:00",null,null,null,"00:00",null,null,null,"00:00",null,null,null,"00:00",null,null,null,"00:00",null,null,null,"00:00",null,null,null,"00:00",null,null,null,"00:00",null,null,null,"00:00",null,null,null,"00:00",null,null,null,"00:00",null,null,null,"00:00",null,null,null,"00:00",null,null,null,"00:00",null,null,null,"00:00",0]
[null,null,null,null,null,null,"00:00",null,null,null,"00:00",null,null,null,"00:00",null,null,null,"00:00",null,null,null,"00:00",null,null,null,"00:00",null,null,null,"00:00",null,null,null,"00:00",null,null,null,"00:00",null,null,null,"00:00",null,null,null,"00:00",null,null,null,"00:00",null,null,null,"00:00",null,null,null,"00:00",null,null,null,"00:00",null,null,null,"00:00",null,null,null,"00:00",null,null,null,"00:00",null,null,null,"00:00",null,null,null,"00:00",null,null,null,"00:00",null,null,null,"00:00",null,null,null,"00:00",null,null,null,"00:00",null,null,null,"00:00",null,null,null,"00:00",null,null,null,"00:00",null,null,null,"00:00",null,null,null,"00:00",null,null,null,"00:00",null,null,null,"00:00",0]
[null,null,null,null,null,null,"00:00",null,null,null,"00:00",null,null,null,"00:00",null,null,null,"00:00",null,null,null,"00:00",null,null,null,"00:00",null,null,null,"00:00",null,null,null,"00:00",null,null,null,"00:00",null,null,null,"00:00",null,null,null,"00:00",null,null,null,"00:00",null,null,null,"00:00",null,null,null,"00:00",null,null,null,"00:00",null,null,null,"00:00",null,null,null,"00:00",null,null,null,"00:00",null,null,null,"00:00",null,null,null,"00:00",null,null,null,"00:00",null,null,null,"00:00",null,null,null,"00:00",null,null,null,"00:00",null,null,null,"00:00",null,null,null,"00:00",null,null,null,"00:00",null,null,null,"00:00",null,null,null,"00:00",null,null,null,"00:00",null,null,null,"00:00",0]
[null,null,null,null,null,null,"00:00",null,null,null,"00:00",null,null,null,"00:00",null,null,null,"00:00",null,null,null,"00:00",null,null,null,"00:00",null,null,null,"00:00",null,null,null,"00:00",null,null,null,"00:00",null,null,null,"00:00",null,null,null,"00:00",null,null,null,"00:00",null,null,null,"00:00",null,null,null,"00:00",null,null,null,"00:00",null,null,null,"00:00",null,null,null,"00:00",null,null,null,"00:00",null,null,null,"00:00",null,null,null,"00:00",null,null,null,"00:00",null,null,null,"00:00",null,null,null,"00:00",null,null,null,"00:00",null,null,null,"00:00",null,null,null,"00:00",null,null,null,"00:00",null,null,null,"00:00",null,null,null,"00:00",null,null,null,"00:00",null,null,null,"00:00",0]
[null,null,null,null,null,null,"00:00",null,null,null,"00:00",null,null,null,"00:00",null,null,null,"00:00",null,null,null,"00:00",null,null,null,"00:00",null,null,null,"00:00",null,null,null,"00:00",null,null,null,"00:00",null,null,null,"00:00",null,null,null,"00:00",null,null,null,"00:00",null,null,null,"00:00",null,null,null,"00:00",null,null,null,"00:00",null,null,null,"00:00",null,null,null,"00:00",null,null,null,"00:00",null,null,null,"00:00",null,null,null,"00:00",null,null,null,"00:00",null,null,null,"00:00",null,null,null,"00:00",null,null,null,"00:00",null,null,null,"00:00",null,null,null,"00:00",null,null,null,"00:00",null,null,null,"00:00",null,null,null,"00:00",null,null,null,"00:00",null,null,null,"00:00",0]
[null,null,null,null,null,null,"00:00",null,null,null,"00:00",null,null,null,"00:00",null,null,null,"00:00",null,null,null,"00:00",null,null,null,"00:00",null,null,null,"00:00",null,null,null,"00:00",null,null,null,"00:00",null,null,null,"00:00",null,null,null,"00:00",null,null,null,"00:00",null,null,null,"00:00",null,null,null,"00:00",null,null,null,"00:00",null,null,null,"00:00",null,null,null,"00:00",null,null,null,"00:00",null,null,null,"00:00",null,null,null,"00:00",null,null,null,"00:00",null,null,null,"00:00",null,null,null,"00:00",null,null,null,"00:00",null,null,null,"00:00",null,null,null,"00:00",null,null,null,"00:00",null,null,null,"00:00",null,null,null,"00:00",null,null,null,"00:00",null,null,null,"00:00",0]
[null,null,null,null,null,null,"00:00",null,null,null,"00:00",null,null,null,"00:00",null,null,null,"00:00",null,null,null,"00:00",null,null,null,"00:00",null,null,null,"00:00",null,null,null,"00:00",null,null,null,"00:00",null,null,null,"00:00",null,null,null,"00:00",null,null,null,"00:00",null,null,null,"00:00",null,null,null,"00:00",null,null,null,"00:00",null,null,null,"00:00",null,null,null,"00:00",null,null,null,"00:00",null,null,null,"00:00",null,null,null,"00:00",null,null,null,"00:00",null,null,null,"00:00",null,null,null,"00:00",null,null,null,"00:00",null,null,null,"00:00",null,null,null,"00:00",null,null,null,"00:00",null,null,null,"00:00",null,null,null,"00:00",null,null,null,"00:00",null,null,null,"00:00",0]
[null,null,null,null,null,null,"00:00",null,null,null,"00:00",null,null,null,"00:00",null,null,null,"00:00",null,null,null,"00:00",null,null,null,"00:00",null,null,null,"00:00",null,null,null,"00:00",null,null,null,"00:00",null,null,null,"00:00",null,null,null,"00:00",null,null,null,"00:00",null,null,null,"00:00",null,null,null,"00:00",null,null,null,"00:00",null,null,null,"00:00",null,null,null,"00:00",null,null,null,"00:00",null,null,null,"00:00",null,null,null,"00:00",null,null,null,"00:00",null,null,null,"00:00",null,null,null,"00:00",null,null,null,"00:00",null,null,null,"00:00",null,null,null,"00:00",null,null,null,"00:00",null,null,null,"00:00",null,null,null,"00:00",null,null,null,"00:00",null,null,null,"00:00",0]
[null,null,null,null,null,null,"00:00",null,null,null,"00:00",null,null,null,"00:00",null,null,null,"00:00",null,null,null,"00:00",null,null,null,"00:00",null,null,null,"00:00",null,null,null,"00:00",null,null,null,"00:00",null,null,null,"00:00",null,null,null,"00:00",null,null,null,"00:00",null,null,null,"00:00",null,null,null,"00:00",null,null,null,"00:00",null,null,null,"00:00",null,null,null,"00:00",null,null,null,"00:00",null,null,null,"00:00",null,null,null,"00:00",null,null,null,"00:00",null,null,null,"00:00",null,null,null,"00:00",null,null,null,"00:00",null,null,null,"00:00",null,null,null,"00:00",null,null,null,"00:00",null,null,null,"00:00",null,null,null,"00:00",null,null,null,"00:00",null,null,null,"00:00",0]
[null,null,null,null,null,null,"00:00",null,null,null,"00:00",null,null,null,"00:00",null,null,null,"00:00",null,null,null,"00:00",null,null,null,"00:00",null,null,null,"00:00",null,null,null,"00:00",null,null,null,"00:00",null,null,null,"00:00",null,null,null,"00:00",null,null,null,"00:00",null,null,null,"00:00",null,null,null,"00:00",null,null,null,"00:00",null,null,null,"00:00",null,null,null,"00:00",null,null,null,"00:00",null,null,null,"00:00",null,null,null,"00:00",null,null,null,"00:00",null,null,null,"00:00",null,null,null,"00:00",null,null,null,"00:00",null,null,null,"00:00",null,null,null,"00:00",null,null,null,"00:00",null,null,null,"00:00",null,null,null,"00:00",null,null,null,"00:00",null,null,null,"00:00",0]
[null,null,null,null,null,null,"00:00",null,null,null,"00:00",null,null,null,"00:00",null,null,null,"00:00",null,null,null,"00:00",null,null,null,"00:00",null,null,null,"00:00",null,null,null,"00:00",null,null,null,"00:00",null,null,null,"00:00",null,null,null,"00:00",null,null,null,"00:00",null,null,null,"00:00",null,null,null,"00:00",null,null,null,"00:00",null,null,null,"00:00",null,null,null,"00:00",null,null,null,"00:00",null,null,null,"00:00",null,null,null,"00:00",null,null,null,"00:00",null,null,null,"00:00",null,null,null,"00:00",null,null,null,"00:00",null,null,null,"00:00",null,null,null,"00:00",null,null,null,"00:00",null,null,null,"00:00",null,null,null,"00:00",null,null,null,"00:00",null,null,null,"00:00",0]
[null,null,null,null,null,null,"00:00",null,null,null,"00:00",null,null,null,"00:00",null,null,null,"00:00",null,null,null,"00:00",null,null,null,"00:00",null,null,null,"00:00",null,null,null,"00:00",null,null,null,"00:00",null,null,null,"00:00",null,null,null,"00:00",null,null,null,"00:00",null,null,null,"00:00",null,null,null,"00:00",null,null,null,"00:00",null,null,null,"00:00",null,null,null,"00:00",null,null,null,"00:00",null,null,null,"00:00",null,null,null,"00:00",null,null,null,"00:00",null,null,null,"00:00",null,null,null,"00:00",null,null,null,"00:00",null,null,null,"00:00",null,null,null,"00:00",null,null,null,"00:00",null,null,null,"00:00",null,null,null,"00:00",null,null,null,"00:00",null,null,null,"00:00",0]
[null,null,null,null,null,null,"00:00",null,null,null,"00:00",null,null,null,"00:00",null,null,null,"00:00",null,null,null,"00:00",null,null,null,"00:00",null,null,null,"00:00",null,null,null,"00:00",null,null,null,"00:00",null,null,null,"00:00",null,null,null,"00:00",null,null,null,"00:00",null,null,null,"00:00",null,null,null,"00:00",null,null,null,"00:00",null,null,null,"00:00",null,null,null,"00:00",null,null,null,"00:00",null,null,null,"00:00",null,null,null,"00:00",null,null,null,"00:00",null,null,null,"00:00",null,null,null,"00:00",null,null,null,"00:00",null,null,null,"00:00",null,null,null,"00:00",null,null,null,"00:00",null,null,null,"00:00",null,null,null,"00:00",null,null,null,"00:00",null,null,null,"00:00",0]
[null,null,null,null,null,null,"00:00",null,null,null,"00:00",null,null,null,"00:00",null,null,null,"00:00",null,null,null,"00:00",null,null,null,"00:00",null,null,null,"00:00",null,null,null,"00:00",null,null,null,"00:00",null,null,null,"00:00",null,null,null,"00:00",null,null,null,"00:00",null,null,null,"00:00",null,null,null,"00:00",null,null,null,"00:00",null,null,null,"00:00",null,null,null,"00:00",null,null,null,"00:00",null,null,null,"00:00",null,null,null,"00:00",null,null,null,"00:00",null,null,null,"00:00",null,null,null,"00:00",null,null,null,"00:00",null,null,null,"00:00",null,null,null,"00:00",null,null,null,"00:00",null,null,null,"00:00",null,null,null,"00:00",null,null,null,"00:00",null,null,null,"00:00",0]
[null,null,null,null,null,null,"00:00",null,null,null,"00:00",null,null,null,"00:00",null,null,null,"00:00",null,null,null,"00:00",null,null,null,"00:00",null,null,null,"00:00",null,null,null,"00:00",null,null,null,"00:00",null,null,null,"00:00",null,null,null,"00:00",null,null,null,"00:00",null,null,null,"00:00",null,null,null,"00:00",null,null,null,"00:00",null,null,null,"00:00",null,null,null,"00:00",null,null,null,"00:00",null,null,null,"00:00",null,null,null,"00:00",null,null,null,"00:00",null,null,null,"00:00",null,null,null,"00:00",null,null,null,"00:00",null,null,null,"00:00",null,null,null,"00:00",null,null,null,"00:00",null,null,null,"00:00",null,null,null,"00:00",null,null,null,"00:00",null,null,null,"00:00",0]
[null,null,null,null,null,null,"00:00",null,null,null,"00:00",null,null,null,"00:00",null,null,null,"00:00",null,null,null,"00:00",null,null,null,"00:00",null,null,null,"00:00",null,null,null,"00:00",null,null,null,"00:00",null,null,null,"00:00",null,null,null,"00:00",null,null,null,"00:00",null,null,null,"00:00",null,null,null,"00:00",null,null,null,"00:00",null,null,null,"00:00",null,null,null,"00:00",null,null,null,"00:00",null,null,null,"00:00",null,null,null,"00:00",null,null,null,"00:00",null,null,null,"00:00",null,null,null,"00:00",null,null,null,"00:00",null,null,null,"00:00",null,null,null,"00:00",null,null,null,"00:00",null,null,null,"00:00",null,null,null,"00:00",null,null,null,"00:00",null,null,null,"00:00",0]
[null,null,null,null,null,null,"00:00",null,null,null,"00:00",null,null,null,"00:00",null,null,null,"00:00",null,null,null,"00:00",null,null,null,"00:00",null,null,null,"00:00",null,null,null,"00:00",null,null,null,"00:00",null,null,null,"00:00",null,null,null,"00:00",null,null,null,"00:00",null,null,null,"00:00",null,null,null,"00:00",null,null,null,"00:00",null,null,null,"00:00",null,null,null,"00:00",null,null,null,"00:00",null,null,null,"00:00",null,null,null,"00:00",null,null,null,"00:00",null,null,null,"00:00",null,null,null,"00:00",null,null,null,"00:00",null,null,null,"00:00",null,null,null,"00:00",null,null,null,"00:00",null,null,null,"00:00",null,null,null,"00:00",null,null,null,"00:00",null,null,null,"00:00",0]
[null,null,null,null,null,null,"00:00",null,null,null,"00:00",null,null,null,"00:00",null,null,null,"00:00",null,null,null,"00:00",null,null,null,"00:00",null,null,null,"00:00",null,null,null,"00:00",null,null,null,"00:00",null,null,null,"00:00",null,null,null,"00:00",null,null,null,"00:00",null,null,null,"00:00",null,null,null,"00:00",null,null,null,"00:00",null,null,null,"00:00",null,null,null,"00:00",null,null,null,"00:00",null,null,null,"00:00",null,null,null,"00:00",null,null,null,"00:00",null,null,null,"00:00",null,null,null,"00:00",null,null,null,"00:00",null,null,null,"00:00",null,null,null,"00:00",null,null,null,"00:00",null,null,null,"00:00",null,null,null,"00:00",null,null,null,"00:00",null,null,null,"00:00",0]
[null,null,null,null,null,null,"00:00",null,null,null,"00:00",null,null,null,"00:00",null,null,null,"00:00",null,null,null,"00:00",null,null,null,"00:00",null,null,null,"00:00",null,null,null,"00:00",null,null,null,"00:00",null,null,null,"00:00",null,null,null,"00:00",null,null,null,"00:00",null,null,null,"00:00",null,null,null,"00:00",null,null,null,"00:00",null,null,null,"00:00",null,null,null,"00:00",null,null,null,"00:00",null,null,null,"00:00",null,null,null,"00:00",null,null,null,"00:00",null,null,null,"00:00",null,null,null,"00:00",null,null,null,"00:00",null,null,null,"00:00",null,null,null,"00:00",null,null,null,"00:00",null,null,null,"00:00",null,null,null,"00:00",null,null,null,"00:00",null,null,null,"00:00",0]

{"sheet":"Settings","index":3,"n_rows":32,"n_cols":80,"rows_kept":32,"cut":false,"hidden":true,"merged":[]}
["Month",null,"Years",null,"Selected Month",null,"Day",null,"Weekday Constants",null,"LastRecordID",null,"Storage Sheets",null,"BU Sheets",null,"Data Tables",null,"ListName","GUID",null,"ID","Item Type","Path","File Type","Workflow Instance ID","URL Path","Encoded Absolute URL",null,null,"Employee Type","Item Type","Path","ID",null,"Site URL",null,"Department","Item Type","Path","ID",null,"Operating Unit","Item Type","Path","ID",null,"Service Type","Item Type","Path","ID",null,null,"Vendor Number Length",null,"Taskorder Length",null,"Ready for upload",null,"Options",null,"Closeout","Item Type","Path","ID",null,"Incident Type","Item Type","Path","ID",null,"Template URL",null,"ID","Item Type","Path","File Type","Workflow Instance ID","URL Path","Encoded Absolute URL"]
[{"$f":"DATE(reportYear,1,1)","v":"1900-01-01"},null,2015,null,{"$f":"IF(selectedMonth=\"\", DATE(reportYear,1,1), selectedMonth)","v":"00:00:00"},null,{"$f":"IF(selectedMonth=\"\", DATE(2018,1,1), dateValue)","v":"1900-01-01"},null,0,null,{"$f":"MAX(BV:BV)+1","v":3794},null,"Manpower Hours",null,{"$f":"M2&\" BU\"","v":"Manpower Hours BU"},null,"tblReportID",null,"ReportId","{56F548F8-27B3-445A-8D42-9ECC2337C90F}",null,7,"Item","sites/dxloucpr/Lists/ReportId",null,null,"sites/dxloucpr/Lists/ReportId/7_.000",null,null,null,"Permanent","Item","sites/dxloucpr/Lists/Employee Type",1,null,"https://portal.eskom.co.za/sites/dxloucpr/",null,"Asset Creation","Item","sites/dxloucpr/Lists/Department",1,null,"Eastern Cape OU","Item","sites/dxloucpr/Lists/Operating Unit",1,null,"Connection - Schools & Clinics","Item","sites/dxloucpr/Lists/Service Type",1,null,null,8,null,8,null,{"$f":"IF(AND(COUNTIF(Summary!C2:C8, \"Ready\")>6, COUNTIF(Summary!C18:C25, \"Ready\")>=2), \"Ready\", \"Not Ready\")","v":"Not Ready"},null,"Yes",null,"Incidents","Item","sites/dxloucpr/Lists/Closeouts",1,null,"Fatalities","Item","sites/dxloucpr/Lists/IncidentType",1,null,"../_layouts/15/download.aspx?SourceUrl=https://portal.eskom.co.za/sites/dxloucpr/Shared%20Documents/20180814_Contractor%20Reporting_Contractor%20Capture%20Form.xlsm",null,3793,"Item","sites/dxloucpr/Lists/ReportId",null,null,"sites/dxloucpr/Lists/ReportId/3793_.000"]
[{"$f":"DATE(reportYear,2,1)","v":"1900-02-01"},null,2016,null,null,null,{"$f":"IF(MONTH($E$2)<>IFERROR(MONTH($G$2+I3),\"\"),\"\",$G$2+I3)","v":"1900-01-02"},null,1,null,null,null,"Incidents",null,"Incidents BU",null,"tblIncidents",null,"Incidents","{B214E8A4-A39F-4CA6-8C1B-3E5D2138F5CE}",null,null,null,null,null,null,null,null,null,null,"Temporary","Item","sites/dxloucpr/Lists/Employee Type",2,null,null,null,"BIPM","Item","sites/dxloucpr/Lists/Department",2,null,"Free State OU","Item","sites/dxloucpr/Lists/Operating Unit",2,null,"Cow Services","Item","sites/dxloucpr/Lists/Service Type",2,null,null,null,null,null,null,{"$f":"MIN(1,AVERAGE(COUNTIF(Summary!C2:C8,\"Ready\")/7,COUNTIF(Summary!C18:C25,\"Ready\")/2))","v":0},null,"No",null,"Findings","Item","sites/dxloucpr/Lists/Closeouts",2,null,"Lost Time","Item","sites/dxloucpr/Lists/IncidentType",2]
[{"$f":"DATE(reportYear,3,1)","v":"1900-03-01"},null,2017,null,null,null,"1900-01-03",null,2,null,null,null,"Closeouts",null,"Closeouts BU",null,"tblCloseouts",null,"Closeouts1","{16B025E0-0D8D-4CA4-B3F6-013BFF9CF553}",null,null,null,null,null,null,null,null,null,null,"Temporary (EPWP)","Item","sites/dxloucpr/Lists/Employee Type",3,null,null,null,"Customer Services","Item","sites/dxloucpr/Lists/Department",3,null,"Gauteng OU","Item","sites/dxloucpr/Lists/Operating Unit",3,null,"Electrification","Item","sites/dxloucpr/Lists/Service Type",3,null,null,null,null,null,null,null,null,"N/A",null,null,null,null,null,null,"Medicals","Item","sites/dxloucpr/Lists/IncidentType",3]
[{"$f":"DATE(reportYear,4,1)","v":"1900-04-01"},null,2018,null,"DateValue",null,"1900-01-04",null,3,null,null,null,"ReportID",null,"ReportID BU",null,"tblManpowerHours",null,"Manpower Hours","{BCB31E87-7565-49DA-B85F-77A2F3BD0A86}",null,null,null,null,null,null,null,null,null,null,null,null,null,null,null,null,null,"M&O","Item","sites/dxloucpr/Lists/Department",4,null,"KZN OU","Item","sites/dxloucpr/Lists/Operating Unit",4,null,"Electrification Design","Item","sites/dxloucpr/Lists/Service Type",22,null,null,null,null,null,null,null,null,null,null,null,null,null,null,null,"First Aid","Item","sites/dxloucpr/Lists/IncidentType",4]
[{"$f":"DATE(reportYear,5,1)","v":"1900-05-01"},null,2019,null,{"$f":"IF(OR(reportYear=\"\", selectedMonth=\"\"), DATE(1986, 9, 24), DATE(reportYear, MONTH(selectedMonth), 1))","v":"1900-01-01"},null,"1900-01-05",null,4,null,null,null,"Permanent Employees",null,"Permanent Employees BU",null,"tblPermanentEmployees",null,"PermanentEmployees","{0DB5E644-D306-4962-9B5C-59D02A6B092C}",null,null,null,null,null,null,null,null,null,null,null,null,null,null,null,null,null,"SHEQS","Item","sites/dxloucpr/Lists/Department",5,null,"Limpopo OU","Item","sites/dxloucpr/Lists/Operating Unit",5,null,"Engineering Survey","Item","sites/dxloucpr/Lists/Service Type",23,null,null,null,null,null,null,null,null,null,null,null,null,null,null,null,"Near Misses","Item","sites/dxloucpr/Lists/IncidentType",5]
[{"$f":"DATE(reportYear,6,1)","v":"1900-06-01"},null,2020,null,null,null,"1900-01-06",null,5,null,null,null,"Temporary Employees",null,"Temporary Employees BU",null,"tblTemporaryEmployees",null,"TemporaryEmployees","{FEBDCD67-1D6A-4CB3-8E78-E7329FE21F07}",null,null,null,null,null,null,null,null,null,null,null,null,null,null,null,null,null,null,null,null,null,null,"Mpumalanga OU","Item","sites/dxloucpr/Lists/Operating Unit",6,null,"Environmental Control Officer","Item","sites/dxloucpr/Lists/Service Type",24]
[{"$f":"DATE(reportYear,7,1)","v":"1900-07-01"},null,2021,null,"Month Name",null,"1900-01-07",null,6,null,null,null,"EPWP Employees",null,"EPWP Employees BU",null,"tblEPWPEmployees",null,"EPWPEmployees","{7A8A1561-F3C4-4601-8A04-7DC9EA8E88F6}",null,null,null,null,null,null,null,null,null,null,null,null,null,null,null,null,null,null,null,null,null,null,"North West OU","Item","sites/dxloucpr/Lists/Operating Unit",7,null,"Environmental Impact Assessment","Item","sites/dxloucpr/Lists/Service Type",25]
[{"$f":"DATE(reportYear,8,1)","v":"1900-08-01"},null,2022,null,{"$f":"TEXT(selectedMonth,\"Mmmm\")&\" \"&reportYear","v":"January 0"},null,"1900-01-08",null,7,null,null,null,null,null,null,null,null,null,null,null,null,null,null,null,null,null,null,null,null,null,null,null,null,null,null,null,null,null,null,null,null,null,"Northern Cape OU","Item","sites/dxloucpr/Lists/Operating Unit",8,null,"Environmental Specialist Studies","Item","sites/dxloucpr/Lists/Service Type",26]
[{"$f":"DATE(reportYear,9,1)","v":"1900-09-01"},null,2023,null,null,null,"1900-01-09",null,8,null,null,null,null,null,null,null,null,null,null,null,null,null,null,null,null,null,null,null,null,null,null,null,null,null,null,null,null,null,null,null,null,null,"Western Cape OU","Item","sites/dxloucpr/Lists/Operating Unit",9,null,"Geo-Technical Investigation","Item","sites/dxloucpr/Lists/Service Type",27]
[{"$f":"DATE(reportYear,10,1)","v":"1900-10-01"},null,2024,null,null,null,"1900-01-10",null,9,null,null,null,null,null,null,null,null,null,null,null,null,null,null,null,null,null,null,null,null,null,null,null,null,null,null,null,null,null,null,null,null,null,null,null,null,null,null,"Land Negotiation","Item","sites/dxloucpr/Lists/Service Type",28]
[{"$f":"DATE(reportYear,11,1)","v":"1900-11-01"},null,2025,null,null,null,"1900-01-11",null,10,null,null,null,null,null,null,null,null,null,null,null,null,null,null,null,null,null,null,null,null,null,null,null,null,null,null,null,null,null,null,null,null,null,null,null,null,null,null,"Land Survey","Item","sites/dxloucpr/Lists/Service Type",29]
[{"$f":"DATE(reportYear,12,1)","v":"1900-12-01"},null,2026,null,null,null,"1900-01-12",null,11,null,null,null,null,null,null,null,null,null,null,null,null,null,null,null,null,null,null,null,null,null,null,null,null,null,null,null,null,null,null,null,null,null,null,null,null,null,null,"Live Work","Item","sites/dxloucpr/Lists/Service Type",4]
[null,null,null,null,null,null,"1900-01-13",null,12,null,null,null,null,null,null,null,null,null,null,null,null,null,null,null,null,null,null,null,null,null,null,null,null,null,null,null,null,null,null,null,null,null,null,null,null,null,null,"LV Line Construction","Item","sites/dxloucpr/Lists/Service Type",5]
[null,null,null,null,null,null,"1900-01-14",null,13,null,null,null,null,null,null,null,null,null,null,null,null,null,null,null,null,null,null,null,null,null,null,null,null,null,null,null,null,null,null,null,null,null,null,null,null,null,null,"Major Maintenance","Item","sites/dxloucpr/Lists/Service Type",6]
[null,null,null,null,null,null,"1900-01-15",null,14,null,null,null,null,null,null,null,null,null,null,null,null,null,null,null,null,null,null,null,null,null,null,null,null,null,null,null,null,null,null,null,null,null,null,null,null,null,null,"Meter Reading/ Replacement/ Moving/ Audit(S)","Item","sites/dxloucpr/Lists/Service Type",7]
[null,null,null,null,null,null,"1900-01-16",null,15,null,null,null,null,null,null,null,null,null,null,null,null,null,null,null,null,null,null,null,null,null,null,null,null,null,null,null,null,null,null,null,null,null,null,null,null,null,null,"Minor Reticulation","Item","sites/dxloucpr/Lists/Service Type",8]
[null,null,null,null,null,null,"1900-01-17",null,16,null,null,null,null,null,null,null,null,null,null,null,null,null,null,null,null,null,null,null,null,null,null,null,null,null,null,null,null,null,null,null,null,null,null,null,null,null,null,"MV Line Construction","Item","sites/dxloucpr/Lists/Service Type",9]
[null,null,null,null,"Fatalities   ",null,"1900-01-18",null,17,null,null,null,null,null,null,null,null,null,null,null,null,null,null,null,null,null,null,null,null,null,null,null,null,null,null,null,null,null,null,null,null,null,null,null,null,null,null,"Other…","Item","sites/dxloucpr/Lists/Service Type",20]
[null,null,null,null,"First Aid   ",null,"1900-01-19",null,18,null,null,null,null,null,null,null,null,null,null,null,null,null,null,null,null,null,null,null,null,null,null,null,null,null,null,null,null,null,null,null,null,null,null,null,null,null,null,"Post Connections (Infills)","Item","sites/dxloucpr/Lists/Service Type",10]
[null,null,null,null,"Lost Time   ",null,"1900-01-20",null,19,null,null,null,null,null,null,null,null,null,null,null,null,null,null,null,null,null,null,null,null,null,null,null,null,null,null,null,null,null,null,null,null,null,null,null,null,null,null,"Property Valuation","Item","sites/dxloucpr/Lists/Service Type",30]
[null,null,null,null,"Medicals   ",null,"1900-01-21",null,20,null,null,null,null,null,null,null,null,null,null,null,null,null,null,null,null,null,null,null,null,null,null,null,null,null,null,null,null,null,null,null,null,null,null,null,null,null,null,"Reliability","Item","sites/dxloucpr/Lists/Service Type",11]
[null,null,null,null,"Near Misses   ",null,"1900-01-22",null,21,null,null,null,null,null,null,null,null,null,null,null,null,null,null,null,null,null,null,null,null,null,null,null,null,null,null,null,null,null,null,null,null,null,null,null,null,null,null,"Rock Drilling","Item","sites/dxloucpr/Lists/Service Type",12]
[null,null,null,null,null,null,"1900-01-23",null,22,null,null,null,null,null,null,null,null,null,null,null,null,null,null,null,null,null,null,null,null,null,null,null,null,null,null,null,null,null,null,null,null,null,null,null,null,null,null,"Sub Transmission Lines","Item","sites/dxloucpr/Lists/Service Type",13]
[null,null,null,null,null,null,"1900-01-24",null,23,null,null,null,null,null,null,null,null,null,null,null,null,null,null,null,null,null,null,null,null,null,null,null,null,null,null,null,null,null,null,null,null,null,null,null,null,null,null,"Substation Control Plant","Item","sites/dxloucpr/Lists/Service Type",14]
[null,null,null,null,null,null,"1900-01-25",null,24,null,null,null,null,null,null,null,null,null,null,null,null,null,null,null,null,null,null,null,null,null,null,null,null,null,null,null,null,null,null,null,null,null,null,null,null,null,null,"Substations Power Plant","Item","sites/dxloucpr/Lists/Service Type",15]
[null,null,null,null,null,null,"1900-01-26",null,25,null,null,null,null,null,null,null,null,null,null,null,null,null,null,null,null,null,null,null,null,null,null,null,null,null,null,null,null,null,null,null,null,null,null,null,null,null,null,"Supply Restoration","Item","sites/dxloucpr/Lists/Service Type",16]
[null,null,null,null,null,null,"1900-01-27",null,26,null,null,null,null,null,null,null,null,null,null,null,null,null,null,null,null,null,null,null,null,null,null,null,null,null,null,null,null,null,null,null,null,null,null,null,null,null,null,"Vegetation Management/ Bush Clearing","Item","sites/dxloucpr/Lists/Service Type",17]
[null,null,null,null,null,null,"1900-01-28",null,27,null,null,null,null,null,null,null,null,null,null,null,null,null,null,null,null,null,null,null,null,null,null,null,null,null,null,null,null,null,null,null,null,null,null,null,null,null,null,"Woodpole Inspection","Item","sites/dxloucpr/Lists/Service Type",18]
[null,null,null,null,null,null,"1900-01-29",null,28,null,null,null,null,null,null,null,null,null,null,null,null,null,null,null,null,null,null,null,null,null,null,null,null,null,null,null,null,null,null,null,null,null,null,null,null,null,null,"Woodpole Replacement","Item","sites/dxloucpr/Lists/Service Type",19]
[null,null,null,null,null,null,"1900-01-30",null,29]
[null,null,null,null,null,null,"1900-01-31",null,30]

{"sheet":"Manpower Hours BU","index":4,"n_rows":4,"n_cols":4,"rows_kept":4,"cut":false,"hidden":true,"merged":[]}
["ReportID","Employee Type","Number of Employees","Hours Worked"]
[{"$f":"Settings!$K$2","v":3794},{"$f":"INDEX(tblEmployeeType[#All], MATCH(Settings!AE2, tblEmployeeType[[#All],[Employee Type]], 0), 4)","v":1},{"$f":"IF(OR(Summary!B18=0, Summary!B18=\"\"), 0, Summary!B18)","v":0},{"$f":"Summary!B19","v":0}]
[{"$f":"Settings!$K$2","v":3794},{"$f":"INDEX(tblEmployeeType[#All], MATCH(Settings!AE3, tblEmployeeType[[#All],[Employee Type]], 0), 4)","v":2},{"$f":"IF(OR(Summary!B21=0, Summary!B21=\"\"), 0, Summary!B21)","v":0},{"$f":"Summary!B22","v":0}]
[{"$f":"Settings!$K$2","v":3794},{"$f":"INDEX(tblEmployeeType[#All], MATCH(Settings!AE4, tblEmployeeType[[#All],[Employee Type]], 0), 4)","v":3},{"$f":"IF(OR(Summary!B24=0, Summary!B24=\"\"), 0, Summary!B24)","v":0},{"$f":"Summary!B25","v":0}]

{"sheet":"Manpower Hours","index":5,"n_rows":2,"n_cols":4,"rows_kept":2,"cut":false,"hidden":true,"merged":[]}
["ReportID","Employee Type","Number of Employees","Hours Worked"]
[3794,1,4,8]

{"sheet":"Incidents BU","index":6,"n_rows":6,"n_cols":7,"rows_kept":6,"cut":false,"hidden":true,"merged":[]}
["ReportID","Incident Type","Number of Incidents'"]
[{"$f":"Settings!$K$2","v":3794},{"$f":"INDEX(tblIncidentTypes[#All], MATCH(Settings!BO2, tblIncidentTypes[[#All],[Incident Type]], 0), 4)","v":1},{"$f":"IF(OR(fatalities=0, fatalities=\"\"), 0, fatalities)","v":0}]
[{"$f":"Settings!$K$2","v":3794},{"$f":"INDEX(tblIncidentTypes[#All], MATCH(Settings!BO3, tblIncidentTypes[[#All],[Incident Type]], 0), 4)","v":2},{"$f":"IF(OR(firstAid=0, firstAid=\"\"), 0, firstAid)","v":0}]
[{"$f":"Settings!$K$2","v":3794},{"$f":"INDEX(tblIncidentTypes[#All], MATCH(Settings!BO4, tblIncidentTypes[[#All],[Incident Type]], 0), 4)","v":3},{"$f":"IF(OR(ltis=0, ltis=\"\"), 0, ltis)","v":0},null,null,null,"IF(OR(ltis=0, ltis=\"\"), 0, ltis)"]
[{"$f":"Settings!$K$2","v":3794},{"$f":"INDEX(tblIncidentTypes[#All], MATCH(Settings!BO5, tblIncidentTypes[[#All],[Incident Type]], 0), 4)","v":4},{"$f":"IF(OR(medicals=0, medicals=\"\"), 0, medicals)","v":0}]
[{"$f":"Settings!$K$2","v":3794},{"$f":"INDEX(tblIncidentTypes[#All], MATCH(Settings!BO6, tblIncidentTypes[[#All],[Incident Type]], 0), 4)","v":5},{"$f":"IF(OR(nearMisses=0, nearMisses=\"\"), 0, nearMisses)","v":0}]

{"sheet":"Incidents","index":7,"n_rows":1,"n_cols":3,"rows_kept":1,"cut":false,"hidden":true,"merged":[]}
["ReportID","Incident Type","Number of Incidents"]

{"sheet":"Closeouts BU","index":8,"n_rows":3,"n_cols":3,"rows_kept":3,"cut":false,"hidden":true,"merged":[]}
["ReportID","Closeout Type","Results"]
[{"$f":"Settings!K2","v":3794},{"$f":"INDEX(Table_ExternalData_1[#All], MATCH(Settings!$BJ2,Table_ExternalData_1[[#All],[Closeout]], 0), 4)","v":1},{"$f":"IF(incidentCloseOut=\"N/A\", 0, incidentCloseOut)","v":0}]
[{"$f":"Settings!K2","v":3794},{"$f":"INDEX(Table_ExternalData_1[#All], MATCH(Settings!$BJ3,Table_ExternalData_1[[#All],[Closeout]], 0), 4)","v":2},{"$f":"IF(findingsCloseout=\"N/A\", 0, findingsCloseout)","v":0}]

{"sheet":"Closeouts","index":9,"n_rows":1,"n_cols":3,"rows_kept":1,"cut":false,"hidden":true,"merged":[]}
["ReportID","Closeout Type","Results"]

{"sheet":"ReportID BU","index":10,"n_rows":2,"n_cols":8,"rows_kept":2,"cut":false,"hidden":true,"merged":[]}
["Operating Unit","Department","Vendor Number","Contractor Name","Service Type","Taskorder Number","Month Worked","MyVersion"]
[{"$f":"INDEX(tblOperatingUnit[#All], MATCH(Summary!B7, tblOperatingUnit[[#All],[Operating Unit]], 0), 4)","v":{"$error":"#N/A"}},{"$f":"INDEX(tblDepartment[#All], MATCH(Summary!B6, tblDepartment[[#All],[Department]], 0), 4)","v":{"$error":"#N/A"}},{"$f":"IF(OR(Summary!B5 = 0, Summary!B5=\"\"), 0, Summary!B5)","v":0},{"$f":"Summary!B2","v":0},{"$f":"INDEX(tblServiceType[#All], MATCH(Summary!B8, tblServiceType[[#All],[Service Type]], 0), 4)","v":{"$error":"#N/A"}},{"$f":"Summary!B3","v":"0"},{"$f":"Summary!B4","v":"1900-01-01"},2]

{"sheet":"ReportID","index":11,"n_rows":2,"n_cols":8,"rows_kept":2,"cut":false,"hidden":true,"merged":[]}
["Operating Unit","Department","Vendor Number","Contractor Name","Service Type","Taskorder Number","Month Worked","MyVersion"]
[5,2,11083820,"o0000000000000000",5,"4502875201","2019-08-01",2]

{"sheet":"Permanent Employees","index":12,"n_rows":2,"n_cols":6,"rows_kept":2,"cut":false,"hidden":true,"merged":[]}
["ReportID","Employee_Type","Employees","Start","End","Date"]
[3794,1,4,"08:00:00","16:00:00","2019-08-05"]

{"sheet":"Permanent Employees BU","index":13,"n_rows":32,"n_cols":6,"rows_kept":32,"cut":false,"hidden":true,"merged":[]}
["ReportID","Employee_Type","Employees","Start","End","Date"]
[{"$f":"Settings!$K$2","v":3794},1,{"$f":"'Man Hours'!E20","v":0},{"$f":"'Man Hours'!F20","v":"00:00:00"},{"$f":"'Man Hours'!G20","v":{"$error":"#DIV/0!"}},{"$f":"Settings!G2","v":"1900-01-01"}]
[{"$f":"Settings!$K$2","v":3794},1,{"$f":"'Man Hours'!E21","v":0},{"$f":"'Man Hours'!F21","v":"00:00:00"},{"$f":"'Man Hours'!G21","v":{"$error":"#DIV/0!"}},{"$f":"Settings!G3","v":"1900-01-02"}]
[{"$f":"Settings!$K$2","v":3794},1,{"$f":"'Man Hours'!E22","v":0},{"$f":"'Man Hours'!F22","v":"00:00:00"},{"$f":"'Man Hours'!G22","v":{"$error":"#DIV/0!"}},{"$f":"Settings!G4","v":"1900-01-03"}]
[{"$f":"Settings!$K$2","v":3794},1,{"$f":"'Man Hours'!E23","v":0},{"$f":"'Man Hours'!F23","v":"00:00:00"},{"$f":"'Man Hours'!G23","v":{"$error":"#DIV/0!"}},{"$f":"Settings!G5","v":"1900-01-04"}]
[{"$f":"Settings!$K$2","v":3794},1,{"$f":"'Man Hours'!E24","v":0},{"$f":"'Man Hours'!F24","v":"00:00:00"},{"$f":"'Man Hours'!G24","v":{"$error":"#DIV/0!"}},{"$f":"Settings!G6","v":"1900-01-05"}]
[{"$f":"Settings!$K$2","v":3794},1,{"$f":"'Man Hours'!E25","v":0},{"$f":"'Man Hours'!F25","v":"00:00:00"},{"$f":"'Man Hours'!G25","v":{"$error":"#DIV/0!"}},{"$f":"Settings!G7","v":"1900-01-06"}]
[{"$f":"Settings!$K$2","v":3794},1,{"$f":"'Man Hours'!E26","v":0},{"$f":"'Man Hours'!F26","v":"00:00:00"},{"$f":"'Man Hours'!G26","v":{"$error":"#DIV/0!"}},{"$f":"Settings!G8","v":"1900-01-07"}]
[{"$f":"Settings!$K$2","v":3794},1,{"$f":"'Man Hours'!E27","v":0},{"$f":"'Man Hours'!F27","v":"00:00:00"},{"$f":"'Man Hours'!G27","v":{"$error":"#DIV/0!"}},{"$f":"Settings!G9","v":"1900-01-08"}]
[{"$f":"Settings!$K$2","v":3794},1,{"$f":"'Man Hours'!E28","v":0},{"$f":"'Man Hours'!F28","v":"00:00:00"},{"$f":"'Man Hours'!G28","v":{"$error":"#DIV/0!"}},{"$f":"Settings!G10","v":"1900-01-09"}]
[{"$f":"Settings!$K$2","v":3794},1,{"$f":"'Man Hours'!E29","v":0},{"$f":"'Man Hours'!F29","v":"00:00:00"},{"$f":"'Man Hours'!G29","v":{"$error":"#DIV/0!"}},{"$f":"Settings!G11","v":"1900-01-10"}]
[{"$f":"Settings!$K$2","v":3794},1,{"$f":"'Man Hours'!E30","v":0},{"$f":"'Man Hours'!F30","v":"00:00:00"},{"$f":"'Man Hours'!G30","v":{"$error":"#DIV/0!"}},{"$f":"Settings!G12","v":"1900-01-11"}]
[{"$f":"Settings!$K$2","v":3794},1,{"$f":"'Man Hours'!E31","v":0},{"$f":"'Man Hours'!F31","v":"00:00:00"},{"$f":"'Man Hours'!G31","v":{"$error":"#DIV/0!"}},{"$f":"Settings!G13","v":"1900-01-12"}]
[{"$f":"Settings!$K$2","v":3794},1,{"$f":"'Man Hours'!E32","v":0},{"$f":"'Man Hours'!F32","v":"00:00:00"},{"$f":"'Man Hours'!G32","v":{"$error":"#DIV/0!"}},{"$f":"Settings!G14","v":"1900-01-13"}]
[{"$f":"Settings!$K$2","v":3794},1,{"$f":"'Man Hours'!E33","v":0},{"$f":"'Man Hours'!F33","v":"00:00:00"},{"$f":"'Man Hours'!G33","v":{"$error":"#DIV/0!"}},{"$f":"Settings!G15","v":"1900-01-14"}]
[{"$f":"Settings!$K$2","v":3794},1,{"$f":"'Man Hours'!E34","v":0},{"$f":"'Man Hours'!F34","v":"00:00:00"},{"$f":"'Man Hours'!G34","v":{"$error":"#DIV/0!"}},{"$f":"Settings!G16","v":"1900-01-15"}]
[{"$f":"Settings!$K$2","v":3794},1,{"$f":"'Man Hours'!E35","v":0},{"$f":"'Man Hours'!F35","v":"00:00:00"},{"$f":"'Man Hours'!G35","v":{"$error":"#DIV/0!"}},{"$f":"Settings!G17","v":"1900-01-16"}]
[{"$f":"Settings!$K$2","v":3794},1,{"$f":"'Man Hours'!E36","v":0},{"$f":"'Man Hours'!F36","v":"00:00:00"},{"$f":"'Man Hours'!G36","v":{"$error":"#DIV/0!"}},{"$f":"Settings!G18","v":"1900-01-17"}]
[{"$f":"Settings!$K$2","v":3794},1,{"$f":"'Man Hours'!E37","v":0},{"$f":"'Man Hours'!F37","v":"00:00:00"},{"$f":"'Man Hours'!G37","v":{"$error":"#DIV/0!"}},{"$f":"Settings!G19","v":"1900-01-18"}]
[{"$f":"Settings!$K$2","v":3794},1,{"$f":"'Man Hours'!E38","v":0},{"$f":"'Man Hours'!F38","v":"00:00:00"},{"$f":"'Man Hours'!G38","v":{"$error":"#DIV/0!"}},{"$f":"Settings!G20","v":"1900-01-19"}]
[{"$f":"Settings!$K$2","v":3794},1,{"$f":"'Man Hours'!E39","v":0},{"$f":"'Man Hours'!F39","v":"00:00:00"},{"$f":"'Man Hours'!G39","v":{"$error":"#DIV/0!"}},{"$f":"Settings!G21","v":"1900-01-20"}]
[{"$f":"Settings!$K$2","v":3794},1,{"$f":"'Man Hours'!E40","v":0},{"$f":"'Man Hours'!F40","v":"00:00:00"},{"$f":"'Man Hours'!G40","v":{"$error":"#DIV/0!"}},{"$f":"Settings!G22","v":"1900-01-21"}]
[{"$f":"Settings!$K$2","v":3794},1,{"$f":"'Man Hours'!E41","v":0},{"$f":"'Man Hours'!F41","v":"00:00:00"},{"$f":"'Man Hours'!G41","v":{"$error":"#DIV/0!"}},{"$f":"Settings!G23","v":"1900-01-22"}]
[{"$f":"Settings!$K$2","v":3794},1,{"$f":"'Man Hours'!E42","v":0},{"$f":"'Man Hours'!F42","v":"00:00:00"},{"$f":"'Man Hours'!G42","v":{"$error":"#DIV/0!"}},{"$f":"Settings!G24","v":"1900-01-23"}]
[{"$f":"Settings!$K$2","v":3794},1,{"$f":"'Man Hours'!E43","v":0},{"$f":"'Man Hours'!F43","v":"00:00:00"},{"$f":"'Man Hours'!G43","v":{"$error":"#DIV/0!"}},{"$f":"Settings!G25","v":"1900-01-24"}]
[{"$f":"Settings!$K$2","v":3794},1,{"$f":"'Man Hours'!E44","v":0},{"$f":"'Man Hours'!F44","v":"00:00:00"},{"$f":"'Man Hours'!G44","v":{"$error":"#DIV/0!"}},{"$f":"Settings!G26","v":"1900-01-25"}]
[{"$f":"Settings!$K$2","v":3794},1,{"$f":"'Man Hours'!E45","v":0},{"$f":"'Man Hours'!F45","v":"00:00:00"},{"$f":"'Man Hours'!G45","v":{"$error":"#DIV/0!"}},{"$f":"Settings!G27","v":"1900-01-26"}]
[{"$f":"Settings!$K$2","v":3794},1,{"$f":"'Man Hours'!E46","v":0},{"$f":"'Man Hours'!F46","v":"00:00:00"},{"$f":"'Man Hours'!G46","v":{"$error":"#DIV/0!"}},{"$f":"Settings!G28","v":"1900-01-27"}]
[{"$f":"Settings!$K$2","v":3794},1,{"$f":"'Man Hours'!E47","v":0},{"$f":"'Man Hours'!F47","v":"00:00:00"},{"$f":"'Man Hours'!G47","v":{"$error":"#DIV/0!"}},{"$f":"Settings!G29","v":"1900-01-28"}]
[{"$f":"Settings!$K$2","v":3794},1,{"$f":"'Man Hours'!E48","v":0},{"$f":"'Man Hours'!F48","v":"00:00:00"},{"$f":"'Man Hours'!G48","v":{"$error":"#DIV/0!"}},{"$f":"Settings!G30","v":"1900-01-29"}]
[{"$f":"Settings!$K$2","v":3794},1,{"$f":"'Man Hours'!E49","v":0},{"$f":"'Man Hours'!F49","v":"00:00:00"},{"$f":"'Man Hours'!G49","v":{"$error":"#DIV/0!"}},{"$f":"Settings!G31","v":"1900-01-30"}]
[{"$f":"Settings!$K$2","v":3794},1,{"$f":"'Man Hours'!E50","v":0},{"$f":"'Man Hours'!F50","v":"00:00:00"},{"$f":"'Man Hours'!G50","v":{"$error":"#DIV/0!"}},{"$f":"Settings!G32","v":"1900-01-31"}]

{"sheet":"Temporary Employees","index":14,"n_rows":1,"n_cols":6,"rows_kept":1,"cut":false,"hidden":true,"merged":[]}
["ReportID","Employee_Type","Employees","Start","End","Date"]

{"sheet":"Temporary Employees BU","index":15,"n_rows":32,"n_cols":6,"rows_kept":32,"cut":false,"hidden":true,"merged":[]}
["ReportID","Employee_Type","Employees","Start","End","Date"]
[{"$f":"Settings!$K$2","v":3794},2,{"$f":"'Man Hours'!K20","v":0},{"$f":"'Man Hours'!L20","v":"00:00:00"},{"$f":"'Man Hours'!M20","v":{"$error":"#DIV/0!"}},{"$f":"Settings!G2","v":"1900-01-01"}]
[{"$f":"Settings!$K$2","v":3794},2,{"$f":"'Man Hours'!K21","v":0},{"$f":"'Man Hours'!L21","v":"00:00:00"},{"$f":"'Man Hours'!M21","v":{"$error":"#DIV/0!"}},{"$f":"Settings!G3","v":"1900-01-02"}]
[{"$f":"Settings!$K$2","v":3794},2,{"$f":"'Man Hours'!K22","v":0},{"$f":"'Man Hours'!L22","v":"00:00:00"},{"$f":"'Man Hours'!M22","v":{"$error":"#DIV/0!"}},{"$f":"Settings!G4","v":"1900-01-03"}]
[{"$f":"Settings!$K$2","v":3794},2,{"$f":"'Man Hours'!K23","v":0},{"$f":"'Man Hours'!L23","v":"00:00:00"},{"$f":"'Man Hours'!M23","v":{"$error":"#DIV/0!"}},{"$f":"Settings!G5","v":"1900-01-04"}]
[{"$f":"Settings!$K$2","v":3794},2,{"$f":"'Man Hours'!K24","v":0},{"$f":"'Man Hours'!L24","v":"00:00:00"},{"$f":"'Man Hours'!M24","v":{"$error":"#DIV/0!"}},{"$f":"Settings!G6","v":"1900-01-05"}]
[{"$f":"Settings!$K$2","v":3794},2,{"$f":"'Man Hours'!K25","v":0},{"$f":"'Man Hours'!L25","v":"00:00:00"},{"$f":"'Man Hours'!M25","v":{"$error":"#DIV/0!"}},{"$f":"Settings!G7","v":"1900-01-06"}]
[{"$f":"Settings!$K$2","v":3794},2,{"$f":"'Man Hours'!K26","v":0},{"$f":"'Man Hours'!L26","v":"00:00:00"},{"$f":"'Man Hours'!M26","v":{"$error":"#DIV/0!"}},{"$f":"Settings!G8","v":"1900-01-07"}]
[{"$f":"Settings!$K$2","v":3794},2,{"$f":"'Man Hours'!K27","v":0},{"$f":"'Man Hours'!L27","v":"00:00:00"},{"$f":"'Man Hours'!M27","v":{"$error":"#DIV/0!"}},{"$f":"Settings!G9","v":"1900-01-08"}]
[{"$f":"Settings!$K$2","v":3794},2,{"$f":"'Man Hours'!K28","v":0},{"$f":"'Man Hours'!L28","v":"00:00:00"},{"$f":"'Man Hours'!M28","v":{"$error":"#DIV/0!"}},{"$f":"Settings!G10","v":"1900-01-09"}]
[{"$f":"Settings!$K$2","v":3794},2,{"$f":"'Man Hours'!K29","v":0},{"$f":"'Man Hours'!L29","v":"00:00:00"},{"$f":"'Man Hours'!M29","v":{"$error":"#DIV/0!"}},{"$f":"Settings!G11","v":"1900-01-10"}]
[{"$f":"Settings!$K$2","v":3794},2,{"$f":"'Man Hours'!K30","v":0},{"$f":"'Man Hours'!L30","v":"00:00:00"},{"$f":"'Man Hours'!M30","v":{"$error":"#DIV/0!"}},{"$f":"Settings!G12","v":"1900-01-11"}]
[{"$f":"Settings!$K$2","v":3794},2,{"$f":"'Man Hours'!K31","v":0},{"$f":"'Man Hours'!L31","v":"00:00:00"},{"$f":"'Man Hours'!M31","v":{"$error":"#DIV/0!"}},{"$f":"Settings!G13","v":"1900-01-12"}]
[{"$f":"Settings!$K$2","v":3794},2,{"$f":"'Man Hours'!K32","v":0},{"$f":"'Man Hours'!L32","v":"00:00:00"},{"$f":"'Man Hours'!M32","v":{"$error":"#DIV/0!"}},{"$f":"Settings!G14","v":"1900-01-13"}]
[{"$f":"Settings!$K$2","v":3794},2,{"$f":"'Man Hours'!K33","v":0},{"$f":"'Man Hours'!L33","v":"00:00:00"},{"$f":"'Man Hours'!M33","v":{"$error":"#DIV/0!"}},{"$f":"Settings!G15","v":"1900-01-14"}]
[{"$f":"Settings!$K$2","v":3794},2,{"$f":"'Man Hours'!K34","v":0},{"$f":"'Man Hours'!L34","v":"00:00:00"},{"$f":"'Man Hours'!M34","v":{"$error":"#DIV/0!"}},{"$f":"Settings!G16","v":"1900-01-15"}]
[{"$f":"Settings!$K$2","v":3794},2,{"$f":"'Man Hours'!K35","v":0},{"$f":"'Man Hours'!L35","v":"00:00:00"},{"$f":"'Man Hours'!M35","v":{"$error":"#DIV/0!"}},{"$f":"Settings!G17","v":"1900-01-16"}]
[{"$f":"Settings!$K$2","v":3794},2,{"$f":"'Man Hours'!K36","v":0},{"$f":"'Man Hours'!L36","v":"00:00:00"},{"$f":"'Man Hours'!M36","v":{"$error":"#DIV/0!"}},{"$f":"Settings!G18","v":"1900-01-17"}]
[{"$f":"Settings!$K$2","v":3794},2,{"$f":"'Man Hours'!K37","v":0},{"$f":"'Man Hours'!L37","v":"00:00:00"},{"$f":"'Man Hours'!M37","v":{"$error":"#DIV/0!"}},{"$f":"Settings!G19","v":"1900-01-18"}]
[{"$f":"Settings!$K$2","v":3794},2,{"$f":"'Man Hours'!K38","v":0},{"$f":"'Man Hours'!L38","v":"00:00:00"},{"$f":"'Man Hours'!M38","v":{"$error":"#DIV/0!"}},{"$f":"Settings!G20","v":"1900-01-19"}]
[{"$f":"Settings!$K$2","v":3794},2,{"$f":"'Man Hours'!K39","v":0},{"$f":"'Man Hours'!L39","v":"00:00:00"},{"$f":"'Man Hours'!M39","v":{"$error":"#DIV/0!"}},{"$f":"Settings!G21","v":"1900-01-20"}]
[{"$f":"Settings!$K$2","v":3794},2,{"$f":"'Man Hours'!K40","v":0},{"$f":"'Man Hours'!L40","v":"00:00:00"},{"$f":"'Man Hours'!M40","v":{"$error":"#DIV/0!"}},{"$f":"Settings!G22","v":"1900-01-21"}]
[{"$f":"Settings!$K$2","v":3794},2,{"$f":"'Man Hours'!K41","v":0},{"$f":"'Man Hours'!L41","v":"00:00:00"},{"$f":"'Man Hours'!M41","v":{"$error":"#DIV/0!"}},{"$f":"Settings!G23","v":"1900-01-22"}]
[{"$f":"Settings!$K$2","v":3794},2,{"$f":"'Man Hours'!K42","v":0},{"$f":"'Man Hours'!L42","v":"00:00:00"},{"$f":"'Man Hours'!M42","v":{"$error":"#DIV/0!"}},{"$f":"Settings!G24","v":"1900-01-23"}]
[{"$f":"Settings!$K$2","v":3794},2,{"$f":"'Man Hours'!K43","v":0},{"$f":"'Man Hours'!L43","v":"00:00:00"},{"$f":"'Man Hours'!M43","v":{"$error":"#DIV/0!"}},{"$f":"Settings!G25","v":"1900-01-24"}]
[{"$f":"Settings!$K$2","v":3794},2,{"$f":"'Man Hours'!K44","v":0},{"$f":"'Man Hours'!L44","v":"00:00:00"},{"$f":"'Man Hours'!M44","v":{"$error":"#DIV/0!"}},{"$f":"Settings!G26","v":"1900-01-25"}]
[{"$f":"Settings!$K$2","v":3794},2,{"$f":"'Man Hours'!K45","v":0},{"$f":"'Man Hours'!L45","v":"00:00:00"},{"$f":"'Man Hours'!M45","v":{"$error":"#DIV/0!"}},{"$f":"Settings!G27","v":"1900-01-26"}]
[{"$f":"Settings!$K$2","v":3794},2,{"$f":"'Man Hours'!K46","v":0},{"$f":"'Man Hours'!L46","v":"00:00:00"},{"$f":"'Man Hours'!M46","v":{"$error":"#DIV/0!"}},{"$f":"Settings!G28","v":"1900-01-27"}]
[{"$f":"Settings!$K$2","v":3794},2,{"$f":"'Man Hours'!K47","v":0},{"$f":"'Man Hours'!L47","v":"00:00:00"},{"$f":"'Man Hours'!M47","v":{"$error":"#DIV/0!"}},{"$f":"Settings!G29","v":"1900-01-28"}]
[{"$f":"Settings!$K$2","v":3794},2,{"$f":"'Man Hours'!K48","v":0},{"$f":"'Man Hours'!L48","v":"00:00:00"},{"$f":"'Man Hours'!M48","v":{"$error":"#DIV/0!"}},{"$f":"Settings!G30","v":"1900-01-29"}]
[{"$f":"Settings!$K$2","v":3794},2,{"$f":"'Man Hours'!K49","v":0},{"$f":"'Man Hours'!L49","v":"00:00:00"},{"$f":"'Man Hours'!M49","v":{"$error":"#DIV/0!"}},{"$f":"Settings!G31","v":"1900-01-30"}]
[{"$f":"Settings!$K$2","v":3794},2,{"$f":"'Man Hours'!K50","v":0},{"$f":"'Man Hours'!L50","v":"00:00:00"},{"$f":"'Man Hours'!M50","v":{"$error":"#DIV/0!"}},{"$f":"Settings!G32","v":"1900-01-31"}]

{"sheet":"EPWP Employees","index":16,"n_rows":1,"n_cols":6,"rows_kept":1,"cut":false,"hidden":true,"merged":[]}
["ReportID","Employee_Type","Employees","Start","End","Date"]

{"sheet":"EPWP Employees BU","index":17,"n_rows":32,"n_cols":6,"rows_kept":32,"cut":false,"hidden":true,"merged":[]}
["ReportID","Employee_Type","Employees","Start","End","Date"]
[{"$f":"Settings!$K$2","v":3794},3,{"$f":"'Man Hours'!Q20","v":0},{"$f":"'Man Hours'!R20","v":"00:00:00"},{"$f":"'Man Hours'!S20","v":{"$error":"#DIV/0!"}},{"$f":"Settings!G2","v":"1900-01-01"}]
[{"$f":"Settings!$K$2","v":3794},3,{"$f":"'Man Hours'!Q21","v":0},{"$f":"'Man Hours'!R21","v":"00:00:00"},{"$f":"'Man Hours'!S21","v":{"$error":"#DIV/0!"}},{"$f":"Settings!G3","v":"1900-01-02"}]
[{"$f":"Settings!$K$2","v":3794},3,{"$f":"'Man Hours'!Q22","v":0},{"$f":"'Man Hours'!R22","v":"00:00:00"},{"$f":"'Man Hours'!S22","v":{"$error":"#DIV/0!"}},{"$f":"Settings!G4","v":"1900-01-03"}]
[{"$f":"Settings!$K$2","v":3794},3,{"$f":"'Man Hours'!Q23","v":0},{"$f":"'Man Hours'!R23","v":"00:00:00"},{"$f":"'Man Hours'!S23","v":{"$error":"#DIV/0!"}},{"$f":"Settings!G5","v":"1900-01-04"}]
[{"$f":"Settings!$K$2","v":3794},3,{"$f":"'Man Hours'!Q24","v":0},{"$f":"'Man Hours'!R24","v":"00:00:00"},{"$f":"'Man Hours'!S24","v":{"$error":"#DIV/0!"}},{"$f":"Settings!G6","v":"1900-01-05"}]
[{"$f":"Settings!$K$2","v":3794},3,{"$f":"'Man Hours'!Q25","v":0},{"$f":"'Man Hours'!R25","v":"00:00:00"},{"$f":"'Man Hours'!S25","v":{"$error":"#DIV/0!"}},{"$f":"Settings!G7","v":"1900-01-06"}]
[{"$f":"Settings!$K$2","v":3794},3,{"$f":"'Man Hours'!Q26","v":0},{"$f":"'Man Hours'!R26","v":"00:00:00"},{"$f":"'Man Hours'!S26","v":{"$error":"#DIV/0!"}},{"$f":"Settings!G8","v":"1900-01-07"}]
[{"$f":"Settings!$K$2","v":3794},3,{"$f":"'Man Hours'!Q27","v":0},{"$f":"'Man Hours'!R27","v":"00:00:00"},{"$f":"'Man Hours'!S27","v":{"$error":"#DIV/0!"}},{"$f":"Settings!G9","v":"1900-01-08"}]
[{"$f":"Settings!$K$2","v":3794},3,{"$f":"'Man Hours'!Q28","v":0},{"$f":"'Man Hours'!R28","v":"00:00:00"},{"$f":"'Man Hours'!S28","v":{"$error":"#DIV/0!"}},{"$f":"Settings!G10","v":"1900-01-09"}]
[{"$f":"Settings!$K$2","v":3794},3,{"$f":"'Man Hours'!Q29","v":0},{"$f":"'Man Hours'!R29","v":"00:00:00"},{"$f":"'Man Hours'!S29","v":{"$error":"#DIV/0!"}},{"$f":"Settings!G11","v":"1900-01-10"}]
[{"$f":"Settings!$K$2","v":3794},3,{"$f":"'Man Hours'!Q30","v":0},{"$f":"'Man Hours'!R30","v":"00:00:00"},{"$f":"'Man Hours'!S30","v":{"$error":"#DIV/0!"}},{"$f":"Settings!G12","v":"1900-01-11"}]
[{"$f":"Settings!$K$2","v":3794},3,{"$f":"'Man Hours'!Q31","v":0},{"$f":"'Man Hours'!R31","v":"00:00:00"},{"$f":"'Man Hours'!S31","v":{"$error":"#DIV/0!"}},{"$f":"Settings!G13","v":"1900-01-12"}]
[{"$f":"Settings!$K$2","v":3794},3,{"$f":"'Man Hours'!Q32","v":0},{"$f":"'Man Hours'!R32","v":"00:00:00"},{"$f":"'Man Hours'!S32","v":{"$error":"#DIV/0!"}},{"$f":"Settings!G14","v":"1900-01-13"}]
[{"$f":"Settings!$K$2","v":3794},3,{"$f":"'Man Hours'!Q33","v":0},{"$f":"'Man Hours'!R33","v":"00:00:00"},{"$f":"'Man Hours'!S33","v":{"$error":"#DIV/0!"}},{"$f":"Settings!G15","v":"1900-01-14"}]
[{"$f":"Settings!$K$2","v":3794},3,{"$f":"'Man Hours'!Q34","v":0},{"$f":"'Man Hours'!R34","v":"00:00:00"},{"$f":"'Man Hours'!S34","v":{"$error":"#DIV/0!"}},{"$f":"Settings!G16","v":"1900-01-15"}]
[{"$f":"Settings!$K$2","v":3794},3,{"$f":"'Man Hours'!Q35","v":0},{"$f":"'Man Hours'!R35","v":"00:00:00"},{"$f":"'Man Hours'!S35","v":{"$error":"#DIV/0!"}},{"$f":"Settings!G17","v":"1900-01-16"}]
[{"$f":"Settings!$K$2","v":3794},3,{"$f":"'Man Hours'!Q36","v":0},{"$f":"'Man Hours'!R36","v":"00:00:00"},{"$f":"'Man Hours'!S36","v":{"$error":"#DIV/0!"}},{"$f":"Settings!G18","v":"1900-01-17"}]
[{"$f":"Settings!$K$2","v":3794},3,{"$f":"'Man Hours'!Q37","v":0},{"$f":"'Man Hours'!R37","v":"00:00:00"},{"$f":"'Man Hours'!S37","v":{"$error":"#DIV/0!"}},{"$f":"Settings!G19","v":"1900-01-18"}]
[{"$f":"Settings!$K$2","v":3794},3,{"$f":"'Man Hours'!Q38","v":0},{"$f":"'Man Hours'!R38","v":"00:00:00"},{"$f":"'Man Hours'!S38","v":{"$error":"#DIV/0!"}},{"$f":"Settings!G20","v":"1900-01-19"}]
[{"$f":"Settings!$K$2","v":3794},3,{"$f":"'Man Hours'!Q39","v":0},{"$f":"'Man Hours'!R39","v":"00:00:00"},{"$f":"'Man Hours'!S39","v":{"$error":"#DIV/0!"}},{"$f":"Settings!G21","v":"1900-01-20"}]
[{"$f":"Settings!$K$2","v":3794},3,{"$f":"'Man Hours'!Q40","v":0},{"$f":"'Man Hours'!R40","v":"00:00:00"},{"$f":"'Man Hours'!S40","v":{"$error":"#DIV/0!"}},{"$f":"Settings!G22","v":"1900-01-21"}]
[{"$f":"Settings!$K$2","v":3794},3,{"$f":"'Man Hours'!Q41","v":0},{"$f":"'Man Hours'!R41","v":"00:00:00"},{"$f":"'Man Hours'!S41","v":{"$error":"#DIV/0!"}},{"$f":"Settings!G23","v":"1900-01-22"}]
[{"$f":"Settings!$K$2","v":3794},3,{"$f":"'Man Hours'!Q42","v":0},{"$f":"'Man Hours'!R42","v":"00:00:00"},{"$f":"'Man Hours'!S42","v":{"$error":"#DIV/0!"}},{"$f":"Settings!G24","v":"1900-01-23"}]
[{"$f":"Settings!$K$2","v":3794},3,{"$f":"'Man Hours'!Q43","v":0},{"$f":"'Man Hours'!R43","v":"00:00:00"},{"$f":"'Man Hours'!S43","v":{"$error":"#DIV/0!"}},{"$f":"Settings!G25","v":"1900-01-24"}]
[{"$f":"Settings!$K$2","v":3794},3,{"$f":"'Man Hours'!Q44","v":0},{"$f":"'Man Hours'!R44","v":"00:00:00"},{"$f":"'Man Hours'!S44","v":{"$error":"#DIV/0!"}},{"$f":"Settings!G26","v":"1900-01-25"}]
[{"$f":"Settings!$K$2","v":3794},3,{"$f":"'Man Hours'!Q45","v":0},{"$f":"'Man Hours'!R45","v":"00:00:00"},{"$f":"'Man Hours'!S45","v":{"$error":"#DIV/0!"}},{"$f":"Settings!G27","v":"1900-01-26"}]
[{"$f":"Settings!$K$2","v":3794},3,{"$f":"'Man Hours'!Q46","v":0},{"$f":"'Man Hours'!R46","v":"00:00:00"},{"$f":"'Man Hours'!S46","v":{"$error":"#DIV/0!"}},{"$f":"Settings!G28","v":"1900-01-27"}]
[{"$f":"Settings!$K$2","v":3794},3,{"$f":"'Man Hours'!Q47","v":0},{"$f":"'Man Hours'!R47","v":"00:00:00"},{"$f":"'Man Hours'!S47","v":{"$error":"#DIV/0!"}},{"$f":"Settings!G29","v":"1900-01-28"}]
[{"$f":"Settings!$K$2","v":3794},3,{"$f":"'Man Hours'!Q48","v":0},{"$f":"'Man Hours'!R48","v":"00:00:00"},{"$f":"'Man Hours'!S48","v":{"$error":"#DIV/0!"}},{"$f":"Settings!G30","v":"1900-01-29"}]
[{"$f":"Settings!$K$2","v":3794},3,{"$f":"'Man Hours'!Q49","v":0},{"$f":"'Man Hours'!R49","v":"00:00:00"},{"$f":"'Man Hours'!S49","v":{"$error":"#DIV/0!"}},{"$f":"Settings!G31","v":"1900-01-30"}]
[{"$f":"Settings!$K$2","v":3794},3,{"$f":"'Man Hours'!Q50","v":0},{"$f":"'Man Hours'!R50","v":"00:00:00"},{"$f":"'Man Hours'!S50","v":{"$error":"#DIV/0!"}},{"$f":"Settings!G32","v":"1900-01-31"}]