{"text_format":"3","workbook":"xlsx","n_sheets":14,"sheets":["Cover Sheet","01-Instructions","02-LFP","03-Labour_Subs_Travel","04-Transport & Off Loading","05-Accessories","06-Training","07-Other Costs","08-LFP Full Range","Option X3","Option X1","Indices","TOTAL PRICE_LFP","Forecasts"],"not_rendered":{"external_links":11,"defined_names":328,"comments":5},"read":"whole","date_system":"1900"}

{"sheet":"Cover Sheet","index":0,"n_rows":22,"n_cols":3,"rows_kept":22,"merged":[[0,0,0,2],[7,0,7,2],[8,0,8,2]]}
["LITHIUM IRON PHOSPHATE BATTERIES PRICING SCHEDULE COVERSHEET"]
[]
[null,"ENQUIRY:","E1272DXWC"]
[null,"COMMODITY:","LITHIUM IRON PHOSPHATE (LFP) BATTERIES"]
[null,"SUPPLIER:"]
[]
[]
["These LFP Battery Enquiry Activity Schedules consists of the following worksheets:"]
["Click on the hyperlinks of the worksheets to access them."]
[null,"Worksheet","Notes"]
{"$rows_left_out":13}
{"sheet":"01-Instructions","index":1,"n_rows":39,"n_cols":3,"rows_kept":39,"merged":[[2,1,2,2],[4,1,4,2]]}
[]
[]
[null,"INSTRUCTIONS FOR COMPLETING THIS PRICING SCHEDULE"]
[]
[null,"THE PURPOSE OF THIS WORKSHEET IS TO ENSURE THAT ALL SUPPLIERS ARE QUOTING FOR ALL ITEMS IN A STANDARD FORMAT, ON A COMMON BASIS FOR EASE OF EVALUATION"]
[]
[null,null,"GENERAL NOTES"]
[null,1,"The supplier must complete the following sheets:-"]
[null,null," - All 9 Activity schedules"]
[null,null," - Option X3: Rate of Exchange"]
{"$rows_left_out":30}
{"sheet":"02-LFP","index":2,"n_rows":22,"n_cols":104,"rows_kept":22,"merged":[[0,0,0,7],[2,0,2,1],[2,2,2,7],[3,0,3,1],[3,2,3,7],[4,0,4,1],[4,2,4,7],[6,0,6,34],[7,0,7,27],[11,0,14,0],[11,1,14,1],[11,2,14,2],[11,3,14,3],[11,4,14,4],[11,5,11,15],[11,16,11,26],[11,27,11,37],[11,38,11,48],[11,49,11,59],[11,60,11,70],[11,71,11,81],[11,82,11,92],[11,93,11,103],[12,15,14,15],[12,26,14,26],[12,37,14,37],[12,48,14,48],[12,59,14,59],[12,70,14,70],[12,81,14,81],[12,92,14,92],[12,103,14,103],[13,5,14,5],[13,6,13,7],[13,8,13,11],[13,12,13,14],[13,16,14,16],[13,17,13,18],[13,19,13,22],[13,23,13,25],[13,27,14,27],[13,28,13,29],[13,30,13,33],[13,34,13,36],[13,38,14,38],[13,39,13,40],[13,41,13,44],[13,45,13,47],[13,49,14,49],[13,50,13,51],[13,52,13,55],[13,56,13,58],[13,60,14,60],[13,61,13,62],[13,63,13,66],[13,67,13,69],[13,71,14,71],[13,72,13,73],[13,74,13,77],[13,78,13,80],[13,82,14,82],[13,83,13,84],[13,85,13,88],[13,89,13,91],[13,93,14,93],[13,94,13,95],[13,96,13,99],[13,100,13,102]]}
["Offered LFP Cells/Batteries"]
[]
["ENQUIRY NO:",null,{"$f":"'Cover Sheet'!C3","v":"E1272DXWC"}]
["COMMODITY:",null,{"$f":"'Cover Sheet'!C4","v":"LITHIUM IRON PHOSPHATE (LFP) BATTERIES"}]
["SUPPLIER:",null,{"$f":"IF('Cover Sheet'!C5=\"\",\"\",'Cover Sheet'!C5)","v":""}]
[]
["The prices for individual cells include a cell/battery label (number), inter-cell/battery connectors, bolts, nuts, washers, spring washers and corrosion protection.."]
["Linking sets will include interrow connectors, terminating cables and associated accessories."]
[]
[null,1,2,3,4,5,6,7,8,9,10,11,12,13,14,15,16,17,18,19,20,21,22,23,24,25,26,27,28,29,30,31,32,33,34,35,36,37,38,39,40,41,42,43,44,45,46,47,48,49,50,51,52,53,54,55,56,57,58,59,60,61,62,63,64,65,66,67,68,69,70,71,72,73,74,75,76,77,78,79,80,81,82,83,84,85,86,87,88,89,90,91,92,93,94,95,96,97,98,99,100,101,102,103]
{"$rows_left_out":13}
{"sheet":"03-Labour_Subs_Travel","index":3,"n_rows":49,"n_cols":10,"rows_kept":49,"merged":[[0,0,0,5],[2,0,2,2],[2,3,2,6],[3,0,3,2],[3,3,3,6],[4,0,4,2],[5,0,5,2],[5,3,5,5],[6,0,6,2],[6,3,6,5],[7,0,7,2],[7,3,7,5],[16,4,16,7],[17,0,18,0],[17,1,18,1],[17,2,18,2],[17,3,18,3],[17,4,18,4],[17,5,18,5],[17,6,18,6],[17,7,18,7],[30,0,31,0],[30,1,31,1],[30,2,31,2],[30,3,31,5],[32,3,32,5],[33,3,33,5],[34,3,34,5],[36,0,36,7],[36,8,36,9],[37,0,38,0],[37,1,38,1],[37,2,38,2],[37,3,38,3],[37,4,38,4],[37,5,38,5],[37,6,38,6],[37,7,38,7],[37,8,38,8],[37,9,38,9]]}
["COSTS FOR LABOUR, SUBSISTENCE AND TRAVELLING"]
[]
[{"$nulls":3},"Prices in South African Currency (Excluding VAT)"]
[{"$nulls":3},"Activities shall be quoted as PER UNIT and as being at the same site at the same time"]
[]
["ENQUIRY NO",null,null,{"$f":"'Cover Sheet'!C3","v":"E1272DXWC"}]
["COMMODITY",null,null,{"$f":"'Cover Sheet'!C4","v":"LITHIUM IRON PHOSPHATE (LFP) BATTERIES"}]
["SUPPLIER",null,null,{"$f":"IF('Cover Sheet'!C5=\"\",\"\",'Cover Sheet'!C5)","v":""}]
[]
["Notes:"]
{"$rows_left_out":40}
{"sheet":"04-Transport & Off Loading","index":4,"n_rows":27,"n_cols":13,"rows_kept":27,"merged":[[0,0,0,12],[2,0,2,5],[2,6,2,12],[3,0,3,5],[3,6,3,12],[4,0,4,5],[4,6,4,12],[5,0,8,0],[5,1,8,1],[5,3,5,12],[6,3,6,12],[7,3,7,12],[26,0,26,12]]}
["TRANSPORT AND OFF LOADING COSTS (Applicable to crated orders. Small items shall be couriered at the cheapest cost)"]
["Transport Costs on the same order, going to the same location shall be optimised and NOT treated as individual consignments."]
[" ENQUIRY NO",{"$nulls":5},{"$f":"'Cover Sheet'!C3","v":"E1272DXWC"}]
["COMMODITY",{"$nulls":5},{"$f":"'Cover Sheet'!C4","v":"LITHIUM IRON PHOSPHATE (LFP) BATTERIES"}]
["SUPPLIER",{"$nulls":5},{"$f":"IF('Cover Sheet'!C5=\"\",\"\",'Cover Sheet'!C5)","v":""}]
["Item","Distance to site [km]",null,"Prices in South African Currency (Excluding VAT)"]
[{"$nulls":3},"Transport to site or regional store and off-loading"]
[{"$nulls":3},"Total Mass [kg]"]
[{"$nulls":3},"0-1000","1001 - 2000","2001 - 3000","3001 - 4000","4001 - 6000","6001 - 8000","8001 - 10000","10001 - 14000","14001 - 18000","18000 +"]
[{"$nulls":3},1000,2000,3000,4000,6000,8000,10000,14000,18000,22000]
{"$rows_left_out":18}
{"sheet":"05-Accessories","index":5,"n_rows":27,"n_cols":5,"rows_kept":27,"merged":[[1,0,1,2],[1,3,1,4],[2,0,2,2],[2,3,2,4],[3,0,3,2],[3,3,3,4],[5,0,5,4],[24,1,24,4],[25,1,25,4],[26,1,26,4]]}
[]
["ENQUIRY NO",null,null,{"$f":"'Cover Sheet'!C3","v":"E1272DXWC"}]
["COMMODITY",null,null,{"$f":"'Cover Sheet'!C4","v":"LITHIUM IRON PHOSPHATE (LFP) BATTERIES"}]
["SUPPLIER",null,null,{"$f":"IF('Cover Sheet'!C5=\"\",\"\",'Cover Sheet'!C5)","v":""}]
[]
["List of Accessories (All amounts in ZAR excluding VAT.)"]
["Item","SAP Number","Short Description","Price","Comments"]
[1,"TBA","Battery inspection logbook"]
[2,"TBA","Battery cabinet identification label"]
[3,"TBA","Battery cabinet safety sign"]
{"$rows_left_out":18}
{"sheet":"06-Training","index":6,"n_rows":14,"n_cols":6,"rows_kept":14,"merged":[[1,0,1,5],[3,0,3,5],[5,0,5,1],[5,2,5,5],[6,0,6,1],[6,2,6,5],[7,0,7,1],[7,2,7,5],[11,0,11,5],[13,0,13,5]]}
[]
["TRAINING"]
[]
["Prices in South African Currency (Excluding VAT)"]
[]
[" ENQUIRY NO",null,{"$f":"'Cover Sheet'!C3","v":"E1272DXWC"}]
["COMMODITY",null,{"$f":"'Cover Sheet'!C4","v":"LITHIUM IRON PHOSPHATE (LFP) BATTERIES"}]
["SUPPLIER",null,{"$f":"IF('Cover Sheet'!C5=\"\",\"\",'Cover Sheet'!C5)","v":""}]
["Item","Options","Cost / Session / Student","Min no. of students","Max no. of students","Duration [days]"]
[1,"At Eskom Premises"]
{"$rows_left_out":5}
{"sheet":"07-Other Costs","index":7,"n_rows":7,"n_cols":3,"rows_kept":7,"merged":[[4,1,4,2]]}
[]
[null," ENQUIRY NO",{"$f":"'Cover Sheet'!C3","v":"E1272DXWC"}]
[null,"COMMODITY",{"$f":"'Cover Sheet'!C4","v":"LITHIUM IRON PHOSPHATE (LFP) BATTERIES"}]
[null,"SUPPLIER",{"$f":"IF('Cover Sheet'!C5=\"\",\"\",'Cover Sheet'!C5)","v":""}]
[null,"The supplier shall state the terms and conditions related to other costs that were not explicitly stated (requested) as part of the enquiry. These could include costs related to storage on behalf of Eskom where the site is not yet ready; cancellation fees - where an order was placed and needs to be amended / changed for other equipment, etc."]
[]
[null,"Item","Proposal with terms and conditions"]

{"sheet":"08-LFP Full Range","index":8,"n_rows":58,"n_cols":104,"rows_kept":58,"merged":[[0,0,0,7],[2,0,2,1],[2,2,2,7],[3,0,3,1],[3,2,3,7],[4,0,4,1],[4,2,4,7],[6,0,6,34],[7,0,7,27],[11,0,14,0],[11,1,14,1],[11,2,14,2],[11,3,14,3],[11,4,14,4],[11,5,11,15],[11,16,11,26],[11,27,11,37],[11,38,11,48],[11,49,11,59],[11,60,11,70],[11,71,11,81],[11,82,11,92],[11,93,11,103],[12,15,14,15],[12,26,14,26],[12,37,14,37],[12,48,14,48],[12,59,14,59],[12,70,14,70],[12,81,14,81],[12,92,14,92],[12,103,14,103],[13,5,14,5],[13,6,13,7],[13,8,13,11],[13,12,13,14],[13,16,14,16],[13,17,13,18],[13,19,13,22],[13,23,13,25],[13,27,14,27],[13,28,13,29],[13,30,13,33],[13,34,13,36],[13,38,14,38],[13,39,13,40],[13,41,13,44],[13,45,13,47],[13,49,14,49],[13,50,13,51],[13,52,13,55],[13,56,13,58],[13,60,14,60],[13,61,13,62],[13,63,13,66],[13,67,13,69],[13,71,14,71],[13,72,13,73],[13,74,13,77],[13,78,13,80],[13,82,14,82],[13,83,13,84],[13,85,13,88],[13,89,13,91],[13,93,14,93],[13,94,13,95],[13,96,13,99],[13,100,13,102],[15,1,57,1]]}
[{"$f":"'02-LFP'!A1","v":"Offered LFP Cells/Batteries"}]
[]
["ENQUIRY NO:",null,{"$f":"'Cover Sheet'!C3","v":"E1272DXWC"}]
["COMMODITY:",null,{"$f":"'Cover Sheet'!C4","v":"LITHIUM IRON PHOSPHATE (LFP) BATTERIES"}]
["SUPPLIER:",null,{"$f":"IF('Cover Sheet'!C5=\"\",\"\",'Cover Sheet'!C5)","v":""}]
[]
["The prices for individual cells include a cell label (number), inter-cell connectors, bolts, nuts, washers, spring washers, corrosion protection and electrolyte."]
["Linking sets will include interrow connectors, terminating cables and associated accessories."]
[]
[null,1,2,3,4,5,6,7,8,9,10,11,12,13,14,15,16,17,18,19,20,21,22,23,24,25,26,27,28,29,30,31,32,33,34,35,36,37,38,39,40,41,42,43,44,45,46,47,48,49,50,51,52,53,54,55,56,57,58,59,60,61,62,63,64,65,66,67,68,69,70,71,72,73,74,75,76,77,78,79,80,81,82,83,84,85,86,87,88,89,90,91,92,93,94,95,96,97,98,99,100,101,102,103]
{"$rows_left_out":49}
{"sheet":"Option X3","index":9,"n_rows":21,"n_cols":7,"rows_kept":21,"merged":[[1,1,1,3],[1,4,1,6],[2,1,2,3],[2,4,2,6],[3,1,3,3],[3,4,3,6],[4,1,4,6],[20,1,20,6]]}
[]
[null,{"$f":"[10]Summary!C3","v":"ENQUIRY No"},null,null,{"$f":"'Cover Sheet'!C3","v":"E1272DXWC"}]
[null,{"$f":"[10]Summary!C4","v":"COMMODITY"},null,null,{"$f":"'Cover Sheet'!C4","v":"LITHIUM IRON PHOSPHATE (LFP) BATTERIES"}]
[null,{"$f":"[10]Summary!C5","v":"SUPPLIER"},null,null,{"$f":"IF('Cover Sheet'!C5=\"\",\"\",'Cover Sheet'!C5)","v":""}]
[null,"MULTIPLE CURRENCIES - SECONDARY OPTION X3"]
[null,"No","Currency Description","Code","Foreign Exchange Currency 1,00 =","Date Published","Source"]
[null,1,"Austrailian Dollar","AUD"]
[null,{"$f":"B7+1","v":2},"Canadian Dollar","CAD"]
[null,3,"Swiss Franc","CHF"]
[null,4,"Danish Krone","DKK"]
{"$rows_left_out":12}
{"sheet":"Option X1","index":10,"n_rows":108,"n_cols":15,"rows_kept":108,"merged":[[1,1,1,2],[1,3,1,5],[2,1,2,2],[2,3,2,5],[3,1,3,2],[3,3,3,5],[4,1,4,5],[6,2,6,5],[7,2,7,5],[8,2,8,5],[9,2,9,5],[10,2,10,5],[11,2,11,5],[12,2,12,5],[13,2,13,5],[14,2,14,5],[15,2,15,5],[16,2,16,5],[20,2,26,2],[29,2,35,2],[38,2,44,2],[47,2,53,2],[56,2,62,2],[65,2,71,2],[74,2,80,2],[83,2,89,2],[92,2,98,2],[101,2,107,2]]}
[]
[null,"ENQUIRY No",null,{"$f":"'Cover Sheet'!C3","v":"E1272DXWC"}]
[null,"COMMODITY",null,{"$f":"'Cover Sheet'!C4","v":"LITHIUM IRON PHOSPHATE (LFP) BATTERIES"}]
[null,"SUPPLIER",null,{"$f":"IF('Cover Sheet'!C5=\"\",\"\",'Cover Sheet'!C5)","v":""}]
[null,"PRICE ADJUSTMENT FOR INFLATION - SECONDARY OPTION X1"]
[null,"No","Description of Formula"]
[null,"Fixed","Firm and Fixed"]
[null,"01",{"$f":"C21","v":"Description of formula 1"}]
[null,"02",{"$f":"C30","v":"Description of formula 2"}]
[null,"03",{"$f":"C39","v":"Description of formula 3"}]
{"$rows_left_out":99}
{"sheet":"Indices","index":11,"n_rows":33,"n_cols":5,"rows_kept":33,"merged":[[10,3,19,3],[10,4,12,4],[12,5,13,5],[13,4,19,4],[14,5,15,5],[15,0,18,0],[16,5,17,5],[18,5,19,5],[20,0,20,4],[21,0,21,4]]}
[{"$f":"'[11]C2.2.0 Cover Page'!A12","v":"OFFER CATEGORY : E.g.  \"MAIN\", or \"ALTERNATIVE 3\", etc."}]
[]
[]
["PRESCRIBED INDICES"]
["Note :"]
["It is important that these indices are considered with the requirements in Spares and Tools and Maintenance and repairs,Training and IP"]
["Please go through the Eskom CPA strategy document attached."]
["LOCAL CPA INDICES","Latest"]
[]
["Labour","Commodities","Processed material","Transport","Others"]
{"$rows_left_out":24}
{"sheet":"TOTAL PRICE_LFP","index":12,"n_rows":18,"n_cols":15,"rows_kept":18,"merged":[[1,1,1,3],[1,10,1,15],[2,1,2,3],[3,1,3,3],[3,10,3,15],[5,0,5,3],[17,1,17,6]]}
[{"$nulls":5},"Cost","Column #",null,null,"Notes:","1) Custom battery banks qty's standardised to closest standard bank size"]
["ENQUIRY NO",{"$f":"'Cover Sheet'!C3","v":"E1272DXWC"},{"$nulls":3},"Equipment",{"$f":"SUM(C10:E13)","v":0},"1+2+3",null,null,"2) Distance for travelling is assumed to 1000km (roundtrip)"]
["COMMODITY",{"$f":"'Cover Sheet'!C4","v":"LITHIUM IRON PHOSPHATE (LFP) BATTERIES"},{"$nulls":3},"Services without Discharge Test",{"$f":"SUM(F10:L13)","v":0},"4+5+7+8+9+10",null,null,"3) Distance for transport is assumed to 500km (one way)",null,null,500,"km"]
["SUPPLIER",{"$f":"IF('Cover Sheet'!C5=\"\",\"\",'Cover Sheet'!C5)","v":""},{"$nulls":3},"Services with Discharge Test",{"$f":"SUM(F10:K13)+SUM(N10:N13)","v":0},"4+5+7+8+9+12"]
[]
["SUMMARY OF PRICES EXCLUDING VAT"]
[{"$nulls":3},"DRST",null,null,0,{"$f":"G7+13","v":13},{"$f":"H7+13","v":26},39,52]
["Column #",null,1,2,3,4,5,6,7,8,9,10,11,12,13]
["Required Capacity [Ah]","Offered Ah","Battery Systems","Linking Sets","Battery Cabinets","Decommissioning","Installation","Commissioning without Discharge","Commissioning with Discharge","Transport","Travelling","Subsistence (Wet Charged) - Commissioning without Discharge Test","Total cost - Commissioning without Discharge Test","Subsistence (Wet Charged) - Commissioning with Discharge Test","Total cost - Commissioning with Discharge Test"]
[{"$f":"'02-LFP'!B16","v":"48V, LFP System, E = 3kWh"},{"$f":"'02-LFP'!C16","v":0},{"$f":"VLOOKUP($A10,LP_Table,12,0)","v":0},{"$f":"SUM(VLOOKUP($A10,LP_Table,23,0),VLOOKUP($A10,LP_Table,34,0),VLOOKUP($A10,LP_Table,45,0),VLOOKUP($A10,LP_Table,56,0))","v":0},{"$f":"SUM(VLOOKUP($A10,LP_Table,67,0),VLOOKUP($A10,LP_Table,78,0),VLOOKUP($A10,LP_Table,89,0),VLOOKUP($A10,LP_Table,100,0))","v":0},{"$f":"IF($B10<='03-Labour_Subs_Travel'!$C$20,('02-LFP'!Q16*'03-Labour_Subs_Travel'!E42)+('02-LFP'!$AB16*'03-Labour_Subs_Travel'!E$44)+('02-LFP'!$AM16*'03-Labour_Subs_Travel'!E$46)+('02-LFP'!$AX16*'03-Labour_Subs_Travel'!E$48),('02-LFP'!Q16*'03-Labour_Subs_Travel'!E43)+('02-LFP'!$AB16*'03-Labour_Subs_Travel'!E$45)+('02-LFP'!$AM16*'03-Labour_Subs_Travel'!E$47)+('02-LFP'!$AX16*'03-Labour_Subs_Travel'!E$49))","v":0},{"$f":"IF($B10<='03-Labour_Subs_Travel'!$C$20,('02-LFP'!Q16*'03-Labour_Subs_Travel'!F$42)+('02-LFP'!$AB16*'03-Labour_Subs_Travel'!F$44)+('02-LFP'!$AM16*'03-Labour_Subs_Travel'!F$46)+('02-LFP'!$AX16*'03-Labour_Subs_Travel'!F$48),('02-LFP'!Q16*'03-Labour_Subs_Travel'!F$43)+('02-LFP'!$AB16*'03-Labour_Subs_Travel'!F$45)+('02-LFP'!$AM16*'03-Labour_Subs_Travel'!F$47)+('02-LFP'!$AX16*'03-Labour_Subs_Travel'!F$49))","v":0},{"$f":"IF($B10<='03-Labour_Subs_Travel'!$C$20,('02-LFP'!$Q16*'03-Labour_Subs_Travel'!G$42)+('02-LFP'!$AB16*'03-Labour_Subs_Travel'!G$44)+('02-LFP'!$AM16*'03-Labour_Subs_Travel'!G$46)+('02-LFP'!$AX16*'03-Labour_Subs_Travel'!G$48),('02-LFP'!$Q16*'03-Labour_Subs_Travel'!G$43)+('02-LFP'!$AB16*'03-Labour_Subs_Travel'!G$45)+('02-LFP'!$AM16*'03-Labour_Subs_Travel'!G$47)+('02-LFP'!$AX16*'03-Labour_Subs_Travel'!G$49))","v":0},{"$f":"IF($B10<='03-Labour_Subs_Travel'!$C$20,('02-LFP'!$Q16*'03-Labour_Subs_Travel'!H$42)+('02-LFP'!$AB16*'03-Labour_Subs_Travel'!H$44)+('02-LFP'!$AM16*'03-Labour_Subs_Travel'!H$46)+('02-LFP'!$AX16*'03-Labour_Subs_Travel'!H$48),('02-LFP'!$Q16*'03-Labour_Subs_Travel'!H$43)+('02-LFP'!$AB16*'03-Labour_Subs_Travel'!H$45)+('02-LFP'!$AM16*'03-Labour_Subs_Travel'!H$47)+('02-LFP'!$AX16*'03-Labour_Subs_Travel'!H$49))","v":0},{"$f":"('02-LFP'!Q16*INDEX(TransportTable,MATCH(IF($N$3<100,100,$N$3),Distance,1),MATCH(IF(Num_30*VLOOKUP($A10,LP_Table,4,0)<1000,1000,Num_30*VLOOKUP($A10,LP_Table,4,0)),WeightRange,1)))+('02-LFP'!AB16*INDEX(TransportTable,MATCH(IF($N$3<100,100,$N$3),Distance,1),MATCH(IF(Num_48*VLOOKUP($A10,LP_Table,4,0)<1000,1000,Num_48*VLOOKUP($A10,LP_Table,4,0)),WeightRange,1)))+('02-LFP'!AM16*INDEX(TransportTable,MATCH(IF($N$3<100,100,$N$3),Distance,1),MATCH(IF(Num_110*VLOOKUP($A10,LP_Table,4,0)<1000,1000,Num_110*VLOOKUP($A10,LP_Table,4,0)),WeightRange,1)))+('02-LFP'!AX16*INDEX(TransportTable,MATCH(IF($N$3<100,100,$N$3),Distance,1),MATCH(IF(Num_220*VLOOKUP($A10,LP_Table,4,0)<1000,1000,Num_220*VLOOKUP($A10,LP_Table,4,0)),WeightRange,1)))","v":0},{"$f":"2*$N$3*'03-Labour_Subs_Travel'!$C$35*('02-LFP'!Q16+'02-LFP'!AB16+'02-LFP'!AM16+'02-LFP'!AX16)","v":0},{"$f":"IF($B10<='03-Labour_Subs_Travel'!$C$20,('02-LFP'!Q16*'03-Labour_Subs_Travel'!$I$42)+('02-LFP'!AB16*'03-Labour_Subs_Travel'!$I$44)+('02-LFP'!AM16*'03-Labour_Subs_Travel'!$I$46)+('02-LFP'!AX16*'03-Labour_Subs_Travel'!$I$48),('02-LFP'!Q16*'03-Labour_Subs_Travel'!$I$43)+('02-LFP'!AB16*'03-Labour_Subs_Travel'!$I$45)+('02-LFP'!AM16*'03-Labour_Subs_Travel'!$I$47)+('02-LFP'!AX16*'03-Labour_Subs_Travel'!$I$49))","v":0},{"$f":"SUM(C10:L10)","v":0},{"$f":"IF($B10<='03-Labour_Subs_Travel'!$C$20,('02-LFP'!Q16*'03-Labour_Subs_Travel'!$J$42)+('02-LFP'!AB16*'03-Labour_Subs_Travel'!$J$44)+('02-LFP'!AM16*'03-Labour_Subs_Travel'!$J$46)+('02-LFP'!AX16*'03-Labour_Subs_Travel'!$J$48),('02-LFP'!Q16*'03-Labour_Subs_Travel'!$J$43)+('02-LFP'!AB16*'03-Labour_Subs_Travel'!$J$45)+('02-LFP'!AM16*'03-Labour_Subs_Travel'!$J$47)+('02-LFP'!AX16*'03-Labour_Subs_Travel'!$J$49))","v":0},{"$f":"SUM(C10:K10)+N10","v":0}]
{"$rows_left_out":9}
{"sheet":"Forecasts","index":13,"n_rows":12,"n_cols":14,"rows_kept":12,"merged":[[0,0,0,12],[1,4,1,12]]}
["DC : Lithium Ion Batteries"]
[{"$nulls":4},"Qty/OU"]
["Item No","Item Description","E Rating [kWh]","SAP Number","ECOU","FSOU","GOU","KZNOU","LOU","MOU","NCOU","NWOU","WCOU","Total"]
[1,{"$f":"\"48V, Lithium Iron Phosphate Module, E = \"&C4&\"kWh\"","v":"48V, Lithium Iron Phosphate Module, E = 3kWh"},3,null,1,0,0,0,0,0,0,0,0,{"$f":"SUM(E4:M4)","v":1}]
[2,{"$f":"\"48V, Lithium Iron Phosphate Module, E = \"&C5&\"kWh\"","v":"48V, Lithium Iron Phosphate Module, E = 5kWh"},5,null,1,0,0,0,0,0,0,0,0,{"$f":"SUM(E5:M5)","v":1}]
[3,"48V, Lithium Iron Phosphate Module, E = 10kWh",10,null,{"$f":"28-2","v":26},0,0,2,200,200,2,0,30,460]
[4,"48V, Lithium Iron Phosphate Module, E = 15kWh",15,null,10,0,0,2,1,0,1,18,16,48]
[]
[1,{"$f":"\"48V, LFP System, E = \"&C9&\"kWh\"","v":"48V, LFP System, E = 3kWh"},3]
[2,{"$f":"\"48V, LFP System, E = \"&C10&\"kWh\"","v":"48V, LFP System, E = 5kWh"},5]
{"$rows_left_out":2}