{"text_format":"3","workbook":"xlsx","n_sheets":4,"sheets":["Note to Bidders","Price Schedule C2.2 - Valves","Detail Descriptions C2.2","Foreign Currency Schedule"],"not_rendered":{"defined_names":1},"read":"whole","date_system":"1900"}

{"sheet":"Note to Bidders","index":0,"n_rows":19,"n_cols":5,"rows_kept":19,"merged":[[0,0,0,6],[1,0,1,6],[2,0,2,6],[4,0,4,6],[6,1,6,6],[7,1,7,6],[8,1,8,6],[9,1,9,6],[10,1,10,6],[12,0,12,6],[14,0,14,6],[15,1,15,3],[15,4,15,6],[16,1,16,3],[16,4,16,6],[17,1,17,3],[17,4,17,6],[18,1,18,3],[18,4,18,6]]}
["ESKOM HOLDINGS SOC LTD"]
["NOTE TO BIDDERS"]
["Tender Enquiry No: E2979GXPOU - Supply and delivery of various valves and valve components for Peaking Power Stations"]
[]
["📋 IMPORTANT INFORMATION FOR BIDDERS"]
[]
[1,"The material number is the primary reference for each item and must be used in all responses."]
[2,"Bidders are not required to quote on all items and may submit partial offers."]
[3,"Where applicable, bidders may propose equivalent items, which must be clearly indicated in the designated columns."]
[4,"The NEC document aligns with this pricing schedule; however, material numbers shall take precedence for identification purposes."]
[5,"All supporting technical documentation (including datasheets) must be submitted for items quoted."]
[]
["📌 NOTE: Please ensure all Item Numbers, Material Codes, Quantities and Units of Measure are verified against the NEC Schedule and ITT documents before submission."]
[]
["📑 DOCUMENT STRUCTURE"]
["Sheet 1:","Note to Bidders",null,null,"(This page)"]
["Sheet 2:","Price Schedule C2.2 - Valves",null,null,"(Main pricing schedule - complete all yellow fields)"]
["Sheet 3:","Detail Descriptions C2.2",null,null,"(Detailed item descriptions for reference)"]
["Sheet 4:","Foreign Currency Schedule",null,null,"(Complete ONLY if quoting foreign currency components)"]

{"sheet":"Price Schedule C2.2 - Valves","index":1,"n_rows":746,"n_cols":14,"rows_kept":746,"merged":[[0,0,0,13],[1,0,1,13],[2,11,2,12],[3,0,3,6],[4,1,4,3],[4,5,4,6],[5,1,5,3],[5,5,5,6],[6,1,6,3],[6,5,6,6],[7,1,7,3],[7,5,7,10],[8,0,8,10],[9,0,9,10],[734,0,734,13],[735,0,735,13],[738,0,738,13],[742,0,742,13],[743,3,743,4],[744,1,744,4],[745,0,745,4]]}
["ESKOM HOLDINGS SOC LTD"]
["PRICE SCHEDULE - SUPPLIER QUOTATION FORM"]
[{"$nulls":11},"QUOTE SUMMARY"]
["SUPPLIER INFORMATION",{"$nulls":7},"TENDER VALIDITY",null,null,"Total Line Items:",{"$f":"COUNTA(A12:A746)","v":734}]
["Company Name:",{"$nulls":3},"Contact Person:",{"$nulls":3},"Tender Closing Date:",null,null,"Items Quoted (ZAR price):",{"$f":"COUNTIF(J12:J746,\">0\")","v":0}]
["Email:",{"$nulls":3},"Phone:",{"$nulls":3},"Quote Validity Period:","180 days from Tender Closing Date",null,"Equivalent Items Offered:",{"$f":"COUNTIF(G12:G746,\"Equivalent\")","v":0}]
["Quote Reference:",{"$nulls":3},"Quote Date:",{"$nulls":3},"Quote Valid Until:","(Auto-calculates when closing date entered)",null,"Obsolete - Alt Offered:",{"$f":"COUNTIF(G12:G746,\"Obsolete - Alternative Offered\")","v":0}]
["Tender Enquiry No:","E2979GXPOU",null,null,"Description:","The supply and delivery of various valves and valve components on an \"as and when\" required basis for all Peaking Power Stations for a period of five (5) years",{"$nulls":5},"Cannot Supply:",{"$f":"COUNTIF(G12:G746,\"Cannot Supply\")","v":0}]
["⚠️ INSTRUCTIONS: Complete YELLOW fields only. | Column G: Select status (Original/Equivalent/Obsolete - Alternative Offered/Cannot Supply) | Column J: Enter Unit Price in ZAR | Column L: Enter Lead Time in days | Column M: Select Yes/No for Datasheet Submitted | Column N: Add any supplier notes. | For foreign currency items, also complete the 'Foreign Currency Schedule' sheet.",{"$nulls":10},"Datasheets Submitted:",{"$f":"COUNTIF(M12:M746,\"Yes\")","v":0}]
["📌 NOTE: If quoting foreign currency components, you MUST complete the 'Foreign Currency Schedule' sheet. Refer to ITT Annexure F - importers cannot claim profit on foreign goods/services."]
["Item Number","Material","Short Text","Quantity Requested","Unit of Measure","Plant","Equivalent/Obsolete Status","Equivalent Item","Deviations","Unit Price (ZAR)","Total Price (ZAR)","Lead Time (Days)","Datasheet Submitted","Supplier Notes"]
[1,"0023834","VALVE SLND:35 MM;2 WAY;125 VDC;NPT;SS",10,"EA","Acacia Gas Turbine",{"$nulls":4},{"$f":"IF(J12=\"\",\"\",D12*J12)","v":""}]
[2,"0023886","VALVE BTRFLY:WAFER;150 MM;FLANGE;STL;AIR",10,"EA","Port Rex Power Station",{"$nulls":4},""]
[3,"0023887","VALVE BTRFLY:WAFER;150 MM;FLANGE;STL;AIR",10,"EA","Port Rex Power Station",{"$nulls":4},""]
[4,"0023899","VALVE:CONTROL",10,"EA","Port Rex Power Station",{"$nulls":4},""]
[5,"0023900","ASSY:AIR RELEASE VALVE FILTER;42 IN",10,"EA","Acacia Gas Turbine",{"$nulls":4},""]
[6,"0023905","VALVE SLND:25 MM;2 WAY;110 VAC; 120 VDC",10,"EA","Port Rex Power Station",{"$nulls":4},""]
[7,"0023909","VALVE:TEMPERATURE CONTROL;40 MM;150 BAR",10,"EA","Acacia Gas Turbine",{"$nulls":4},""]
[8,"0041833","VALVE:COMPRESSOR;175 MM;PRESSURE;STL",10,"EA","Ingula Pump Storage",{"$nulls":4},""]
[9,"0043039","HEAD CYL:1ST STG VALVE",10,"EA","Palmiet Pumped Storage",{"$nulls":4},""]
[10,"0043262","VALVE:SUCTION;144 MM;COMPRESSION;SS",10,"EA","Drakensberg Pumped Storage",{"$nulls":4},""]
[11,"0043264","VALVE:SUCTION;104 MM;COMPRESSION;SS",10,"EA","Drakensberg Pumped Storage",{"$nulls":4},""]
[12,"0043264","VALVE:SUCTION;104 MM;COMPRESSION;SS",10,"EA","Drakensberg Pumped Storage",{"$nulls":4},""]
[13,"0043264","VALVE:SUCTION;104 MM;COMPRESSION;SS",10,"EA","Drakensberg Pumped Storage",{"$nulls":4},""]
[14,"0043265","VALVE:DISCHARGE;164 MM;COMPRESSION;SS",10,"EA","Drakensberg Pumped Storage",{"$nulls":4},""]
[15,"0062308","VALVE RELF:24 X 12 MM;14.5 KGF/CM;BRS",10,"EA","Palmiet Pumped Storage",{"$nulls":4},""]
[16,"0062309","VALVE SLND:1/4 IN;3 WAY;220 VDC;35;FNPT",10,"EA","Palmiet Pumped Storage",{"$nulls":4},""]
[17,"0062311","VALVE SLND:3/8 IN;2 WAY;220 VDC;0.7/14",5,"EA","Palmiet Pumped Storage",{"$nulls":4},""]
[18,"0062312","VALVE SLND:10 MM;4/2 WAY;250 VAC;315 BAR",10,"EA","Palmiet Pumped Storage",{"$nulls":4},""]
[19,"0062413","VALVE SLND:12 MM;4 WAY;240 - 250 VDC;BRS",10,"EA","Drakensberg Pumped Storage",{"$nulls":4},""]
[20,"0062540","VALVE SLND:220 V",10,"EA","Ingula Pump Storage",{"$nulls":4},""]
[21,"0062654","VALVE GATE:200 MM;SOLID WEDGE;FLANGE;CI",10,"EA","Vanderkloof Hydro Station",{"$nulls":4},""]
[22,"0062790","VALVE SLND:8 MM;2 WAY;120 VAC;150 LB;STL",10,"EA","Port Rex Power Station",{"$nulls":4},""]
[23,"0062793","VALVE SLND:100 MM;2 WAY;110/120 VAC;2.5",10,"EA","Vanderkloof Hydro Station",{"$nulls":4},""]
[24,"0063152","VALVE GATE:3/4 IN;SOLID WEDGE;FLANGE;BRS",10,"EA","Drakensberg Pumped Storage",{"$nulls":4},""]
[25,"0063348","VALVE BALL:3/4 IN;1000 KPA;FEMALE THD",10,"EA","Drakensberg Pumped Storage",{"$nulls":4},""]
[26,"0063385","SEAT:DISC SAFETY VALVE;SQ 0.514 IN",10,"EA","Ingula Pump Storage",{"$nulls":4},""]
[27,"0065786","VALVE GATE:250 MM;FLANGE;250 MM;STL;16",10,"EA","Drakensberg Pumped Storage",{"$nulls":4},""]
[28,"0065917","VALVE RELF:45 X 40 MM;70 BAR;NPT X FNPT",6,"EA","Drakensberg Pumped Storage",{"$nulls":4},""]
[29,"0065928","BALL VLV:16 MM;STL",50,"EA","Ingula Pump Storage",{"$nulls":4},""]
{"$rows_left_out":707}
{"sheet":"Detail Descriptions C2.2","index":2,"n_rows":728,"n_cols":3,"rows_kept":728,"merged":[[0,0,0,2],[1,0,1,2],[2,0,2,2],[3,0,3,2],[727,1,727,2]]}
["ESKOM HOLDINGS SOC LTD"]
["DETAIL DESCRIPTIONS - PRICE SCHEDULE C2.2"]
["Tender Enquiry No: E2979GXPOU - Supply and delivery of various valves and valve components for Peaking Power Stations"]
["📌 This sheet provides detailed descriptions for each material code. The Item Number corresponds to the line item on the Price Schedule."]
["Item Number","Material Code","Purchase Order Description"]
[1,"0023834","VALVE, SOLENOID: PIPE SIZE: 35 MM; STYLE: 2 WAY; POTENTIAL: 125 VDC; CONNECTION: NPT; BODY MATERIAL: STAINLESS STEEL; OPERATED: PRESSURE; ENCLOSURE RATING: IP67; MEDIUM: FUEL; SUPPL P/N: 679V100A; REFERENCE NO: 1142; 711680; FUEL SHUT OFF, MAKE ALTAIR"]
[2,"0023886","VALVE, BUTTERFLY: TYPE: WAFER; VALVE SIZE: 150 MM; CONNECTION: FLANGE; BODY MATERIAL: STL; OPERATED: AIR; TRIM: DISC STL; ACTUATOR/ASSY,BLEED"]
[3,"0023887","VALVE, BUTTERFLY: TYPE: WAFER; VALVE SIZE: 150 MM; CONNECTION: FLANGE; BODY MATERIAL: STL; OPERATED: AIR; TRIM: DISC STL; ACTUATOR AND VALVE ASSY; BLEED"]
[4,"0023899","VALVE: TYPE: CONTROL; ASSY; AIR STARTER"]
[5,"0023900","ASSEMBLY: TYPE: AIR RELEASE VALVE FILTER; DIMENSIONS: 42 IN"]
[6,"0023905","VALVE, SOLENOID: PIPE SIZE: 25 MM; STYLE: 2 WAY; POTENTIAL: 110 VAC; 120 VDC; DESIGN RATING: 115/225/300 KPA; CONNECTION: FNPT; BODY MATERIAL: BRASS; OPERATED: AIR; ENCLOSURE RATING: IP67; MEDIUM: AIR/GAS/WATER; POWER: 20 W; ORIFICE SIZE: 25 MM; FREQUENCY 50/60 HZ, FOR USE ON COMPRESSOR"]
[7,"0023909","VALVE: TYPE: TEMPERATURE CONTROL; VALVE SIZE: 40 MM; DESIGN RATING: 150 BAR; CONNECTION: FLANGE; OPERATED: TEMPERATURE; BODY MATERIAL: STL; STYLE: BOLTED BONNET; TRIM: BONNET STL; DISC SS; GRADE: WC8; MODEL NO: 83937-3; REFERENCE NO: E76L375; RANGE: 150 - 220, MAKE ROBERSHAW"]
[8,"0041833","VALVE: TYPE: COMPRESSOR; VALVE SIZE: 175 MM; OPERATED: PRESSURE; BODY MATERIAL: STL; TRIM: DISC SS; 2ND STAGE CONCENTRIC"]
[9,"0043039","HEAD, CYLINDER: TYPE: 1ST STG VALVE; SUPPL P/N: 4656; ITEM 23 POS 230, SIZE 128MM X 128 MM X 20 MM;USED ON THE SULZER BURCKHART COMPRESSOR TYPE C4N2F"]
[10,"0043262","VALVE: TYPE: SUCTION; VALVE SIZE: 144 MM; CONNECTION: COMPRESSION; OPERATED: PRESSURE; BODY MATERIAL: STAINLESS STEEL; TRIM: DISC STL; REFERENCE NO: HT303811; 2ND STAGE; 20P-4PORTS; 46.3MM THK PLATE; 88MM THK O/A; WITH HEX NUT, WASHER AND SPLIT PIN"]
[11,"0043264","VALVE: TYPE: SUCTION; VALVE SIZE: 104 MM; CONNECTION: COMPRESSION; OPERATED: PRESSURE; BODY MATERIAL: STAINLESS STEEL; TRIM: DISC STL; REFERENCE NO: HT303815; 4TH STAGE; 20P-2PORTS; 46.3MM THK PLATE; 89MM THK O/A; WITH HEX NUT, WASHER AND SPLIT PIN"]
[12,"0043264","VALVE: TYPE: SUCTION; VALVE SIZE: 104 MM; CONNECTION: COMPRESSION; OPERATED: PRESSURE; BODY MATERIAL: STAINLESS STEEL; TRIM: DISC STL; REFERENCE NO: HT303815; 4TH STAGE; 20P-2PORTS; 46.3MM THK PLATE; 89MM THK O/A; WITH HEX NUT, WASHER AND SPLIT PIN"]
[13,"0043264","VALVE: TYPE: SUCTION; VALVE SIZE: 104 MM; CONNECTION: COMPRESSION; OPERATED: PRESSURE; BODY MATERIAL: STAINLESS STEEL; TRIM: DISC STL; REFERENCE NO: HT303815; 4TH STAGE; 20P-2PORTS; 46.3MM THK PLATE; 89MM THK O/A; WITH HEX NUT, WASHER AND SPLIT PIN"]
[14,"0043265","VALVE: TYPE: DISCHARGE; VALVE SIZE: 164 MM; CONNECTION: COMPRESSION; OPERATED: PRESSURE; BODY MATERIAL: STAINLESS STEEL; TRIM: DISC STL; REFERENCE NO: HT303810; ASSY; 1ST STAGE 20P- 5PORTS; 46.0MM THK PLATE; 70MM THK O/A; WITH HEX NUT AND SPLIT PIN"]
[15,"0062308","VALVE, RELIEF: VALVE SIZE: 24 X 12 MM; SET PRESSURE: 14.5 KGF/CM; CONNECTION: NPT X FNPT; BODY MATERIAL: BRASS; REFERENCE NO: M096-84176222/23P10; SAFETY; POP; TYPE RCX-SO; SEAT DIA. 12MM"]
[16,"0062309","VALVE, SOLENOID: PIPE SIZE: 1/4 IN; STYLE: 3 WAY; POTENTIAL: 220 VDC; DESIGN RATING: 35 KGF/CM; CONNECTION: FNPT; BODY MATERIAL: BRASS; MEDIUM: AIR/GAS/OIL/WATER; POWER: 9.7 W; ORIFICE SIZE: 3/64 IN; DRAWING NO: M096-8417222/23P8 REV 1; CAT NO: T8262D19; REFERENCE NO: 364202; 8321A2; GENERAL PURPOSE ENCLOSURE"]
[17,"0062311","VALVE, SOLENOID: PIPE SIZE: 3/8 IN; STYLE: 2 WAY; POTENTIAL: 220 VDC; DESIGN RATING: 0.7/14 KGF/CM; CONNECTION: FNPT; BODY MATERIAL: BRASS; MEDIUM: AIR/GAS/OIL/WATER; POWER: 9.7 W; ORIFICE SIZE: 9/32 IN; REFERENCE NO: 364201; 8263D19; GENERAL PURPOSE ENCLOSURE"]
[18,"0062312","VALVE, SOLENOID: PIPE SIZE: 10 MM; STYLE: 4/2 WAY; POTENTIAL: 250 VAC; DESIGN RATING: 315 BAR; CONNECTION: COMPRESSION; BODY MATERIAL: STEEL; OPERATED: DC SOLENOID; ENCLOSURE RATING: IP54; MEDIUM: AIR/LIQUID; POWER: 36 W; MANUF P/N: S10G51G0230615MV; CAT NO: 52051.9000; HERION DIRECTIONAL CONTROL VALVE - PRESSURE TEST CERTIFICATES TO BE SUPPLIED ON DELIVERY"]
[19,"0062413","VALVE, SOLENOID: PIPE SIZE: 12 MM; STYLE: 4 WAY; POTENTIAL: 240 - 250 VDC; DESIGN RATING: 70-700 KPA; CONNECTION: FNPT; BODY MATERIAL: BRASS; OPERATED: PRESSURE; ENCLOSURE RATING: IP65 EN 60529; MEDIUM: AIR/OIL/WATER; POWER: 11.2 W; APPLICATION: BLOWDOWN COMPRESSOR; REFERENCE NO: WP8345E001; GENERAL PURPOSE ENCLOSURE; 240 VDC COIL"]
[20,"0062540","VALVE, SOLENOID: POTENTIAL: 220 V; SUPPL P/N: S2155"]
[21,"0062654","VALVE, GATE: VALVE SIZE: 200 MM; TYPE: SOLID WEDGE; CONNECTION: FLANGE; BODY MATERIAL: CI; TRIM: BONNET CI; OPERATED: HANDWHEEL; STEM DESIGN: RISING OUTSIDE SCREW; STYLE: BOLTED BONNET; SUPPL P/N: Y1501-11"]
[22,"0062790","VALVE, SOLENOID: PIPE SIZE: 8 MM; STYLE: 2 WAY; POTENTIAL: 120 VAC; DESIGN RATING: 150 LB; CONNECTION: FNPT; BODY MATERIAL: STEEL; MEDIUM: AIR/LIQUID; POWER: 10 W; ORIFICE SIZE: 1/16 X 3/64 IN; 60 HZ; GENERAL PURPOSE ENCLOSURE"]
[23,"0062793","VALVE, SOLENOID: PIPE SIZE: 100 MM; STYLE: 2 WAY; POTENTIAL: 110/120 VAC; DESIGN RATING: 2.5 MPA; CONNECTION: FLANGE; BODY MATERIAL: STEEL; OPERATED: SOLENOID; ENCLOSURE RATING: IP 65 (EN 60529); MEDIUM: WATER; POWER: 220 VAC; CURRENT: 0.45 A; APPLICATION: GEN BEARING COOLER CW FLOW CONTROL; SPECIFICATION: PED; MANUF P/N: 8651000.9504.22050; REFERENCE NO: 27148735 & 27148736; SOLENOID VALVE INCLUDING A PISTON TYPE 2-WAY VALVE AND ELECTRICAL SOLENOID; DUTY CYCLE: 100% ED; VOLTAGE: FREQUENCY: 50HZ; VALVE MECHANICAL DETAILS: VALVE TYPE: 2/2 WAY PISTON VALVE; OPERATING PRESSURE: 0 - 25 BAR; RATED FLOW RATE: 125 M3/H = 34.7 L/S;VALVE MECHANICAL INTERFACE (FLANGE) DETAILS: FLANGE-TO-FLANGE FACE DIMENSION: 350MM; FLANGE STANDARD AND CLASS/TABLE: 100NB BS 4504 16/3;FLANGE OD = Ø220.0MM; RAISED FACE DIAMETER = Ø158.0MM; RAISED FACE HEIGHT = 3.0MM; NUMBER OF BOLTS = 8; BOLT HOLE DIAMETER = Ø18.0MM."]
[24,"0063152","VALVE, GATE: VALVE SIZE: 3/4 IN; TYPE: SOLID WEDGE; CONNECTION: FLANGE; BODY MATERIAL: BRASS; TRIM: DISC BRS; OPERATED: HANDWHEEL; STEM DESIGN: INSIDE SCREW; STYLE: THD BONNET; NEEDLE VALVE; FLANGE SIZE 105MM O/D; 4 HOLES 14MM DIA PCD 75MM; BS 2060"]
[25,"0063348","VALVE, BALL: VALVE SIZE: 3/4 IN; DESIGN RATING: 1000 KPA; CONNECTION: FEMALE THD; OPERATED: LEVER; STYLE: 3 WAY; 3 PIECE; TRIM: BALL SS GR 316; SOFTGOODS: SEALS PTFE; GRADE: CF8M; ACID WATER OIL AND GAS; THROUGHWAY IN BALL TO BE 20 MM"]
[26,"0063385","SEAT: TYPE: DISC SAFETY VALVE; DIMENSIONS: SQ 0.514 IN; MATERIAL: 1.4122 DIN X 35CRMO17; SUPPL P/N: 018109610; 601267620; MODEL NO: VSE2.40.25.A.50.I.22.123; USED ON SEMPELL; POSITION CODE RL01S010, RL02S009, RL03S008"]
[27,"0065786","VALVE, GATE: VALVE SIZE: 250 MM; TYPE: SPHERICAL MANUAL BYPASS; CONNECTION: FLANGE; FACE TO FACE LENGTH: 250 MM; BODY MATERIAL: STEEL; OPERATED: HANDWHEEL; TEMPERATURE RATING: 16 DEG C; DESIGN RATING: 7.2 MPA; MAIN BY-PASS VALVE VOEST-ALPINE TYPE MB9-642-5320A ESKOM NO. 0.48/1121 DESIGNE PRESSURE = 7.2 MPA VALVE, BYPASS MAIN 5320 A"]
[28,"0065917","VALVE, RELIEF: VALVE SIZE: 45 X 40 MM; SET PRESSURE: 70 BAR; CONNECTION: NPT X FNPT; BODY MATERIAL: STL; TRIM: DISC/SPRING STL; OPERATED: PRESSURE, SPRING; SAFETY"]
[29,"0065928","BALL VLV:16 MM;STL"]
[30,"0066072","VALVE, CHECK: TYPE: PISTON; VALVE SIZE: 25 MM; CONNECTION: NPT; BODY MATERIAL: STAINLESS STEEL; STYLE: THD CAP; TRIM: DISC/CAP STL; NON-RETURN; EO; TUBE SIZE 25MM OD EO TUBE CONNECTION AT BOTH ENDS"]
[31,"0066074","VALVE, BALL: VALVE SIZE: 16 MM; DESIGN RATING: 100 BAR; TEMPERATURE RATING: -200 TO 200 DEG C; CONNECTION: NPT X FNPT; BODY MATERIAL: STEEL; OPERATED: LEVER; STYLE: 4 WAY; TRIM: BALL STL; SPECIFICATION: DIN 3230; PORT TYPE: 3 X MALE; 1 X FEMALE; APPLICATION: UPSTREAM SEAL CHANGE OVER VALVE; TYPE: MANUAL OPERATED; SUPPL P/N: 1017489; REFERENCE NO: 1017489; 3 MALE X 1 FEMALE; CHANGE-OVER; BLOCK; ARGUS"]
[32,"0066205","VALVE, RELIEF: SET PRESSURE: 60 BAR; REFERENCE NO: MB8-222-2450C60B; SAFETY"]
[33,"0066232","VALVE, DIAPHRAGM: VALVE SIZE: 15 MM; CONNECTION: FNPT; BODY MATERIAL: CI; DIAPHRAGM MATERIAL: RUBBER GR Q; OPERATED: HANDWHEEL; STYLE: WEIR; REFERENCE NO: A; SAUNDERS"]
[34,"0066529","VALVE, CHECK: TYPE: SWING; VALVE SIZE: 400 MM; DESIGN RATING: 16 BAR; CONNECTION: FLANGE; BODY MATERIAL: CS; TRIM: BONNET/DISC STEEL; REFERENCE NO: 16SMZ; CHECKRITE NON-RETURN; HYDRO. TEST CERTIFICATE REQUIRED FOR ALL VALVES"]
[35,"0066535","VALVE, BALL: VALVE SIZE: 1/2 IN; DESIGN RATING: 40 LB; TEMPERATURE RATING: 25 DEG C; CONNECTION: FNPT; BODY MATERIAL: STAINLESS STEEL; OPERATED: LEVER; STYLE: UNION BONNET; TRIM: BALL SS; BRASS; WITH FIXED FEMALE FLANGE EITHER END"]
{"$rows_left_out":689}
{"sheet":"Foreign Currency Schedule","index":3,"n_rows":72,"n_cols":12,"rows_kept":72,"merged":[[0,0,0,11],[1,0,1,11],[2,0,2,11],[4,0,4,11],[5,0,5,11],[6,0,6,11],[7,0,7,11],[61,0,61,3],[65,0,65,3],[66,0,66,3],[67,0,67,3],[68,0,68,3],[71,0,71,11]]}
["ESKOM HOLDINGS SOC LTD"]
["FOREIGN CURRENCY SCHEDULE - ITT Annexure F Compliance"]
["Tender Enquiry No: E2979GXPOU - Supply and delivery of various valves and valve components for Peaking Power Stations"]
[]
["INSTRUCTIONS:"]
["1. Complete this schedule ONLY if you have foreign currency components in your pricing."]
["2. Select Item Number from dropdown in Column A. Material and Short Text will auto-populate."]
["3. Total ZAR (Col K) MUST match Unit Price (ZAR) on main Price Schedule. Refer to ITT Annexure F - importers cannot claim profit."]
[]
["Item Number","Material","Short Text","Foreign Amount","Currency","Exchange Rate","ZAR Equivalent","Handling (ZAR)","Duties (ZAR)","Freight (ZAR)","Total ZAR","Notes"]
[null,{"$f":"IF(A11=\"\",\"\",VLOOKUP(A11,'Price Schedule C2.2 - Valves'!$A$12:$C$733,2,FALSE))","v":""},{"$f":"IF(A11=\"\",\"\",VLOOKUP(A11,'Price Schedule C2.2 - Valves'!$A$12:$C$733,3,FALSE))","v":""},{"$nulls":3},{"$f":"IF(OR(D11=\"\",F11=\"\"),\"\",D11*F11)","v":""},{"$nulls":3},{"$f":"IF(G11=\"\",\"\",G11+IF(H11=\"\",0,H11)+IF(I11=\"\",0,I11)+IF(J11=\"\",0,J11))","v":""}]
[null,{"$f":"IF(A12=\"\",\"\",VLOOKUP(A12,'Price Schedule C2.2 - Valves'!$A$12:$C$733,2,FALSE))","v":""},{"$f":"IF(A12=\"\",\"\",VLOOKUP(A12,'Price Schedule C2.2 - Valves'!$A$12:$C$733,3,FALSE))","v":""},{"$nulls":3},"",{"$nulls":3},""]
[null,{"$f":"IF(A13=\"\",\"\",VLOOKUP(A13,'Price Schedule C2.2 - Valves'!$A$12:$C$733,2,FALSE))","v":""},{"$f":"IF(A13=\"\",\"\",VLOOKUP(A13,'Price Schedule C2.2 - Valves'!$A$12:$C$733,3,FALSE))","v":""},{"$nulls":3},"",{"$nulls":3},""]
[null,{"$f":"IF(A14=\"\",\"\",VLOOKUP(A14,'Price Schedule C2.2 - Valves'!$A$12:$C$733,2,FALSE))","v":""},{"$f":"IF(A14=\"\",\"\",VLOOKUP(A14,'Price Schedule C2.2 - Valves'!$A$12:$C$733,3,FALSE))","v":""},{"$nulls":3},"",{"$nulls":3},""]
[null,{"$f":"IF(A15=\"\",\"\",VLOOKUP(A15,'Price Schedule C2.2 - Valves'!$A$12:$C$733,2,FALSE))","v":""},{"$f":"IF(A15=\"\",\"\",VLOOKUP(A15,'Price Schedule C2.2 - Valves'!$A$12:$C$733,3,FALSE))","v":""},{"$nulls":3},"",{"$nulls":3},""]
[null,{"$f":"IF(A16=\"\",\"\",VLOOKUP(A16,'Price Schedule C2.2 - Valves'!$A$12:$C$733,2,FALSE))","v":""},{"$f":"IF(A16=\"\",\"\",VLOOKUP(A16,'Price Schedule C2.2 - Valves'!$A$12:$C$733,3,FALSE))","v":""},{"$nulls":3},"",{"$nulls":3},""]
[null,{"$f":"IF(A17=\"\",\"\",VLOOKUP(A17,'Price Schedule C2.2 - Valves'!$A$12:$C$733,2,FALSE))","v":""},{"$f":"IF(A17=\"\",\"\",VLOOKUP(A17,'Price Schedule C2.2 - Valves'!$A$12:$C$733,3,FALSE))","v":""},{"$nulls":3},"",{"$nulls":3},""]
[null,{"$f":"IF(A18=\"\",\"\",VLOOKUP(A18,'Price Schedule C2.2 - Valves'!$A$12:$C$733,2,FALSE))","v":""},{"$f":"IF(A18=\"\",\"\",VLOOKUP(A18,'Price Schedule C2.2 - Valves'!$A$12:$C$733,3,FALSE))","v":""},{"$nulls":3},"",{"$nulls":3},""]
[null,{"$f":"IF(A19=\"\",\"\",VLOOKUP(A19,'Price Schedule C2.2 - Valves'!$A$12:$C$733,2,FALSE))","v":""},{"$f":"IF(A19=\"\",\"\",VLOOKUP(A19,'Price Schedule C2.2 - Valves'!$A$12:$C$733,3,FALSE))","v":""},{"$nulls":3},"",{"$nulls":3},""]
[null,{"$f":"IF(A20=\"\",\"\",VLOOKUP(A20,'Price Schedule C2.2 - Valves'!$A$12:$C$733,2,FALSE))","v":""},{"$f":"IF(A20=\"\",\"\",VLOOKUP(A20,'Price Schedule C2.2 - Valves'!$A$12:$C$733,3,FALSE))","v":""},{"$nulls":3},"",{"$nulls":3},""]
[null,{"$f":"IF(A21=\"\",\"\",VLOOKUP(A21,'Price Schedule C2.2 - Valves'!$A$12:$C$733,2,FALSE))","v":""},{"$f":"IF(A21=\"\",\"\",VLOOKUP(A21,'Price Schedule C2.2 - Valves'!$A$12:$C$733,3,FALSE))","v":""},{"$nulls":3},"",{"$nulls":3},""]
[null,{"$f":"IF(A22=\"\",\"\",VLOOKUP(A22,'Price Schedule C2.2 - Valves'!$A$12:$C$733,2,FALSE))","v":""},{"$f":"IF(A22=\"\",\"\",VLOOKUP(A22,'Price Schedule C2.2 - Valves'!$A$12:$C$733,3,FALSE))","v":""},{"$nulls":3},"",{"$nulls":3},""]
[null,{"$f":"IF(A23=\"\",\"\",VLOOKUP(A23,'Price Schedule C2.2 - Valves'!$A$12:$C$733,2,FALSE))","v":""},{"$f":"IF(A23=\"\",\"\",VLOOKUP(A23,'Price Schedule C2.2 - Valves'!$A$12:$C$733,3,FALSE))","v":""},{"$nulls":3},"",{"$nulls":3},""]
[null,{"$f":"IF(A24=\"\",\"\",VLOOKUP(A24,'Price Schedule C2.2 - Valves'!$A$12:$C$733,2,FALSE))","v":""},{"$f":"IF(A24=\"\",\"\",VLOOKUP(A24,'Price Schedule C2.2 - Valves'!$A$12:$C$733,3,FALSE))","v":""},{"$nulls":3},"",{"$nulls":3},""]
[null,{"$f":"IF(A25=\"\",\"\",VLOOKUP(A25,'Price Schedule C2.2 - Valves'!$A$12:$C$733,2,FALSE))","v":""},{"$f":"IF(A25=\"\",\"\",VLOOKUP(A25,'Price Schedule C2.2 - Valves'!$A$12:$C$733,3,FALSE))","v":""},{"$nulls":3},"",{"$nulls":3},""]
[null,{"$f":"IF(A26=\"\",\"\",VLOOKUP(A26,'Price Schedule C2.2 - Valves'!$A$12:$C$733,2,FALSE))","v":""},{"$f":"IF(A26=\"\",\"\",VLOOKUP(A26,'Price Schedule C2.2 - Valves'!$A$12:$C$733,3,FALSE))","v":""},{"$nulls":3},"",{"$nulls":3},""]
[null,{"$f":"IF(A27=\"\",\"\",VLOOKUP(A27,'Price Schedule C2.2 - Valves'!$A$12:$C$733,2,FALSE))","v":""},{"$f":"IF(A27=\"\",\"\",VLOOKUP(A27,'Price Schedule C2.2 - Valves'!$A$12:$C$733,3,FALSE))","v":""},{"$nulls":3},"",{"$nulls":3},""]
[null,{"$f":"IF(A28=\"\",\"\",VLOOKUP(A28,'Price Schedule C2.2 - Valves'!$A$12:$C$733,2,FALSE))","v":""},{"$f":"IF(A28=\"\",\"\",VLOOKUP(A28,'Price Schedule C2.2 - Valves'!$A$12:$C$733,3,FALSE))","v":""},{"$nulls":3},"",{"$nulls":3},""]
[null,{"$f":"IF(A29=\"\",\"\",VLOOKUP(A29,'Price Schedule C2.2 - Valves'!$A$12:$C$733,2,FALSE))","v":""},{"$f":"IF(A29=\"\",\"\",VLOOKUP(A29,'Price Schedule C2.2 - Valves'!$A$12:$C$733,3,FALSE))","v":""},{"$nulls":3},"",{"$nulls":3},""]
[null,{"$f":"IF(A30=\"\",\"\",VLOOKUP(A30,'Price Schedule C2.2 - Valves'!$A$12:$C$733,2,FALSE))","v":""},{"$f":"IF(A30=\"\",\"\",VLOOKUP(A30,'Price Schedule C2.2 - Valves'!$A$12:$C$733,3,FALSE))","v":""},{"$nulls":3},"",{"$nulls":3},""]
[null,{"$f":"IF(A31=\"\",\"\",VLOOKUP(A31,'Price Schedule C2.2 - Valves'!$A$12:$C$733,2,FALSE))","v":""},{"$f":"IF(A31=\"\",\"\",VLOOKUP(A31,'Price Schedule C2.2 - Valves'!$A$12:$C$733,3,FALSE))","v":""},{"$nulls":3},"",{"$nulls":3},""]
[null,{"$f":"IF(A32=\"\",\"\",VLOOKUP(A32,'Price Schedule C2.2 - Valves'!$A$12:$C$733,2,FALSE))","v":""},{"$f":"IF(A32=\"\",\"\",VLOOKUP(A32,'Price Schedule C2.2 - Valves'!$A$12:$C$733,3,FALSE))","v":""},{"$nulls":3},"",{"$nulls":3},""]
[null,{"$f":"IF(A33=\"\",\"\",VLOOKUP(A33,'Price Schedule C2.2 - Valves'!$A$12:$C$733,2,FALSE))","v":""},{"$f":"IF(A33=\"\",\"\",VLOOKUP(A33,'Price Schedule C2.2 - Valves'!$A$12:$C$733,3,FALSE))","v":""},{"$nulls":3},"",{"$nulls":3},""]
[null,{"$f":"IF(A34=\"\",\"\",VLOOKUP(A34,'Price Schedule C2.2 - Valves'!$A$12:$C$733,2,FALSE))","v":""},{"$f":"IF(A34=\"\",\"\",VLOOKUP(A34,'Price Schedule C2.2 - Valves'!$A$12:$C$733,3,FALSE))","v":""},{"$nulls":3},"",{"$nulls":3},""]
[null,{"$f":"IF(A35=\"\",\"\",VLOOKUP(A35,'Price Schedule C2.2 - Valves'!$A$12:$C$733,2,FALSE))","v":""},{"$f":"IF(A35=\"\",\"\",VLOOKUP(A35,'Price Schedule C2.2 - Valves'!$A$12:$C$733,3,FALSE))","v":""},{"$nulls":3},"",{"$nulls":3},""]
[null,{"$f":"IF(A36=\"\",\"\",VLOOKUP(A36,'Price Schedule C2.2 - Valves'!$A$12:$C$733,2,FALSE))","v":""},{"$f":"IF(A36=\"\",\"\",VLOOKUP(A36,'Price Schedule C2.2 - Valves'!$A$12:$C$733,3,FALSE))","v":""},{"$nulls":3},"",{"$nulls":3},""]
[null,{"$f":"IF(A37=\"\",\"\",VLOOKUP(A37,'Price Schedule C2.2 - Valves'!$A$12:$C$733,2,FALSE))","v":""},{"$f":"IF(A37=\"\",\"\",VLOOKUP(A37,'Price Schedule C2.2 - Valves'!$A$12:$C$733,3,FALSE))","v":""},{"$nulls":3},"",{"$nulls":3},""]
[null,{"$f":"IF(A38=\"\",\"\",VLOOKUP(A38,'Price Schedule C2.2 - Valves'!$A$12:$C$733,2,FALSE))","v":""},{"$f":"IF(A38=\"\",\"\",VLOOKUP(A38,'Price Schedule C2.2 - Valves'!$A$12:$C$733,3,FALSE))","v":""},{"$nulls":3},"",{"$nulls":3},""]
[null,{"$f":"IF(A39=\"\",\"\",VLOOKUP(A39,'Price Schedule C2.2 - Valves'!$A$12:$C$733,2,FALSE))","v":""},{"$f":"IF(A39=\"\",\"\",VLOOKUP(A39,'Price Schedule C2.2 - Valves'!$A$12:$C$733,3,FALSE))","v":""},{"$nulls":3},"",{"$nulls":3},""]
[null,{"$f":"IF(A40=\"\",\"\",VLOOKUP(A40,'Price Schedule C2.2 - Valves'!$A$12:$C$733,2,FALSE))","v":""},{"$f":"IF(A40=\"\",\"\",VLOOKUP(A40,'Price Schedule C2.2 - Valves'!$A$12:$C$733,3,FALSE))","v":""},{"$nulls":3},"",{"$nulls":3},""]
{"$rows_left_out":32}