{"text_format":"1","workbook":"xlsx","n_sheets":10,"sheets":["Summary","Functional","Security","Cloud","Network","Integration and Testing","Demonstration","Priority Ratings","Config","Concerns and Recommendations"],"not_rendered":{"charts":0,"images":2,"macros":1,"external_links":3,"defined_names":24,"comments":0,"pivot_tables":0},"unopened":[],"bounds":{"document_bytes":16777216,"sheet_cells":100000,"rows_first":2000,"rows_last":500,"rows_between":2000,"halvings":0,"cell_chars":16384,"cell_head_chars":4096},"cells_cut":0,"cells_raw":0,"read":"whole","date_system":"1900"}

{"sheet":"Summary","index":0,"n_rows":39,"n_cols":12,"rows_kept":39,"cut":false,"hidden":false,"merged":[[28,6,28,9],[28,0,28,3],[29,6,29,9],[21,6,21,7],[22,5,26,5],[22,9,26,9],[23,0,23,3],[24,0,24,3],[25,0,26,3],[25,4,26,4],[21,0,22,3],[21,4,22,4],[7,0,7,9],[8,0,8,9],[9,0,9,9],[22,10,27,10],[17,0,17,4],[18,0,18,4],[19,0,19,3],[20,0,20,3],[27,0,27,3],[10,0,10,9],[11,0,11,9],[12,0,12,9],[13,0,13,9]]}
["Automatic Identification Data Capture"]
["MWP1057CX Tender"]
["Tenderer:"]
["Evaluated by:"]
[]
["Evaluation Criteria"]
[]
["Important Notes: "]
["1. Please indicate location of answers to the criteria and where required answer yes or no. To be included in Comments tab per sheet."]
["2. The qualified solution service provider shall do a product demo of the proposed product to be presented to Eskom.  This is mandatory. "]
{"$rows_left_out":30}
{"sheet":"Functional","index":1,"n_rows":23,"n_cols":13,"rows_kept":23,"cut":false,"hidden":false,"merged":[[0,0,0,2]]}
[{"$f":"Summary!A1","v":"Automatic Identification Data Capture"}]
["MWP1057CX Tender",null,null,null,null,null,null,null,null,null,"Scoring (Sliding scale)"]
["Tenderer:",null,null,null,null,null,null,null,null,null,"100% - Fully compliant"]
["Evaluated by:",null,null,null,null,null,null,null,null,null,"50%-Partially compliant"]
[null,null,null,null,null,null,null,null,null,null,"0%-Non compliance"]
[null,null,null,null,null,null,null,"Weight\n(agreed by evaluation team members)",null,"Score\n(determined by each evaluation team member during evaluation. Will be averaged for final scores)","Score"]
["ID","Type","Criterion","Solution","Functional Requirement","Requirement description","Priority Description","Priority\n","Weighted Question","Scoring","Answer\n(0,50,100%)","Weighted Answer","Comments"]
[1,"Meeting the Scope of Work Required","How well has the Tenderer described how scope requirements will be met?  Do they understand what needs to be done?  List concerns in Comments.","AIDC (Barcode, RFID, QR Code)","Goods Receipt","Capture order number, SAP retrieve order details and select lines to do goods receipt - Scan delivery note with hand held device and Upload delivery note to SAP transaction - Supplier sign on hand held device - If Serialize materials delivered then\nCapture / Scan serial number - Capture the warranty information and Scan the warranty document and upload to SAP - Process goods receipt into blocked stock or QI blocked stock or Queue stock - Print label and stick label for binning","Show stopper",{"$f":"IF(G8='[3]Priority Ratings'!$C$21,'[3]Priority Ratings'!$B$21,IF(G8='[3]Priority Ratings'!$C$22,'[3]Priority Ratings'!$B$22,IF(G8='[3]Priority Ratings'!$C$23,'[3]Priority Ratings'!$B$23,IF(G8='[3]Priority Ratings'!$C$24,'[3]Priority Ratings'!$B$24,IF(G8='[3]Priority Ratings'!$C$25,'[3]Priority Ratings'!$B$25,IF(G8='[3]Priority Ratings'!$C$26,'[3]Priority Ratings'!$B$26,IF(G8='[3]Priority Ratings'!$C$27,'[3]Priority Ratings'!$B$27,\"No Rating\")))))))","v":6},{"$f":"H8/H23","v":7.407407407407407E-2},"100%: Fully comply with requirement\n50%:   Partially comply\n0%:     No compliance",0,{"$f":"I8*K8","v":0}]
[2,"Meeting the Scope of Work Required","How well has the Tenderer described how scope requirements will be met?  Do they understand what needs to be done?  List concerns in Comments.","AIDC (Barcode, RFID, QR Code)","Material Binning","System to generate a Binning task in binning list - Supervisor assign a binning task or Storage can claim the task from the binning list - Storage scan the material to see the binning information - Storage scan the Bin location label - Confirm the quantity as per the binning ticket - Stock quantity out of normal block stock into unrestricted stock ","Show stopper",{"$f":"IF(G9='[3]Priority Ratings'!$C$21,'[3]Priority Ratings'!$B$21,IF(G9='[3]Priority Ratings'!$C$22,'[3]Priority Ratings'!$B$22,IF(G9='[3]Priority Ratings'!$C$23,'[3]Priority Ratings'!$B$23,IF(G9='[3]Priority Ratings'!$C$24,'[3]Priority Ratings'!$B$24,IF(G9='[3]Priority Ratings'!$C$25,'[3]Priority Ratings'!$B$25,IF(G9='[3]Priority Ratings'!$C$26,'[3]Priority Ratings'!$B$26,IF(G9='[3]Priority Ratings'!$C$27,'[3]Priority Ratings'!$B$27,\"No Rating\")))))))","v":6},{"$f":"H9/H23","v":7.407407407407407E-2},"100%: Fully comply with requirement\n50%:   Partially comply customisation\n0%:     No compliance",0,{"$f":"I9*K9","v":0}]
[3,"Meeting the Scope of Work Required","How well has the Tenderer described how scope requirements will be met?  Do they understand what needs to be done?  List concerns in Comments.","AIDC (Barcode, RFID, QR Code)","Quality Inspection","Generate quality inspection task list - User Scan the label and select quality inspection failed - Print label to return to vendor or change the status to return to vendor - Generate return to vendor task list - Scan the label and supplier sign the handheld device","Very important",{"$f":"IF(G10='[3]Priority Ratings'!$C$21,'[3]Priority Ratings'!$B$21,IF(G10='[3]Priority Ratings'!$C$22,'[3]Priority Ratings'!$B$22,IF(G10='[3]Priority Ratings'!$C$23,'[3]Priority Ratings'!$B$23,IF(G10='[3]Priority Ratings'!$C$24,'[3]Priority Ratings'!$B$24,IF(G10='[3]Priority Ratings'!$C$25,'[3]Priority Ratings'!$B$25,IF(G10='[3]Priority Ratings'!$C$26,'[3]Priority Ratings'!$B$26,IF(G10='[3]Priority Ratings'!$C$27,'[3]Priority Ratings'!$B$27,\"No Rating\")))))))","v":4},{"$f":"H10/H23","v":4.9382716049382713E-2},"100%: Fully comply with requirement\n50%:   Partially comply \n0%:     No compliance",0,{"$f":"I10*K10","v":0}]
{"$rows_left_out":14}
{"sheet":"Security","index":2,"n_rows":13,"n_cols":13,"rows_kept":13,"cut":false,"hidden":false,"merged":[[5,6,5,8],[0,0,0,2]]}
[{"$f":"Summary!A1","v":"Automatic Identification Data Capture"}]
["MWP1057CX Tender",null,null,null,null,null,null,"Scoring (Sliding scale)"]
["Tenderer:",null,null,null,null,null,null,"100% - Fully compliant"]
["Evaluated by:",null,null,null,null,null,null,"50%-Partially compliant"]
[null,null,null,null,null,null,null,"0%-Non compliance"]
[null,null,null,null,null,null,"Priority and Weight"]
["ID","Type","Solution","Criterion","Functional Requirement","Requirement description","Priority Description","Priority\n","Weighted Question","Scoring","Answer\n(0,50,100%)","Weighted Answer","Comments"]
[1,"Meeting the Scope of Work Required","AIDC (Barcode, RFID, QR Code)","Substantiate by providing details of standards that are supported and ensure that these Capabilities are detailed in the proposal","Information Security","User Authentication\nAccess Control and User Account Management \nDoes your Proposed Solution comply and is Compatible with AD Azure and OAuth2?","Very important",{"$f":"IF(G8='[3]Priority Ratings'!$C$21,'[3]Priority Ratings'!$B$21,IF(G8='[3]Priority Ratings'!$C$22,'[3]Priority Ratings'!$B$22,IF(G8='[3]Priority Ratings'!$C$23,'[3]Priority Ratings'!$B$23,IF(G8='[3]Priority Ratings'!$C$24,'[3]Priority Ratings'!$B$24,IF(G8='[3]Priority Ratings'!$C$25,'[3]Priority Ratings'!$B$25,IF(G8='[3]Priority Ratings'!$C$26,'[3]Priority Ratings'!$B$26,IF(G8='[3]Priority Ratings'!$C$27,'[3]Priority Ratings'!$B$27,\"No Rating\")))))))","v":4},{"$f":"H8/H13","v":0.18181818181818182},"Score 100% if supporting AD Azure and OAuth2\nScore 50% if only either AD Azure or OAuth2\nScore 0% if none are supported\nEvidence: Explicit statement confirming the supported authentication methods  \n\n",0,{"$f":"I8*K8","v":0}]
[2,"Meeting the Scope of Work Required","AIDC (Barcode, RFID, QR Code)","Substantiate by providing details of standards that are supported and ensure that these Capabilities are detailed in the proposal","Information Security","E2E Encryption\nEncryption of Data in transit and in Rest\nDoes your Proposed Solution comply and is compatible with the latest TLS and Cypher Standards to protect and encrypt data? ","Critical",{"$f":"IF(G9='[3]Priority Ratings'!$C$21,'[3]Priority Ratings'!$B$21,IF(G9='[3]Priority Ratings'!$C$22,'[3]Priority Ratings'!$B$22,IF(G9='[3]Priority Ratings'!$C$23,'[3]Priority Ratings'!$B$23,IF(G9='[3]Priority Ratings'!$C$24,'[3]Priority Ratings'!$B$24,IF(G9='[3]Priority Ratings'!$C$25,'[3]Priority Ratings'!$B$25,IF(G9='[3]Priority Ratings'!$C$26,'[3]Priority Ratings'!$B$26,IF(G9='[3]Priority Ratings'!$C$27,'[3]Priority Ratings'!$B$27,\"No Rating\")))))))","v":5},{"$f":"H9/H13","v":0.22727272727272727},"Score 100% for Encryption of both data in transit and Rest\nScore 50% for only either Encryption of data in transit or Rest\nScore  0% for not supported\nEvidence: Explicit statement confirming data is Encrypted in transit and rest",0,0]
[3,"Meeting the Scope of Work Required","AIDC (Barcode, RFID, QR Code)","Substantiate by providing details of standards that are supported and ensure that these Capabilities are detailed in the proposal","Information Security","POPIA\nDoes your Proposed Solution take the POPIA requirements into Consideration\n","Critical",{"$f":"IF(G10='[3]Priority Ratings'!$C$21,'[3]Priority Ratings'!$B$21,IF(G10='[3]Priority Ratings'!$C$22,'[3]Priority Ratings'!$B$22,IF(G10='[3]Priority Ratings'!$C$23,'[3]Priority Ratings'!$B$23,IF(G10='[3]Priority Ratings'!$C$24,'[3]Priority Ratings'!$B$24,IF(G10='[3]Priority Ratings'!$C$25,'[3]Priority Ratings'!$B$25,IF(G10='[3]Priority Ratings'!$C$26,'[3]Priority Ratings'!$B$26,IF(G10='[3]Priority Ratings'!$C$27,'[3]Priority Ratings'!$B$27,\"No Rating\")))))))","v":5},{"$f":"H10/H13","v":0.22727272727272727},"Score 100% for \"yes\", score 50% for \"no\"\nEvidence: Signed letter confirming the solution adheres fully to POPIA ",0,0]
{"$rows_left_out":4}
{"sheet":"Cloud","index":3,"n_rows":27,"n_cols":13,"rows_kept":27,"cut":false,"hidden":false,"merged":[[5,6,5,8],[0,0,0,2]]}
[{"$f":"Summary!A1","v":"Automatic Identification Data Capture"}]
["MWP1057CX Tender",null,null,null,null,null,null,"Scoring (Sliding scale)"]
["Tenderer:",null,null,null,null,null,null,"100% - Fully compliant"]
["Evaluated by:",null,null,null,null,null,null,"50%-Partially compliant"]
[null,null,null,null,null,null,null,"0%-Non compliance"]
[null,null,null,null,null,null,"Priority and Weight"]
["ID","Type","Solution","Criterion","Functional Requirement","Requirement description","Priority Description","Priority\n","Weighted Question","Scoring","Answer\n(0,50,100%)","Weighted Answer","Comments"]
[1,"Meeting the Scope of Work Required","AIDC (Barcode, RFID, QR Code)","Please confirm that ESKOM retains ownership of the data that ESKOM stores, transmits, and/or creates with the cloud service.","DATA OWNERSHIP AND USE"," Data ownership and use Compliance document","Show stopper",{"$f":"IF(G8='[3]Priority Ratings'!$C$21,'[3]Priority Ratings'!$B$21,IF(G8='[3]Priority Ratings'!$C$22,'[3]Priority Ratings'!$B$22,IF(G8='[3]Priority Ratings'!$C$23,'[3]Priority Ratings'!$B$23,IF(G8='[3]Priority Ratings'!$C$24,'[3]Priority Ratings'!$B$24,IF(G8='[3]Priority Ratings'!$C$25,'[3]Priority Ratings'!$B$25,IF(G8='[3]Priority Ratings'!$C$26,'[3]Priority Ratings'!$B$26,IF(G8='[3]Priority Ratings'!$C$27,'[3]Priority Ratings'!$B$27,\"No Rating\")))))))","v":6},{"$f":"H8/H27","v":6.9767441860465115E-2},"100%: Fully comply with requirement\n0%:     No compliance",0,{"$f":"I8*K8","v":0}]
[2,"Meeting the Scope of Work Required","AIDC (Barcode, RFID, QR Code)","Does the Supplier’s compliance with copyright laws and other applicable intellectual property rights restrict the type of content ESKOM can store with the cloud service?","DATA OWNERSHIP AND USE"," Data ownership and use Compliance document","Critical",{"$f":"IF(G9='[3]Priority Ratings'!$C$21,'[3]Priority Ratings'!$B$21,IF(G9='[3]Priority Ratings'!$C$22,'[3]Priority Ratings'!$B$22,IF(G9='[3]Priority Ratings'!$C$23,'[3]Priority Ratings'!$B$23,IF(G9='[3]Priority Ratings'!$C$24,'[3]Priority Ratings'!$B$24,IF(G9='[3]Priority Ratings'!$C$25,'[3]Priority Ratings'!$B$25,IF(G9='[3]Priority Ratings'!$C$26,'[3]Priority Ratings'!$B$26,IF(G9='[3]Priority Ratings'!$C$27,'[3]Priority Ratings'!$B$27,\"No Rating\")))))))","v":5},{"$f":"H9/H27","v":5.8139534883720929E-2},"100%: Fully comply with requirement\n0%:     No compliance",0,0]
[3,"Meeting the Scope of Work Required","AIDC (Barcode, RFID, QR Code)","Do the Supplier’s terms apply to Eskom generated metadata as well?","DATA OWNERSHIP AND USE","ESKOM requires no exception for metadata.\n","Critical",{"$f":"IF(G10='[3]Priority Ratings'!$C$21,'[3]Priority Ratings'!$B$21,IF(G10='[3]Priority Ratings'!$C$22,'[3]Priority Ratings'!$B$22,IF(G10='[3]Priority Ratings'!$C$23,'[3]Priority Ratings'!$B$23,IF(G10='[3]Priority Ratings'!$C$24,'[3]Priority Ratings'!$B$24,IF(G10='[3]Priority Ratings'!$C$25,'[3]Priority Ratings'!$B$25,IF(G10='[3]Priority Ratings'!$C$26,'[3]Priority Ratings'!$B$26,IF(G10='[3]Priority Ratings'!$C$27,'[3]Priority Ratings'!$B$27,\"No Rating\")))))))","v":5},{"$f":"H10/H27","v":5.8139534883720929E-2},"100%: Fully comply with requirement\n0%:     No compliance",0,0]
{"$rows_left_out":18}
{"sheet":"Network","index":4,"n_rows":15,"n_cols":13,"rows_kept":15,"cut":false,"hidden":false,"merged":[[6,6,6,8],[0,0,0,2]]}
[{"$f":"Summary!A1","v":"Automatic Identification Data Capture"}]
["MWP1057CX Tender",null,null,null,null,null,null,"Scoring (Sliding scale)"]
["Tenderer:",null,null,null,null,null,null,"100% - Fully compliant"]
["Evaluated by:",null,null,null,null,null,null,"50%-Partially compliant"]
[null,null,null,null,null,null,null,"0%-Non compliance"]
["Evaluation Criteria"]
[null,null,null,null,null,null,"Priority and Weight"]
["ID","Type","Solution","Criterion","Functional Requirement","Requirement description","Priority Description","Priority\n","Weighted Question","Scoring","Answer\n(0,50,100%)","Weighted Answer","Comments"]
[1,"Meeting the Scope of Work Required","AIDC (Barcode, RFID, QR Code)","Vendor neutral(Teraco) ,  Connections types","Network Deployment","One or more of the following: Cross connect (one physical connect to different tenant), virtual connection (express connect) - R1000 (VLAN to supplier)","Critical",{"$f":"IF(G9='[3]Priority Ratings'!$C$21,'[3]Priority Ratings'!$B$21,IF(G9='[3]Priority Ratings'!$C$22,'[3]Priority Ratings'!$B$22,IF(G9='[3]Priority Ratings'!$C$23,'[3]Priority Ratings'!$B$23,IF(G9='[3]Priority Ratings'!$C$24,'[3]Priority Ratings'!$B$24,IF(G9='[3]Priority Ratings'!$C$25,'[3]Priority Ratings'!$B$25,IF(G9='[3]Priority Ratings'!$C$26,'[3]Priority Ratings'!$B$26,IF(G9='[3]Priority Ratings'!$C$27,'[3]Priority Ratings'!$B$27,\"No Rating\")))))))","v":5},{"$f":"H9/H15","v":0.17241379310344829},"100%: Fully comply with requirement\n50%:   Partially comply\n0%:     No compliance",0,{"$f":"I9*K9","v":0}]
[2,"Meeting the Scope of Work Required","AIDC (Barcode, RFID, QR Code)","Vendor neutral (Teraco) ","Network Deployment","The hosting facility must be a carrier and cloud neutral Data centre to interconnect to local and global service providers without the need of a 3rd party. The hosting site should provide the means for internal/direct connectivity within the facility to all major Telco's and ISP’s in South Africa. ","Show stopper",{"$f":"IF(G10='[3]Priority Ratings'!$C$21,'[3]Priority Ratings'!$B$21,IF(G10='[3]Priority Ratings'!$C$22,'[3]Priority Ratings'!$B$22,IF(G10='[3]Priority Ratings'!$C$23,'[3]Priority Ratings'!$B$23,IF(G10='[3]Priority Ratings'!$C$24,'[3]Priority Ratings'!$B$24,IF(G10='[3]Priority Ratings'!$C$25,'[3]Priority Ratings'!$B$25,IF(G10='[3]Priority Ratings'!$C$26,'[3]Priority Ratings'!$B$26,IF(G10='[3]Priority Ratings'!$C$27,'[3]Priority Ratings'!$B$27,\"No Rating\")))))))","v":6},{"$f":"H10/H15","v":0.20689655172413793},"100%: Fully comply with requirement\n50%:   Partially comply \n0%:     No compliance",0,0]
{"$rows_left_out":6}
{"sheet":"Integration and Testing","index":5,"n_rows":19,"n_cols":14,"rows_kept":19,"cut":false,"hidden":false,"merged":[[5,7,5,9],[0,0,0,2]]}
[{"$f":"Summary!A1","v":"Automatic Identification Data Capture"}]
["MWP1057CX Tender",null,null,null,null,null,null,null,null,null,null,"Scoring (Sliding scale)"]
["Tenderer:",null,null,null,null,null,null,null,null,null,null,"100% - Fully compliant"]
["Evaluated by:",null,null,null,null,null,null,null,null,null,null,"50%-Partially compliant"]
[null,null,null,null,null,null,null,null,null,null,null,"0%-Non compliance"]
[null,null,null,null,null,null,null,"Priority and Weight",null,null,"Score\n(determined by each evaluation team member during evaluation. Will be averaged for final scores)","Score"]
["ID","Type","Category","Criterion","Solution","Functional Requirement","Requirement description","Priority Description","Priority\n","Weighted Question","Scoring"," Answer\n(0,50,100%)","Weighted Answer","Comments"]
[]
[1,"Meeting the Scope of Work Required","Non Functional","Previous involvement in the end to end testing of a similar system and methodologies used)","AIDC (Barcode, RFID, QR Code)","Testing ","Provide reference customers and sites","Very important",{"$f":"IF(H9='[3]Priority Ratings'!$C$21,'[3]Priority Ratings'!$B$21,IF(H9='[3]Priority Ratings'!$C$22,'[3]Priority Ratings'!$B$22,IF(H9='[3]Priority Ratings'!$C$23,'[3]Priority Ratings'!$B$23,IF(H9='[3]Priority Ratings'!$C$24,'[3]Priority Ratings'!$B$24,IF(H9='[3]Priority Ratings'!$C$25,'[3]Priority Ratings'!$B$25,IF(H9='[3]Priority Ratings'!$C$26,'[3]Priority Ratings'!$B$26,IF(H9='[3]Priority Ratings'!$C$27,'[3]Priority Ratings'!$B$27,\"No Rating\")))))))","v":4},{"$f":"I9/I19","v":0.1},"100%: Fully comply with requirement\n50%:   Partially comply(Have experience but not a similar system)\n0%:     No experience\n",0,{"$f":"J9*L9","v":0}]
[2,"Team Organisation and Member Requirements","Non Functional","Resource model. It is a requirement that sufficient dedicated testers are allocated the project, independent of the development team. Team members have the required ISTQB testing certifications (Provide Certifications of team members)","AIDC (Barcode, RFID, QR Code)","Testing ","Experienced Test Manger must be provided","Very important",{"$f":"IF(H10='[3]Priority Ratings'!$C$21,'[3]Priority Ratings'!$B$21,IF(H10='[3]Priority Ratings'!$C$22,'[3]Priority Ratings'!$B$22,IF(H10='[3]Priority Ratings'!$C$23,'[3]Priority Ratings'!$B$23,IF(H10='[3]Priority Ratings'!$C$24,'[3]Priority Ratings'!$B$24,IF(H10='[3]Priority Ratings'!$C$25,'[3]Priority Ratings'!$B$25,IF(H10='[3]Priority Ratings'!$C$26,'[3]Priority Ratings'!$B$26,IF(H10='[3]Priority Ratings'!$C$27,'[3]Priority Ratings'!$B$27,\"No Rating\")))))))","v":4},{"$f":"I10/I19","v":0.1},"100%: > 5 years experienced Testmanager provided, resources with certification\n50%: between 2 and 5 years exeperience with certification\n0%: < 2 yearsexperience, No certification\n",0,{"$f":"J10*L10","v":0}]
{"$rows_left_out":10}
{"sheet":"Demonstration","index":6,"n_rows":44,"n_cols":13,"rows_kept":44,"cut":false,"hidden":false,"merged":[[6,6,6,8],[0,0,0,2]]}
[{"$f":"Summary!A1","v":"Automatic Identification Data Capture"}]
["MWP1057CX Tender",null,null,null,null,null,null,null,null,null,"Scoring (Sliding scale)"]
["Tenderer:",null,null,null,null,null,null,null,null,null,"100% - Fully compliant"]
["Evaluated by:",null,null,null,null,null,null,null,null,null,"50%-Partially compliant"]
[null,null,null,null,null,null,null,null,null,null,"0%-Non compliance"]
["Evaluation Criteria"]
[null,null,null,null,null,null,"Priority and Weight\n(agreed by evaluation team members)",null,null,"Score\n(determined by each evaluation team member during evaluation. Will be averaged for final scores)","Score\n(determined by each evaluation team member during evaluation. Will be averaged for final scores)"]
["ID","Type","Criterion","Solution","Functional Requirement","Requirement description","Priority Description","Priority\n","Weighted Question","Scoring","Answer\n(0,50,100%)","Weighted Answer","Comments"]
[1,"Meeting the Scope of Work Required","How well has the Tenderer described how scope requirements will be met?  Do they understand what needs to be done?  List concerns in Comments.","AIDC (Barcode, RFID, QR Code)","User Login","User log in details as per approved roles - Real time integration to SAP is required","Show stopper",{"$f":"IF(G9='[3]Priority Ratings'!$C$21,'[3]Priority Ratings'!$B$21,IF(G9='[3]Priority Ratings'!$C$22,'[3]Priority Ratings'!$B$22,IF(G9='[3]Priority Ratings'!$C$23,'[3]Priority Ratings'!$B$23,IF(G9='[3]Priority Ratings'!$C$24,'[3]Priority Ratings'!$B$24,IF(G9='[3]Priority Ratings'!$C$25,'[3]Priority Ratings'!$B$25,IF(G9='[3]Priority Ratings'!$C$26,'[3]Priority Ratings'!$B$26,IF(G9='[3]Priority Ratings'!$C$27,'[3]Priority Ratings'!$B$27,\"No Rating\")))))))","v":6},{"$f":"H9/H$44","v":3.1413612565445025E-2},"100%: Fully comply with requirement\n50%:   Partially comply\n0%:     No compliance",0,{"$f":"I9*K9","v":0}]
[2,"Meeting the Scope of Work Required","How well has the Tenderer described how scope requirements will be met?  Do they understand what needs to be done?  List concerns in Comments.","AIDC (Barcode, RFID, QR Code)","View the details and ducuments","View PO details, Reservation, Material movement documents -  Real time integration to SAP is required","Show stopper",{"$f":"IF(G10='[3]Priority Ratings'!$C$21,'[3]Priority Ratings'!$B$21,IF(G10='[3]Priority Ratings'!$C$22,'[3]Priority Ratings'!$B$22,IF(G10='[3]Priority Ratings'!$C$23,'[3]Priority Ratings'!$B$23,IF(G10='[3]Priority Ratings'!$C$24,'[3]Priority Ratings'!$B$24,IF(G10='[3]Priority Ratings'!$C$25,'[3]Priority Ratings'!$B$25,IF(G10='[3]Priority Ratings'!$C$26,'[3]Priority Ratings'!$B$26,IF(G10='[3]Priority Ratings'!$C$27,'[3]Priority Ratings'!$B$27,\"No Rating\")))))))","v":6},3.1413612565445025E-2,"100%: Fully comply with requirement\n50%:   Partially comply \n0%:     No compliance",0,0]
{"$rows_left_out":35}
{"sheet":"Priority Ratings","index":7,"n_rows":29,"n_cols":6,"rows_kept":29,"cut":false,"hidden":false,"merged":[]}
[]
[]
[]
[]
[]
[]
[]
[]
[]
[]
{"$rows_left_out":20}
{"sheet":"Config","index":8,"n_rows":13,"n_cols":7,"rows_kept":13,"cut":false,"hidden":false,"merged":[]}
[]
[null,"Solution",null,"Priority rating","Priority Description",null,"Category"]
[null,"AIDC (Barcode, RFID, QR Code)",null,0,"No interest",null,"Functional"]
[null,null,null,1,"Nice to have",null,"Technical Evaluation"]
[null,null,null,2,"Useful",null,"Integration and Testing"]
[null,null,null,3,"Important",null,"Cloud"]
[null,null,null,4,"Very important"]
[null,null,null,5,"Critical"]
[null,null,null,6,"Show stopper"]
[]
{"$rows_left_out":4}
{"sheet":"Concerns and Recommendations","index":9,"n_rows":19,"n_cols":2,"rows_kept":19,"cut":false,"hidden":false,"merged":[[2,1,2,2],[3,1,16,14],[18,1,18,2],[19,1,33,14]]}
["Note: Not applicable for the vendors / Tenderers / respondents. This sheet is not needed for issuing the Tendor. Useful for making recommendatins after evaluation."]
[null,"Please do NOT delete this sheet. "]
[null,"Recommendation"]
[]
[]
[]
[]
[]
[]
[]
{"$rows_left_out":9}