{"text_format":"3","workbook":"xlsx","n_sheets":12,"sheets":["TEC Development Guidelines","Response Guidelines","Scoring Summary","Gatekeepers","Key Requirements","Functional","Non-Functional","Integration","Testing","Security","Demo","Definitions and Abbreviations"],"not_rendered":{"images":1,"defined_names":9,"comments":8},"read":"whole","date_system":"1900"}

{"sheet":"TEC Development Guidelines","index":0,"n_rows":25,"n_cols":35,"rows_kept":25,"merged":[[1,1,1,9],[2,0,2,9],[3,1,3,9],[5,0,5,9],[6,1,6,9],[8,0,8,9],[9,1,9,9],[16,0,17,0],[16,1,17,2],[16,3,17,4],[23,0,23,9],[24,1,24,9]]}
[]
[null,"This Tab provides guidance to the TET on how the evaluation criteria must be structured and where information can be sourced.\nDelete this tab before the TEC is published with the RFP."]
["Response Guidelines"]
[null,"Once all criteria questions are complete revise the response guidelines tab, the information provided is for vendors to understand what is required of them. \nYou may need to rename or adjust the colour coding of the various tabs.\nRead through all the information removing what is not applicable and adding important information you want vendors to be aware of.\nThe template has one reference sheet (Definitions and Abbreviations) it may be necessary to provide vendors with more reference information, which can be listed here."]
[]
["Scoring Summary"]
[null,"Gatekeepers are captured here - Gatekeepers are limited to legislative and compliance related criteria only.\nDesktop evaluations and demonstrations are separate evaluation stages and the scores may not be added together.\nEnsure each stage has a defined threshold\nAdjusting the weight for each category on the scoring summary tab will automatically reflect the changes on the respective sheets.\nEvaluators scores in each category will also automatically pull through to this sheet\nThe EL must check the formulas to ensure all are working correctly before evaluations begin."]
[]
["Functional Tab"]
[null,"The functional evaluation specifically seeks to evaluate a given proposal/solution against the functional requirements which must listed in the scope of work. \n\nThe functional requirements can be sourced from the Logical Architecture Design (LAD) where this is applicable. More specifically the Functional Decomposition Model contained within the LAD, lists all the Functional Requirements carefully aligned with industry best practice to ensure complete coverage of the business need. See below the example for the first evaluation criteria."]
{"$rows_left_out":16}
{"sheet":"Response Guidelines","index":1,"n_rows":24,"n_cols":4,"rows_kept":24,"merged":[[1,1,1,10],[2,2,2,3],[3,1,3,2],[4,1,4,10],[6,2,6,10],[7,2,7,10],[9,2,9,10],[10,2,10,10],[11,2,11,10],[12,2,12,10],[14,2,14,10],[15,2,15,10],[16,1,16,2],[17,2,17,10],[18,1,18,2],[19,1,19,2],[21,1,21,10],[23,3,23,10]]}
[]
[null,"Tenderer to take note of the following key instructions:"]
[]
[]
[null,"Technical Evaluation Guidelines"]
[]
[null,"*","Complete ALL the worksheets listed below."]
[null,null,"Scoring Summary (Gatekeeper questions)"]
[null,null,"Gatekeepers"]
[null,null,"Key Requirements"]
{"$rows_left_out":15}
{"sheet":"Scoring Summary","index":2,"n_rows":20,"n_cols":5,"rows_kept":20,"merged":[[8,1,9,1],[8,2,8,3]]}
[]
[null,"Tender Number:","<insert before tender publication>"]
[null,"Transaction Description:","Enterprise Historian"]
[null,"Evaluated Tenderer's Registered Name:","<Evaluator to complete>"]
[null,"Evaluator Name and Surname:","<Evaluator to complete>","Eskom Group Technology:  Technical Evaluation Criteria"]
[null,"Date of Evaluation","<Evaluator to complete>","Scoring Summary"]
[null,"Evaluator Signature",null,"Ver 7.x "]
[]
[null,"Gatekeeper Evaluation","Tick to indicate if there are gatekeepers for this assessment:",null,true]
[null,null,{"$f":"IF(AND(E9,Gatekeepers!F8=1),\"Pass\",\"\")","v":"Pass"},{"$f":"IF(AND(E9,Gatekeepers!F8<>1),\"Fail (\"&TEXT(Gatekeepers!F8,\"0,0%\")&\")\",\"\")","v":""},{"$f":"IF(AND(E9,SUM(COUNTIF(Table1[Scoring],\"Pass\"),COUNTIF(Table1[Scoring],\"Fail\"))<>(COUNTA(Table1[Scoring])+COUNTBLANK(Table1[Scoring]))),\"Incomplete response\",\"\")","v":""}]
{"$rows_left_out":11}
{"sheet":"Gatekeepers","index":3,"n_rows":12,"n_cols":7,"rows_kept":12,"merged":[[1,4,2,5]]}
[]
[null,"Tender Number:",{"$f":"'Scoring Summary'!C2","v":"<insert before tender publication>"},null,"Eskom Group Technology: \nTechnical Evaluation Criteria\nGATEKEEPER CRITERIA"]
[null,"Transaction Description:",{"$f":"'Scoring Summary'!C3","v":"Enterprise Historian"}]
[null,"Evaluated Tenderer's Registered Name:",{"$f":"'Scoring Summary'!C4","v":"<Evaluator to complete>"},null,"Gatekeepers"]
[null,"Evaluator Name and Surname:",{"$f":"'Scoring Summary'!C5","v":"<Evaluator to complete>"}]
[null,"Date of Evaluation",{"$f":"'Scoring Summary'!C6","v":"<Evaluator to complete>"}]
[null,"Evaluator Signature"]
[{"$nulls":5},{"$f":"COUNTIF(Table1[Scoring],\"Pass\")/(COUNTA(Table1[Scoring])+COUNTBLANK(Table1[Scoring]))","v":{"v":1,"d":"100%"}}]
[null,"Gatekeeper Requirements","Mandatory Returnables - Evidence below to be provided in the technical file and numbered to align with each criteria question. ","Vendor Response: Vendor to provide answer the questions below and provide detail in their tender submission","Vendor Evidence: Location of Supporting Document/detailed response in your tender submission (state the file number, section & page number)","Scoring","Evaluator comments"]
[1,"System Implementation – Confirm that the Vendor is an accredited/endorsed PI implementation/solution provider","Provide written proof  confirming that your company is  is an accredited/endorsed PI implementation/solution provider",null,null,"Pass"]
{"$rows_left_out":3}
{"sheet":"Key Requirements","index":4,"n_rows":17,"n_cols":35,"rows_kept":17,"merged":[[1,4,2,5],[9,0,10,0],[9,1,10,2],[9,3,10,4]]}
[]
[null,"Tender Number:","<insert before tender publication>",null,"Eskom Group Technology: \nTechnical Evaluation Criteria"]
[null,"Transaction Description:",{"$f":"+'Scoring Summary'!C3","v":"Enterprise Historian"}]
[null,"Evaluated Tenderer's Registered Name:","<Evaluator to complete>",null,"Key Requirements"]
[null,"Evaluator Name and Surname:","<Evaluator to complete>"]
[null,"Date of Evaluation","<Evaluator to complete>"]
[null,"Evaluator Signature"]
[]
[]
[null,"Technical Requirements",null,"Vendor Responses",null,"Evaluator Scores"]
{"$rows_left_out":8}
{"sheet":"Functional","index":5,"n_rows":18,"n_cols":35,"rows_kept":18,"merged":[[1,4,2,5],[9,0,10,0],[9,1,10,2],[9,3,10,4]]}
[]
[null,"Tender Number:","<insert before tender publication>",null,"Eskom Group Technology:\n Technical Evaluation Criteria"]
[null,"Transaction Description:",{"$f":"+'Scoring Summary'!C3","v":"Enterprise Historian"}]
[null,"Evaluated Tenderer's Registered Name:","<Evaluator to complete>",null,"Functional"]
[null,"Evaluator Name and Surname:","<Evaluator to complete>"]
[null,"Date of Evaluation","<Evaluator to complete>"]
[null,"Evaluator Signature"]
[]
[]
[null,"Technical Requirements",null,"Vendor Responses",null,"Evaluator Scores"]
{"$rows_left_out":9}
{"sheet":"Non-Functional","index":6,"n_rows":21,"n_cols":35,"rows_kept":21,"merged":[[1,4,2,5],[9,0,10,0],[9,1,10,2],[9,3,10,4]]}
[]
[null,"Tender Number:","<insert before tender publication>",null,"Eskom Group Technology:\nTechnical Evaluation Criteria"]
[null,"Transaction Description:",{"$f":"+'Scoring Summary'!C3","v":"Enterprise Historian"}]
[null,"Evaluated Tenderer's Registered Name:","<Evaluator to complete>",null,"Non-Functional"]
[null,"Evaluator Name and Surname:","<Evaluator to complete>"]
[null,"Date of Evaluation","<Evaluator to complete>"]
[null,"Evaluator Signature"]
[]
[]
[null,"Technical Requirements",null,"Vendor Responses",null,"Evaluator Scores"]
{"$rows_left_out":12}
{"sheet":"Integration","index":7,"n_rows":31,"n_cols":35,"rows_kept":31,"hidden":true,"merged":[[1,4,2,5],[9,0,10,0],[9,1,10,2],[9,3,10,4]]}
[]
[null,"Tender Number:","<insert before tender publication>",null,"Eskom Group Technology:\nTechnical Evaluation Criteria"]
[null,"Transaction Description:",{"$f":"+'Scoring Summary'!C3","v":"Enterprise Historian"}]
[null,"Evaluated Tenderer's Registered Name:","<Evaluator to complete>",null,"Integration"]
[null,"Evaluator Name and Surname:","<Evaluator to complete>"]
[null,"Date of Evaluation","<Evaluator to complete>"]
[null,"Evaluator Signature"]
[]
[]
[null,"Technical Requirements",null,"Vendor Responses",null,"Evaluator Scores"]
{"$rows_left_out":22}
{"sheet":"Testing","index":8,"n_rows":31,"n_cols":35,"rows_kept":31,"hidden":true,"merged":[[1,4,2,5],[9,0,10,0],[9,1,10,2],[9,3,10,4]]}
[]
[null,"Tender Number:","<insert before tender publication>",null,"Eskom Group Technology:\nTechnical Evaluation Criteria"]
[null,"Transaction Description:",{"$f":"+'Scoring Summary'!C3","v":"Enterprise Historian"}]
[null,"Evaluated Tenderer's Registered Name:","<Evaluator to complete>",null,"Testing"]
[null,"Evaluator Name and Surname:","<Evaluator to complete>"]
[null,"Date of Evaluation","<Evaluator to complete>"]
[null,"Evaluator Signature"]
[]
[]
[null,"Technical Requirements",null,"Vendor Responses",null,"Evaluator Scores"]
{"$rows_left_out":22}
{"sheet":"Security","index":9,"n_rows":36,"n_cols":35,"rows_kept":36,"merged":[[1,4,2,5],[9,0,10,0],[9,1,10,2],[9,3,10,4]]}
[]
[null,"Tender Number:","<insert before tender publication>",null,"Eskom Group Technology:\nTechnical Evaluation Criteria"]
[null,"Transaction Description:",{"$f":"+'Scoring Summary'!C3","v":"Enterprise Historian"}]
[null,"Evaluated Tenderer's Registered Name:","<Evaluator to complete>",null,"Security"]
[null,"Evaluator Name and Surname:","<Evaluator to complete>"]
[null,"Date of Evaluation","<Evaluator to complete>"]
[null,"Evaluator Signature"]
[]
[]
[null,"Technical Requirements",null,"Vendor Responses",null,"Evaluator Scores"]
{"$rows_left_out":27}
{"sheet":"Demo","index":10,"n_rows":18,"n_cols":33,"rows_kept":18,"hidden":true,"merged":[[1,4,2,5],[10,0,11,0],[10,1,11,2]]}
[]
[null,"Tender Number:","<insert before tender publication>",null,"Eskom Group Technology:\nTechnical Evaluation Criteria"]
[null,"Transaction Description:","<insert before tender publication>"]
[null,"Evaluated Tenderer's Registered Name:","<Evaluator to complete>",null,"Demonstration"]
[null,"Evaluator Name and Surname:","<Evaluator to complete>"]
[null,"Date of Evaluation","<Evaluator to complete>"]
[null,"Evaluator Signature"]
[]
[]
[]
{"$rows_left_out":9}
{"sheet":"Definitions and Abbreviations","index":11,"n_rows":17,"n_cols":3,"rows_kept":17,"merged":[[1,1,1,2],[16,1,16,2]]}
[]
[null,"Abbreviations"]
[null,"PI","Plant Historian product name"]
[null,"AVEVA","Company name"]
[null,"EDNa","Product name"]
[null,"EH","Enterprise Historian"]
[null,"OEM","Original Equipment Manufacturer"]
{"$rows_empty":9}
[null,"Definitions"]