{"text_format":"3","workbook":"xlsx","n_sheets":90,"sheets":["1.2","1.3","1.4","1.5","1.6","1.7","2.1","2.2","2.3","2.4","3.1","3.2","3.3","4.1","4.2","4.3","4.4","4.5","5.1","5.2","5.3","5.4","5.5","6.1","6.2","7.1","7.2","7.3","7.4","7.5","7.6","8.1","8.2","8.3","8.4","8.5","8.7","8.6","8.8","8.9","9.1","10.1","11.1","11.2","11.3","11.4","11.5","11.6","11.7","11.8","11.9","12.1","12.2","12.3","12.4","12.5","12.6","12.7","12.8","12.9","12.10","12.11","12.12","13.2","13.3","13.4","13.5","13.6","13.8","13.9","13.10","13.11","13.12","13.13","13.14","14.1","14.2","14.3","14.4","14.5","14.6","14.7","14.8","14.9","14.10","14.11","20.1","Sch B - 13.7","Sch D - D1000","Summary"],"not_rendered":{"defined_names":209},"read":"whole","date_system":"1900"}

{"sheet":"1.2","index":0,"n_rows":182,"n_cols":9,"rows_kept":182}
[]
["C1.2","GENERAL REQUIREMENTS AND PROVISIONS",{"$nulls":3},"\n",null,null,"SCHEDULE A"]
[]
[]
["ITEM",{"$nulls":3},"DESCRIPTION","UNIT","QTY","RATE","AMT"]
[]
["C1.2.1",{"$nulls":3},"Environmental Management:"]
[]
[null,"C1.2.1.1",null,null,"Monitoring of compliance with and reporting on the EMP","month",18,null,{"$f":"IF(ISNUMBER(G9),G9*H9,IF(G9=\"-\",\"rate only\",\" \"))","v":0}]
[]
[null,"C1.2.1.2",null,null,"Dedicated environmental officer (if specified in the Contract Documentation)","month",18,null,{"$f":"IF(ISNUMBER(G11),G11*H11,IF(G11=\"-\",\"rate only\",\" \"))","v":0}]
[]
["C1.2.2",{"$nulls":3},"Programming and Reporting:"]
[]
[null,"C1.2.2.3",null,null,"Submission of a Scheme 2 Initial Programme","lump sum",1,null,{"$f":"IF(ISNUMBER(G15),G15*H15,IF(G15=\"-\",\"rate only\",\" \"))","v":0}]
[]
[null,"C1.2.2.4",null,null,"Submission of a Scheme 2 Full Programme","lump sum",1,null,{"$f":"IF(ISNUMBER(G17),G17*H17,IF(G17=\"-\",\"rate only\",\" \"))","v":0}]
[]
[null,"C1.2.2.5",null,null,"Reviewing and updating a Scheme 2 programme every month","month",18,null,{"$f":"IF(ISNUMBER(G19),G19*H19,IF(G19=\"-\",\"rate only\",\" \"))","v":0}]
[]
[null,"C1.2.2.6",null,null,"Preparation and submission of all information and reports specified in the Contract Documentation","month",18,null,{"$f":"IF(ISNUMBER(G21),G21*H21,IF(G21=\"-\",\"rate only\",\" \"))","v":0}]
[]
["C1.2.3",{"$nulls":3},"Routine road maintenance of existing public roads within the Site of the Works or other public roads outside the Site of the Works which are used as detours:"]
[]
[null,"C1.2.3.1",null,null,"Grass cutting","ha",220,null,{"$f":"IF(ISNUMBER(G25),G25*H25,IF(G25=\"-\",\"rate only\",\" \"))","v":0}]
[]
[null,"C1.2.3.2",null,null,"Drain cleaning","km",33,null,{"$f":"IF(ISNUMBER(G27),G27*H27,IF(G27=\"-\",\"rate only\",\" \"))","v":0}]
[]
[null,"C1.2.3.3",null,null,"Cleaning out culverts","m³",90,null,{"$f":"IF(ISNUMBER(G29),G29*H29,IF(G29=\"-\",\"rate only\",\" \"))","v":0}]
[]
[null,"C1.2.3.4",null,null,"Collection of rubbish / litter","km",33,null,{"$f":"IF(ISNUMBER(G31),G31*H31,IF(G31=\"-\",\"rate only\",\" \"))","v":0}]
[]
[null,"C1.2.3.8",null,null,"Replacement of damaged guardrails including posts","m",400,null,{"$f":"IF(ISNUMBER(G33),G33*H33,IF(G33=\"-\",\"rate only\",\" \"))","v":0}]
[]
[null,"C1.2.3.10",null,null,"Watering of temporary gravel deviations and existing roads used as detours","kilolitre",2500,null,{"$f":"IF(ISNUMBER(G35),G35*H35,IF(G35=\"-\",\"rate only\",\" \"))","v":0}]
[]
[null,"C1.2.3.11",null,null,"Other road maintenance work ordered by the Engineer","prov sum",1,{"v":100000,"d":"100,000.00"},{"v":100000,"d":"100,000.00"}]
[]
[null,"C1.2.3.12",null,null,"Handling cost, profit and all other charges in respect of item C1.2.3.11","%",100000,null,{"$f":"IF(ISNUMBER(G39),G39*H39,IF(G39=\"-\",\"rate only\",\" \"))","v":0}]
[]
["C1.2.4",{"$nulls":3},"Stakeholder liaison","month",18,null,{"$f":"IF(ISNUMBER(G41),G41*H41,IF(G41=\"-\",\"rate only\",\" \"))","v":0}]
[]
["C1.2.5",{"$nulls":3},"Safety:"]
[]
[null,"C1.2.5.1",null,null,"Health and safety plan","lump sum",1,null,{"$f":"IF(ISNUMBER(G45),G45*H45,IF(G45=\"-\",\"rate only\",\" \"))","v":0}]
[]
[null,"C1.2.5.2",null,null,"Implementation of health and safety plan","month",18,null,{"$f":"IF(ISNUMBER(G47),G47*H47,IF(G47=\"-\",\"rate only\",\" \"))","v":0}]
[]
["C1.2.7",{"$nulls":3},"Road safety audits:"]
[]
[null,"C1.2.7.1",null,null,"Stage 4 work zone traffic management audit","prov sum",1,{"v":100000,"d":"100,000.00"},{"$f":"IF(ISNUMBER(G51),G51*H51,IF(G51=\"-\",\"rate only\",\" \"))","v":{"v":100000,"d":"100,000.00"}}]
[]
[null,"C1.2.7.2",null,null,"Handling cost, profit and all other charges in respect of item C1.2.7.1","%",100000,null,{"$f":"IF(ISNUMBER(G53),G53*H53,IF(G53=\"-\",\"rate only\",\" \"))","v":0}]
[]
[null,"C1.2.7.3",null,null,"Stage 5 pre-opening stage traffic safety audit","prov sum",1,{"v":60000,"d":"60,000.00"},{"$f":"IF(ISNUMBER(G55),G55*H55,IF(G55=\"-\",\"rate only\",\" \"))","v":{"v":60000,"d":"60,000.00"}}]
[]
["CARRIED FORWARD",{"$nulls":7},{"$f":"SUM(I7:I55)","v":{"v":260000,"d":"260,000.00"}}]
[]
[]
["BROUGHT FORWARD",{"$nulls":7},{"$f":"I57","v":{"v":260000,"d":"260,000.00"}}]
[]
[]
[null,"C1.2.7.4",null,null,"Handling cost, profit and all other charges in respect of item C1.2.7.3","%",60000,null,{"$f":"IF(ISNUMBER(G63),G63*H63,IF(G63=\"-\",\"rate only\",\" \"))","v":0}]
[]
["C1.2.8",{"$nulls":3},"Dayworks:"]
[]
[null,"C1.2.8.1",null,null,"Personnel:"]
[]
[null,null,"(a)",null,"Unskilled labourer","h",120,null,{"$f":"IF(ISNUMBER(G69),G69*H69,IF(G69=\"-\",\"rate only\",\" \"))","v":0}]
[]
[null,null,"(b)",null,"Semi-skilled labourer","h",80,null,{"$f":"IF(ISNUMBER(G71),G71*H71,IF(G71=\"-\",\"rate only\",\" \"))","v":0}]
[]
[null,null,"(c)",null,"Skilled labourer","h",80,null,{"$f":"IF(ISNUMBER(G73),G73*H73,IF(G73=\"-\",\"rate only\",\" \"))","v":0}]
[]
[null,null,"(d)",null,"Gang leader","h",40,null,{"$f":"IF(ISNUMBER(G75),G75*H75,IF(G75=\"-\",\"rate only\",\" \"))","v":0}]
[]
[null,null,"(e)",null,"Foreman","h",40,null,{"$f":"IF(ISNUMBER(G77),G77*H77,IF(G77=\"-\",\"rate only\",\" \"))","v":0}]
[]
[null,null,"(f)",null,"Skilled Artisan","h",40,null,{"$f":"IF(ISNUMBER(G79),G79*H79,IF(G79=\"-\",\"rate only\",\" \"))","v":0}]
[]
[null,null,"(g)",null,"Flagmen","h",80,null,{"$f":"IF(ISNUMBER(G81),G81*H81,IF(G81=\"-\",\"rate only\",\" \"))","v":0}]
[]
[null,"C1.2.8.2",null,null,"Construction equipment:"]
[]
[null,null,"(a)",null,"Motor grader (128 kW)","h",40,null,{"$f":"IF(ISNUMBER(G85),G85*H85,IF(G85=\"-\",\"rate only\",\" \"))","v":0}]
[]
[null,null,"(b)",null,"Vibratory roller (self-propelled, 80 kW)","h",40,null,{"$f":"IF(ISNUMBER(G87),G87*H87,IF(G87=\"-\",\"rate only\",\" \"))","v":0}]
[]
[null,null,"(c)",null,"Pneumatic roller (60 kW, 20 ton)","h",40,null,{"$f":"IF(ISNUMBER(G89),G89*H89,IF(G89=\"-\",\"rate only\",\" \"))","v":0}]
[]
[null,null,"(d)",null,"Front end loader ( 1.9 m³, 97 kW)","h",40,null,{"$f":"IF(ISNUMBER(G91),G91*H91,IF(G91=\"-\",\"rate only\",\" \"))","v":0}]
[]
[null,null,"(e)",null,"Tractor loader backhoe (CAT 416 or similar)","h",40,null,{"$f":"IF(ISNUMBER(G93),G93*H93,IF(G93=\"-\",\"rate only\",\" \"))","v":0}]
[]
[null,null,"(f)",null,"Excavator (96 kW)","h",40,null,{"$f":"IF(ISNUMBER(G95),G95*H95,IF(G95=\"-\",\"rate only\",\" \"))","v":0}]
[]
[null,null,"(h)",null,"Other equipment:"]
[]
[{"$nulls":3},"(i)","Dozer (123 kW)","h",40,null,{"$f":"IF(ISNUMBER(G99),G99*H99,IF(G99=\"-\",\"rate only\",\" \"))","v":0}]
[]
[{"$nulls":3},"(ii)","Truck (6 m3)","h",40,null,{"$f":"IF(ISNUMBER(G101),G101*H101,IF(G101=\"-\",\"rate only\",\" \"))","v":0}]
[]
[{"$nulls":3},"(iii)","Water spray truck (9 000 litre)","h",40,null,{"$f":"IF(ISNUMBER(G103),G103*H103,IF(G103=\"-\",\"rate only\",\" \"))","v":0}]
[]
[null,"C1.2.8.3",null,null,"Vehicles:"]
[]
[null,null,"(a)",null,"Light delivery vehicle (2 000 cc)","km",50,null,{"$f":"IF(ISNUMBER(G107),G107*H107,IF(G107=\"-\",\"rate only\",\" \"))","v":0}]
[]
[null,null,"(b)",null,"Flatbed truck","km",50,null,{"$f":"IF(ISNUMBER(G109),G109*H109,IF(G109=\"-\",\"rate only\",\" \"))","v":0}]
[]
[null,"C1.2.8.4",null,null,"Materials:"]
[]
[null,null,"(a)",null,"Procurement of materials","prov sum",1,{"v":50000,"d":"50,000.00"},{"$f":"IF(ISNUMBER(G113),G113*H113,IF(G113=\"-\",\"rate only\",\" \"))","v":{"v":50000,"d":"50,000.00"}}]
[]
[null,null,"(b)",null,"Handling cost, profit and all other charges in respect of item C1.2.8.4(a)","%",50000,null,{"$f":"IF(ISNUMBER(G115),G115*H115,IF(G115=\"-\",\"rate only\",\" \"))","v":0}]
[]
["C1.2.9",{"$nulls":3},"Disposal of non-useable assets:"]
[]
[]
["CARRIED FORWARD",{"$nulls":7},{"$f":"SUM(I59:I118)","v":{"v":310000,"d":"310,000.00"}}]
[]
[]
["BROUGHT FORWARD",{"$nulls":7},{"$f":"I120","v":{"v":310000,"d":"310,000.00"}}]
[]
[null,"C1.2.9.1",null,null,"Disposal of non-useable assets identified in the Contract Documentation at time of tender"]
[]
[null,null,"(a)",null,"Milled asphalt material as listed in Section B, A1.2.3.12","t",100000,null,{"$f":"IF(ISNUMBER(G127),G127*H127,IF(G127=\"-\",\"rate only\",\" \"))","v":0}]
[]
[null,"C1.2.9.2",null,null,"Disposal of non-useable assets not identified at time of tender","prov sum",1,{"v":50000,"d":"50,000.00"},{"$f":"IF(ISNUMBER(G129),G129*H129,IF(G129=\"-\",\"rate only\",\" \"))","v":{"v":50000,"d":"50,000.00"}}]
[]
[null,"C1.2.9.3",null,null,"Handling cost, profit and all other charges in respect of item C1.2.9.2","%",50000,null,{"$f":"IF(ISNUMBER(G131),G131*H131,IF(G131=\"-\",\"rate only\",\" \"))","v":0}]
[]
["PC1.2.10",{"$nulls":3},"Dispute Adjudication Board (DAB)"]
[]
[null,"PC1.2.10.1",null,null,"Employer’s contribution to DAB (50%)","PC sum",1,{"v":200000,"d":"200,000.00"},{"$f":"IF(ISNUMBER(G135),G135*H135,IF(G135=\"-\",\"rate only\",\" \"))","v":{"v":200000,"d":"200,000.00"}}]
{"$rows_empty":46}
["TOTAL CARRIED FORWARD TO SUMMARY",{"$nulls":7},{"$f":"SUM(I122:I180)","v":{"v":560000,"d":"560,000.00"}}]

{"sheet":"1.3","index":1,"n_rows":69,"n_cols":9,"rows_kept":69}
[]
["C1.3","CONTRACTOR’S SITE ESTABLISHMENT AND GENERAL OBLIGATIONS",{"$nulls":6},"SCHEDULE A"]
[]
[]
["ITEM",{"$nulls":3},"DESCRIPTION","UNIT","QTY","RATE","AMT"]
[]
["C1.3.1",{"$nulls":3},"The Contractor's general obligations:"]
[]
[null,"C1.3.1.1",null,null,"Fixed obligations","lump sum",1,null,{"$f":"IF(ISNUMBER(G9),G9*H9,IF(G9=\"-\",\"rate only\",\" \"))","v":0}]
[]
[null,"C1.3.1.2",null,null,"Value-related obligations","lump sum",1,null,{"$f":"IF(ISNUMBER(G11),G11*H11,IF(G11=\"-\",\"rate only\",\" \"))","v":0}]
[]
[null,"PC1.3.1.3",null,null,"Time-related obligations"]
[]
[null,null,"(a)",null,"Mobilisation period","month",2,null,{"$f":"IF(ISNUMBER(G15),G15*H15,IF(G15=\"-\",\"rate only\",\" \"))","v":0}]
[]
[null,null,"(b)",null,"Execution of the works","month",18,null,{"$f":"IF(ISNUMBER(G17),G17*H17,IF(G17=\"-\",\"rate only\",\" \"))","v":0}]
[]
[null,"PC1.3.1.4",null,null,"Suspension Cost"]
[]
[null,null,"(a)",null,"De-establishment","No.",1,null,{"$f":"IF(ISNUMBER(G21),G21*H21,IF(G21=\"-\",\"rate only\",\" \"))","v":0}]
[]
[null,null,"(b)",null,"Re-establishment","No.",1,null,{"$f":"IF(ISNUMBER(G23),G23*H23,IF(G23=\"-\",\"rate only\",\" \"))","v":0}]
[]
[null,null,"(c)",null,"Suspension period","month",3,null,{"$f":"IF(ISNUMBER(G25),G25*H25,IF(G25=\"-\",\"rate only\",\" \"))","v":0}]
[]
[null,null,"(d)",null,"Engineer's cost","PC sum",1,{"v":250000,"d":"250,000.00"},{"$f":"IF(ISNUMBER(G27),G27*H27,IF(G27=\"-\",\"rate only\",\" \"))","v":{"v":250000,"d":"250,000.00"}}]
[]
["C1.3.2",{"$nulls":3},"Contract sign boards","m²",10,null,{"$f":"IF(ISNUMBER(G29),G29*H29,IF(G29=\"-\",\"rate only\",\" \"))","v":0}]
{"$rows_empty":39}
["TOTAL CARRIED FORWARD TO SUMMARY",{"$nulls":7},{"$f":"SUM(I7:I67)","v":{"v":250000,"d":"250,000.00"}}]

{"sheet":"1.4","index":2,"n_rows":173,"n_cols":9,"rows_kept":173}
[]
["C1.4","FACILITIES FOR THE ENGINEER",{"$nulls":3},"\n",null,null,"SCHEDULE A"]
[]
[]
["ITEM",{"$nulls":3},"DESCRIPTION","UNIT","QTY","RATE","AMT"]
[]
["C1.4.1",{"$nulls":3},"Site accommodation:"]
[]
[null,"C1.4.1.1",null,null,"Offices and conference room","m²",60,null,{"$f":"IF(ISNUMBER(G9),G9*H9,IF(G9=\"-\",\"rate only\",\" \"))","v":0}]
[]
[null,"C1.4.1.2",null,null,"Laboratories","m²",50,null,{"$f":"IF(ISNUMBER(G11),G11*H11,IF(G11=\"-\",\"rate only\",\" \"))","v":0}]
[]
[null,"C1.4.1.3",null,null,"Open concrete working floors and verandas","m²",170,null,{"$f":"IF(ISNUMBER(G13),G13*H13,IF(G13=\"-\",\"rate only\",\" \"))","v":0}]
[]
[null,"C1.4.1.4",null,null,"Roofs over open concrete working floors and verandas","m²",170,null,{"$f":"IF(ISNUMBER(G15),G15*H15,IF(G15=\"-\",\"rate only\",\" \"))","v":0}]
[]
[null,"C1.4.1.5",null,null,"Store rooms inside the laboratory","m²",20,null,{"$f":"IF(ISNUMBER(G17),G17*H17,IF(G17=\"-\",\"rate only\",\" \"))","v":0}]
[]
[null,"C1.4.1.6",null,null,"Car ports","No.",10,null,{"$f":"IF(ISNUMBER(G19),G19*H19,IF(G19=\"-\",\"rate only\",\" \"))","v":0}]
[]
[null,"C1.4.1.7",null,null,"Ablution units:"]
[]
[null,null,"(a)",null,"Site unit","No.",1,null,{"$f":"IF(ISNUMBER(G23),G23*H23,IF(G23=\"-\",\"rate only\",\" \"))","v":0}]
[]
[null,null,"(b)",null,"Laboratory unit","No.",3,null,{"$f":"IF(ISNUMBER(G25),G25*H25,IF(G25=\"-\",\"rate only\",\" \"))","v":0}]
[]
["C1.4.2",{"$nulls":3},"Items measured by area:"]
[]
[null,"C1.4.2.1",null,null,"Shelving as specified, complete with brackets","m²",25,null,{"$f":"IF(ISNUMBER(G29),G29*H29,IF(G29=\"-\",\"rate only\",\" \"))","v":0}]
[]
[null,"C1.4.2.2",null,null,"Work benches with a concrete slab top","m²",10,null,{"$f":"IF(ISNUMBER(G31),G31*H31,IF(G31=\"-\",\"rate only\",\" \"))","v":0}]
[]
[null,"C1.4.2.4",null,null,"Constant-temperature baths of concrete and/or plastered brick","m²",4,null,{"$f":"IF(ISNUMBER(G33),G33*H33,IF(G33=\"-\",\"rate only\",\" \"))","v":0}]
[]
[null,"C1.4.2.5",null,null,"Concrete footings and pedestals for laboratory equipment","m²",2,null,{"$f":"IF(ISNUMBER(G35),G35*H35,IF(G35=\"-\",\"rate only\",\" \"))","v":0}]
[]
[null,"C1.4.2.7",null,null,"Venetian blinds","m²",25,null,{"$f":"IF(ISNUMBER(G37),G37*H37,IF(G37=\"-\",\"rate only\",\" \"))","v":0}]
[]
[null,"C1.4.2.8",null,null,"Notice boards","m²",4,null,{"$f":"IF(ISNUMBER(G39),G39*H39,IF(G39=\"-\",\"rate only\",\" \"))","v":0}]
[]
[null,"C1.4.2.9",null,null,"White boards","m²",2,null,{"$f":"IF(ISNUMBER(G41),G41*H41,IF(G41=\"-\",\"rate only\",\" \"))","v":0}]
[]
["C1.4.3",{"$nulls":3},"Items measured by number:"]
[]
[null,"C1.4.3.1",null,null,"Office swivel chair","No.",2,null,{"$f":"IF(ISNUMBER(G45),G45*H45,IF(G45=\"-\",\"rate only\",\" \"))","v":0}]
[]
[null,"C1.4.3.2",null,null,"Office chair","No.",20,null,{"$f":"IF(ISNUMBER(G47),G47*H47,IF(G47=\"-\",\"rate only\",\" \"))","v":0}]
[]
[null,"C1.4.3.3",null,null,"Draughtsman's stool","No.",3,null,{"$f":"IF(ISNUMBER(G49),G49*H49,IF(G49=\"-\",\"rate only\",\" \"))","v":0}]
[]
[null,"C1.4.3.5",null,null,"Office desk with 3 drawers (at least one lockable drawer)","No.",4,null,{"$f":"IF(ISNUMBER(G51),G51*H51,IF(G51=\"-\",\"rate only\",\" \"))","v":0}]
[]
[null,"C1.4.3.7",null,null,"Drawing table","No.",3,null,{"$f":"IF(ISNUMBER(G53),G53*H53,IF(G53=\"-\",\"rate only\",\" \"))","v":0}]
[]
[null,"C1.4.3.8",null,null,"Conference table","No.",1,null,{"$f":"IF(ISNUMBER(G55),G55*H55,IF(G55=\"-\",\"rate only\",\" \"))","v":0}]
[]
[null,"C1.4.3.9",null,null,"Bookcase","No.",3,null,{"$f":"IF(ISNUMBER(G57),G57*H57,IF(G57=\"-\",\"rate only\",\" \"))","v":0}]
[]
[null,"C1.4.3.10",null,null,"Filing cabinet","No.",1,null,{"$f":"IF(ISNUMBER(G59),G59*H59,IF(G59=\"-\",\"rate only\",\" \"))","v":0}]
[]
[null,"C1.4.3.11",null,null,"General purpose steel cabinet with shelves","No.",5,null,{"$f":"IF(ISNUMBER(G61),G61*H61,IF(G61=\"-\",\"rate only\",\" \"))","v":0}]
[]
[]
["CARRIED FORWARD",{"$nulls":7},{"$f":"SUM(I7:I62)","v":{"v":0,"d":"0.00"}}]
[]
[]
["BROUGHT FORWARD",{"$nulls":7},{"$f":"I64","v":{"v":0,"d":"0.00"}}]
[]
[null,"C1.4.3.12",null,null,"Wall mounted pivot plan filing system","No.",1,null,{"$f":"IF(ISNUMBER(G69),G69*H69,IF(G69=\"-\",\"rate only\",\" \"))","v":0}]
[]
[null,"C1.4.3.13",null,null,"220/250 volt power outlet plug point","No.",18,null,{"$f":"IF(ISNUMBER(G71),G71*H71,IF(G71=\"-\",\"rate only\",\" \"))","v":0}]
[]
[null,"C1.4.3.14",null,null,"400/231 volt 3-phase power outlet plug point","No.",3,null,{"$f":"IF(ISNUMBER(G73),G73*H73,IF(G73=\"-\",\"rate only\",\" \"))","v":0}]
[]
[null,"C1.4.3.16",null,null,"Single 1 500 mm, 22 watt LED tube ceiling light","No.",11,null,{"$f":"IF(ISNUMBER(G75),G75*H75,IF(G75=\"-\",\"rate only\",\" \"))","v":0}]
[]
[null,"C1.4.3.19",null,null,"Wash-hand basin","No.",3,null,{"$f":"IF(ISNUMBER(G77),G77*H77,IF(G77=\"-\",\"rate only\",\" \"))","v":0}]
[]
[null,"C1.4.3.21",null,null,"Extractor fan","No.",1,null,{"$f":"IF(ISNUMBER(G79),G79*H79,IF(G79=\"-\",\"rate only\",\" \"))","v":0}]
[]
[null,"C1.4.3.23",null,null,"Fire extinguisher 9,0 kg, dry powder type","No.",2,null,{"$f":"IF(ISNUMBER(G81),G81*H81,IF(G81=\"-\",\"rate only\",\" \"))","v":0}]
[]
[null,"C1.4.3.24",null,null,"Air-conditioning unit","No.",4,null,{"$f":"IF(ISNUMBER(G83),G83*H83,IF(G83=\"-\",\"rate only\",\" \"))","v":0}]
[]
[null,"C1.4.3.27",null,null,"Waste paper basket","No.",6,null,{"$f":"IF(ISNUMBER(G85),G85*H85,IF(G85=\"-\",\"rate only\",\" \"))","v":0}]
[]
[null,"C1.4.3.28",null,null,"UPS / Voltage stabiliser (Refer to A1.4.7.3.b)","No.",3,null,{"$f":"IF(ISNUMBER(G87),G87*H87,IF(G87=\"-\",\"rate only\",\" \"))","v":0}]
[]
[null,"C1.4.3.29",null,null,"A3 / A4 colour printer, copier, scanner","No.",1,null,{"$f":"IF(ISNUMBER(G89),G89*H89,IF(G89=\"-\",\"rate only\",\" \"))","v":0}]
[]
[null,"C1.4.3.31",null,null,"Rain gauge","No.",1,null,{"$f":"IF(ISNUMBER(G91),G91*H91,IF(G91=\"-\",\"rate only\",\" \"))","v":0}]
[]
[null,"C1.4.3.37",null,null,"First aid kit","No.",1,null,{"$f":"IF(ISNUMBER(G93),G93*H93,IF(G93=\"-\",\"rate only\",\" \"))","v":0}]
[]
["C1.4.4",{"$nulls":3},"Prime cost items:"]
[]
[null,"C1.4.4.5",null,null,"The provision of internet connectivity and WiFi data for Engineer’s site staff","PC sum",1,{"v":240000,"d":"240,000.00"},{"$f":"IF(ISNUMBER(G97),G97*H97,IF(G97=\"-\",\"rate only\",\" \"))","v":{"v":240000,"d":"240,000.00"}}]
[]
[null,"C1.4.4.6",null,null,"Handling costs and profit in respect of item C1.4.4.5","%",240000,null,{"$f":"IF(ISNUMBER(G99),G99*H99,IF(G99=\"-\",\"rate only\",\" \"))","v":0}]
[]
[null,"C1.4.4.7",null,null,"The provision of paper and ink for a combination colour printer/copier/scanner","PC sum",1,{"v":120000,"d":"120,000.00"},{"$f":"IF(ISNUMBER(G101),G101*H101,IF(G101=\"-\",\"rate only\",\" \"))","v":{"v":120000,"d":"120,000.00"}}]
[]
[null,"C1.4.4.8",null,null,"Handling costs and profit in respect of item C1.4.4.7","%",120000,null,{"$f":"IF(ISNUMBER(G103),G103*H103,IF(G103=\"-\",\"rate only\",\" \"))","v":0}]
[]
[null,"C1.4.4.11",null,null,"The provision of a complete 440/231 volt three phase electrical power installation, including all poles, insulators, wiring, switchboards, mains connections, meters etc (Refer to A1.4.7.3.b)","PC sum",1,{"v":500000,"d":"500,000.00"},{"$f":"IF(ISNUMBER(G105),G105*H105,IF(G105=\"-\",\"rate only\",\" \"))","v":{"v":500000,"d":"500,000.00"}}]
[]
[null,"C1.4.4.12",null,null,"Handling costs and profit in respect of item C1.4.4.11","%",{"$f":"I105","v":500000},null,{"$f":"IF(ISNUMBER(G107),G107*H107,IF(G107=\"-\",\"rate only\",\" \"))","v":0}]
[]
["C1.4.5",{"$nulls":3},"Services at site offices, laboratories and site accommodation:"]
[]
[null,"C1.4.5.1",null,null,"Fixed costs","lump sum",1,null,{"$f":"IF(ISNUMBER(G111),G111*H111,IF(G111=\"-\",\"rate only\",\" \"))","v":0}]
[]
[null,"C1.4.5.2",null,null,"Running costs","month",18,null,{"$f":"IF(ISNUMBER(G113),G113*H113,IF(G113=\"-\",\"rate only\",\" \"))","v":0}]
[]
[]
["CARRIED FORWARD",{"$nulls":7},{"$f":"SUM(I66:I114)","v":{"v":860000,"d":"860,000.00"}}]
[]
[]
["BROUGHT FORWARD",{"$nulls":7},{"$f":"I116","v":{"v":860000,"d":"860,000.00"}}]
[]
["C1.4.7",{"$nulls":3},"Site inspection transport:"]
[]
[null,"C1.4.7.1",null,null,"Provision of a bus, mini-bus or combi van for site inspection purposes (2000 cc, 11 seater)","per day",50,null,{"$f":"IF(ISNUMBER(G123),G123*H123,IF(G123=\"-\",\"rate only\",\" \"))","v":0}]
[]
[null,"C1.4.7.2",null,null,"Travel on site","km",4300,null,{"$f":"IF(ISNUMBER(G125),G125*H125,IF(G125=\"-\",\"rate only\",\" \"))","v":0}]
[]
["C1.4.8",{"$nulls":3},"Site security measures for the Engineer’s facilities:"]
[]
[null,"C1.4.8.1",null,null,"Supply and installation of all required security measures at the Engineer’s site offices and laboratories","lump sum",1,null,{"$f":"IF(ISNUMBER(G129),G129*H129,IF(G129=\"-\",\"rate only\",\" \"))","v":0}]
[]
[null,"C1.4.8.2",null,null,"Provision of security guards / watchmen and an armed response service at the Engineer’s site offices and laboratories","month",18,null,{"$f":"IF(ISNUMBER(G131),G131*H131,IF(G131=\"-\",\"rate only\",\" \"))","v":0}]
{"$rows_empty":41}
["TOTAL CARRIED FORWARD TO SUMMARY",{"$nulls":7},{"$f":"SUM(I118:I171)","v":{"v":860000,"d":"860,000.00"}}]

{"sheet":"1.5","index":3,"n_rows":146,"n_cols":9,"rows_kept":146}
[]
["C1.5","ACCOMMODATION OF TRAFFIC",{"$nulls":3},"\n",null,null,"SCHEDULE A"]
[]
[]
["ITEM",{"$nulls":3},"DESCRIPTION","UNIT","QTY","RATE","AMT"]
[]
["C1.5.2",{"$nulls":3},"Accommodation of vehicular traffic","month",18,null,{"$f":"IF(ISNUMBER(G7),G7*H7,IF(G7=\"-\",\"rate only\",\" \"))","v":0}]
[]
["C1.5.3",{"$nulls":3},"Liaison with traffic authorities","month",18,null,{"$f":"IF(ISNUMBER(G9),G9*H9,IF(G9=\"-\",\"rate only\",\" \"))","v":0}]
[]
["C1.5.7",{"$nulls":3},"Temporary traffic control facilities:"]
[]
[null,"C1.5.7.1",null,null,"Delineators including mounting bases and ballast:"]
[]
[null,null,"(a)",null,"Single sided, reversible left or right (200 mm x 800 mm sides)","No.",5800,null,{"$f":"IF(ISNUMBER(G15),G15*H15,IF(G15=\"-\",\"rate only\",\" \"))","v":0}]
[]
[null,null,"(b)",null,"Double sided, reversible left or right (200 mm x 800 mm sides)","No.",1000,null,{"$f":"IF(ISNUMBER(G17),G17*H17,IF(G17=\"-\",\"rate only\",\" \"))","v":0}]
[]
[null,"C1.5.7.3",null,null,"Flagmen","man-shift",6000,null,{"$f":"IF(ISNUMBER(G19),G19*H19,IF(G19=\"-\",\"rate only\",\" \"))","v":0}]
[]
[null,"C1.5.7.5",null,null,"Provision of illuminated traffic signs:"]
[]
[null,null,"(d)",null,"Illuminated road sign – TW series (1200x1600)","No.",10,null,{"$f":"IF(ISNUMBER(G23),G23*H23,IF(G23=\"-\",\"rate only\",\" \"))","v":0}]
[]
[null,"C1.5.7.6",null,null,"Maintenance of illuminated traffic signs:"]
[]
[null,null,"(d)",null,"Illuminated road sign – TW series (1200 x 1600)","month",18,null,{"$f":"IF(ISNUMBER(G27),G27*H27,IF(G27=\"-\",\"rate only\",\" \"))","v":0}]
[]
["C1.5.8",{"$nulls":3},"Traffic safety officer","Man-month",18,null,{"$f":"IF(ISNUMBER(G29),G29*H29,IF(G29=\"-\",\"rate only\",\" \"))","v":0}]
[]
["C1.5.9",{"$nulls":3},"Traffic safety vehicle","month",18,null,{"$f":"IF(ISNUMBER(G31),G31*H31,IF(G31=\"-\",\"rate only\",\" \"))","v":0}]
[]
["C1.5.10",{"$nulls":3},"Tow trucks:"]
[]
[null,"C1.5.10.2",null,null,"Provision of a tow truck on call for heavy vehicles weighing two tonnes or more","month",18,null,{"$f":"IF(ISNUMBER(G35),G35*H35,IF(G35=\"-\",\"rate only\",\" \"))","v":0}]
[]
["C1.5.11",{"$nulls":3},"Provision of safety equipment for visitors:"]
[]
[null,"C1.5.11.1",null,null,"Provision of reflective safety vests for visitors","No.",10,null,{"$f":"IF(ISNUMBER(G39),G39*H39,IF(G39=\"-\",\"rate only\",\" \"))","v":0}]
[]
[null,"C1.5.11.2",null,null,"Provision of hard hats for visitors","No.",10,null,{"$f":"IF(ISNUMBER(G41),G41*H41,IF(G41=\"-\",\"rate only\",\" \"))","v":0}]
[]
[null,"PC1.5.11.3",null,null,"Emergency rotating mini lightbar for mobile use","No.",5,null,{"$f":"IF(ISNUMBER(G43),G43*H43,IF(G43=\"-\",\"rate only\",\" \"))","v":0}]
[]
["C1.5.12",{"$nulls":3},"Additional traffic accommodation facilities ordered by the Engineer:"]
[]
[null,"C1.5.12.1",null,null,"Provision of additional traffic accommodation facilities","prov sum",1,{"v":150000,"d":"150,000.00"},{"$f":"IF(ISNUMBER(G47),G47*H47,IF(G47=\"-\",\"rate only\",\" \"))","v":{"v":150000,"d":"150,000.00"}}]
[]
[null,"C1.5.12.2",null,null,"Handling cost, profit and all other charges in respect of item C1.5.12.1","%",150000,null,{"$f":"IF(ISNUMBER(G49),G49*H49,IF(G49=\"-\",\"rate only\",\" \"))","v":0}]
[]
["C1.5/ C11.6",{"$nulls":3},"ROAD SIGNS"]
[]
["CARRIED FORWARD",{"$nulls":7},{"$f":"SUM(I7:I51)","v":{"v":150000,"d":"150,000.00"}}]
[]
[]
["BROUGHT FORWARD",{"$nulls":7},{"$f":"I53","v":{"v":150000,"d":"150,000.00"}}]
[]
[]
[null,"C11.6.1",null,null,"Road signboards with painted or coloured semi-matt background. Symbols, lettering and borders in semi- matt black or in Class I retro-reflective material, where the sign board is constructed from:"]
[]
[null,"C11.6.1.3",null,null,"Prepainted galvanized steel plate:"]
[]
[null,null,"(b)",null,"Area exceeding 0,5 m² but not 2,0 m²","m²",90,null,{"$f":"IF(ISNUMBER(G63),G63*H63,IF(G63=\"-\",\"rate only\",\" \"))","v":0}]
[]
[null,null,"(c)",null,"Area exceeding 2,0 m² but not 10,0 m²","m²",65,null,{"$f":"IF(ISNUMBER(G65),G65*H65,IF(G65=\"-\",\"rate only\",\" \"))","v":0}]
[]
[null,"C11.6.1.8",null,null,"Regulatory signs, temporary"]
[]
[null,null,"(c)",null,"1200 mm diameter, 1.4 mm thick pre-painted galvanized steel plate, Class III background and symbols","No.",70,null,{"$f":"IF(ISNUMBER(G69),G69*H69,IF(G69=\"-\",\"rate only\",\" \"))","v":0}]
[]
[null,"C11.6.1.10",null,null,"Warning signs, temporary"]
[]
[null,null,"(d)",null,"1500 mm size, 1.4 mm thick pre-painted galvanized steel plate, Class III background and symbols","No.",30,null,{"$f":"IF(ISNUMBER(G73),G73*H73,IF(G73=\"-\",\"rate only\",\" \"))","v":0}]
[]
[null,"C11.6.1.12",null,null,"Supplementary plates to temporary regulatory or warning signs, 1.4 mm thick pre-painted galvanized steel plate, Class III background and symbols","m²",40,null,{"$f":"IF(ISNUMBER(G75),G75*H75,IF(G75=\"-\",\"rate only\",\" \"))","v":0}]
[]
[null,"PC11.6.1.13",null,null,"Movable barricade/road sign combination (1.4 mm thick pre-painted galvanized steel plate, Class III background and symbols, 1200 mm diameter and 2400 mm x 400 mm)","No.",20,null,{"$f":"IF(ISNUMBER(G77),G77*H77,IF(G77=\"-\",\"rate only\",\" \"))","v":0}]
[]
[null,"C11.6.2",null,null,"Extra over on item C11.6.1 for using:"]
[]
[null,"C11.6.2.1",null,null,"Background of retro-reflective material:"]
[]
[null,null,"(a)",null,"Class III","m²",350,null,{"$f":"IF(ISNUMBER(G83),G83*H83,IF(G83=\"-\",\"rate only\",\" \"))","v":0}]
[]
[null,"C11.6.2.2",null,null,"Lettering, symbols, numbers, arrows, emblems and borders of retro-reflective material:"]
[]
[null,null,"(a)",null,"Class III","m²",350,null,{"$f":"IF(ISNUMBER(G87),G87*H87,IF(G87=\"-\",\"rate only\",\" \"))","v":0}]
[]
[null,"C11.6.3",null,null,"Road sign supports (overhead road sign structures excluded):"]
[]
[null,"C11.6.3.1",null,null,"Steel tubing (25 mm x 25 mm x 2 mm wall thickness)","t",1,null,{"$f":"IF(ISNUMBER(G91),G91*H91,IF(G91=\"-\",\"rate only\",\" \"))","v":0}]
[]
[null,"C11.6.3.2",null,null,"Timber:"]
[]
[null,null,"(a)",null,"125 mm dia","m",670,null,{"$f":"IF(ISNUMBER(G95),G95*H95,IF(G95=\"-\",\"rate only\",\" \"))","v":0}]
[]
["CARRIED FORWARD",{"$nulls":7},{"$f":"SUM(I56:I95)","v":{"v":150000,"d":"150,000.00"}}]
[]
[]
["BROUGHT FORWARD",{"$nulls":7},{"$f":"I97","v":{"v":150000,"d":"150,000.00"}}]
[]
[]
[null,"C11.6.5",null,null,"Excavation and backfilling for road sign supports (not applicable to kilometre posts):"]
[]
[null,"C11.6.5.1",null,null,"Excavating soft material and backfilling","m³",350,null,{"$f":"IF(ISNUMBER(G105),G105*H105,IF(G105=\"-\",\"rate only\",\" \"))","v":0}]
[]
[null,"C11.6.5.3",null,null,"Extra over item C11.6.5.1 and C11.6.5.2 for cement-treated soil backfill","m³",350,null,{"$f":"IF(ISNUMBER(G107),G107*H107,IF(G107=\"-\",\"rate only\",\" \"))","v":0}]
[]
[null,"C11.6.5.4",null,null,"Extra over item C11.6.5.1 for hard material excavation","m³",50,null,{"$f":"IF(ISNUMBER(G109),G109*H109,IF(G109=\"-\",\"rate only\",\" \"))","v":0}]
[]
["C1.5/ C11.7",{"$nulls":3},"ROAD MARKINGS AND ROAD STUDS"]
[]
[null,"C11.7.2",null,null,"Retro-reflective road marking:"]
[]
[null,"C11.7.2.1",null,null,"White lines broken or unbroken (Type 1 paint - water borne)"]
[]
[null,null,"(a)",null,"100 mm  wide","km",320,null,{"$f":"IF(ISNUMBER(G117),G117*H117,IF(G117=\"-\",\"rate only\",\" \"))","v":0}]
[]
[null,null,"(b)",null,"150 mm wide","km",5,null,{"$f":"IF(ISNUMBER(G119),G119*H119,IF(G119=\"-\",\"rate only\",\" \"))","v":0}]
[]
[null,null,"(c)",null,"200 mm wide","km",2,null,{"$f":"IF(ISNUMBER(G121),G121*H121,IF(G121=\"-\",\"rate only\",\" \"))","v":0}]
[]
[null,null,"(d)",null,"300 mm wide","km",0.5,null,{"$f":"IF(ISNUMBER(G123),G123*H123,IF(G123=\"-\",\"rate only\",\" \"))","v":0}]
[]
[null,"C11.7.2.2",null,null,"Yellow lines broken or unbroken (Type 1 paint - water borne)"]
[]
[null,null,"(a)",null,"100 mm  wide","km",2,null,{"$f":"IF(ISNUMBER(G127),G127*H127,IF(G127=\"-\",\"rate only\",\" \"))","v":0}]
[]
[null,null,"(b)",null,"150 mm wide","km",130,null,{"$f":"IF(ISNUMBER(G129),G129*H129,IF(G129=\"-\",\"rate only\",\" \"))","v":0}]
[]
[null,"C11.7.2.4",null,null,"White lettering and symbols (Type 1 paint - water borne)","m²",320,null,{"$f":"IF(ISNUMBER(G131),G131*H131,IF(G131=\"-\",\"rate only\",\" \"))","v":0}]
[]
[null,"C11.7.2.5",null,null,"Yellow lettering and symbols (Type 1 paint - water borne)","m²",110,null,{"$f":"IF(ISNUMBER(G133),G133*H133,IF(G133=\"-\",\"rate only\",\" \"))","v":0}]
[]
[null,"C11.7.2.7",null,null,"Transverse lines, painted island and arrestor bed markings (any colour) (Type 1 paint - water borne)","m²",100,null,{"$f":"IF(ISNUMBER(G135),G135*H135,IF(G135=\"-\",\"rate only\",\" \"))","v":0}]
[]
[null,"C11.7.8",null,null,"Setting out and premarking the lines (excluding traffic island markings, lettering and symbols)","km",460,null,{"$f":"IF(ISNUMBER(G137),G137*H137,IF(G137=\"-\",\"rate only\",\" \"))","v":0}]
[]
[null,"C11.7.10",null,null,"Removal of existing, temporary or final road markings by:"]
[]
[null,"C11.7.10.1",null,null,"Sandblasting","m²",32000,null,{"$f":"IF(ISNUMBER(G141),G141*H141,IF(G141=\"-\",\"rate only\",\" \"))","v":0}]
[]
[null,"C11.7.10.2",null,null,"Water-jetting ","m²",550,null,{"$f":"IF(ISNUMBER(G143),G143*H143,IF(G143=\"-\",\"rate only\",\" \"))","v":0}]
[]
[]
["TOTAL CARRIED FORWARD TO SUMMARY",{"$nulls":7},{"$f":"SUM(I99:I144)","v":{"v":150000,"d":"150,000.00"}}]

{"sheet":"1.6","index":4,"n_rows":82,"n_cols":13,"rows_kept":82,"hidden":true}
["#BillSheet#"]
["#BillSheet#","C1.6","CLEARING AND GRUBBING",{"$nulls":3},"\n",null,null,"SCHEDULE A",0,null,"SCHEDULE A"]
["#BillSheet#"]
["ColHDR"]
["ColHDR","ITEM",{"$nulls":3},"DESCRIPTION","UNIT","QTY","RATE","AMT",null,"RATE","AMOUNT"]
["ColHDR"]
[{"$nulls":5},"CLEARING AND GRUBBING"]
["IHDR1","C1.6.1",{"$nulls":3},"Clearing:",{"$nulls":6}," "]
[]
["Item",null,"C1.6.1.1",null,null,"Clearing with machines and some hand labour where necessary","ha",{"$nulls":4},{"v":15000,"d":"15,000.00"}," "]
[]
["Item",null,"C1.6.1.2",null,null,"Clearing with hand labour only when labour enhanced work is specified","ha",{"$nulls":5}," "]
["Item",null,"C1.6.1.3",null,null,"Clearing for new fence lines (over a width of 2,0 m)","km",{"$nulls":4},{"v":3250,"d":"3,250.00"}," "]
[]
["Item",null,"C1.6.1.4",null,null,"Clearing for service trenches (over the agreed width required)","m²",{"$nulls":5}," "]
["IHDR1","C1.6.2",{"$nulls":3},"Grubbing:",{"$nulls":6}," "]
[]
["Item",null,"C1.6.2.1",null,null,"Grubbing with machines and some hand labour where necessary","ha",{"$nulls":4},{"v":20000,"d":"20,000.00"}," "]
[]
["Item",null,"C1.6.2.2",null,null,"Grubbing with hand labour when labour enhancement work is specified or it is not practical to use a machine","ha",{"$nulls":5}," "]
["Item",null,"C1.6.2.3",null,null,"Grubbing by hand for new fence lines (over a width of 2,0 m)","km",{"$nulls":4},{"v":25000,"d":"25,000.00"}," "]
[]
["Item",null,"C1.6.2.4",null,null,"Grubbing by hand for service trenches (over the agreed width required)","m²",{"$nulls":5}," "]
["IHDR1","C1.6.3",{"$nulls":3},"Removal and grubbing of large trees and tree stumps:",{"$nulls":6}," "]
[]
["Item",null,"C1.6.3.1",null,null,"Girth equal to or exceeding 1,0 m up to and including 2,0 m","No.",{"$nulls":4},{"v":1320,"d":"1,320.00"}," "]
[]
["Item",null,"C1.6.3.2",null,null,"Girth exceeding 2,0 m up to and including 3,0 m","No.",{"$nulls":4},{"v":2640,"d":"2,640.00"}," "]
[]
["Item",null,"C1.6.3.3",null,null,"Girth exceeding 3,0 m","No.",{"$nulls":5}," "]
["Item",null,"C1.6.3.4",null,null,"Removal of trees in forests and plantations","ha",{"$nulls":5}," "]
["IHDR1","C1.6.4",{"$nulls":3},"Removal of buildings and structures:",{"$nulls":6}," "]
[]
["IHDR2",null,"C1.6.4.1",null,null,"Concrete reservoirs (x3) at km 126.540 LHS","lump sum",{"$nulls":5}," "]
[]
["IHDR1","C1.6.5",{"$nulls":3},"Spreading organic matter and covering with soil","m³",{"$nulls":4},{"v":20,"d":"20.00"}," "]
[]
["IHDR1","C1.6.6",{"$nulls":3},"Mulching selected organic matter","m³",{"$nulls":5}," "]
[]
["IHDR1","C1.6.7",{"$nulls":3},"Re-clearing of previously cleared areas","ha",{"$nulls":4},{"v":10500,"d":"10,500.00"}," "]
[]
["IHDR1","C1.6.8",{"$nulls":3},"Conservation of vegetation:",{"$nulls":6}," "]
[]
["Item",null,"C1.6.8.1",null,null,"Establishment of a temporary nursery","No.",{"$nulls":5}," "]
["Item",null,"C1.6.8.2",null,null,"Removal, storage and maintenance of shrubs","No.",{"$nulls":5}," "]
["Item",null,"C1.6.8.3",null,null,"Removal, storage and maintenance of trees, girth up to and including 1,0 m","No.",{"$nulls":5}," "]
["Item",null,"C1.6.8.4",null,null,"Removal, storage and maintenance of trees, girth exceeding 1,0 m up to and including 2,0 m","No.",{"$nulls":5}," "]
["Item",null,"C1.6.8.5",null,null,"Removal, storage and maintenance of trees, girth exceeding 2,0 m up to and including 3,0 m","No.",{"$nulls":5}," "]
["Item",null,"C1.6.8.6",null,null,"Removal, storage and maintenance of trees, girth exceeding 3,0 m","No.",{"$nulls":5}," "]
["IHDR1","C1.6.9",{"$nulls":3},"Conservation of topsoil:",{"$nulls":6}," "]
[]
["Item",null,"C1.6.9.1",null,null,"Stockpiling topsoil","m³",{"$nulls":5}," "]
["Item",null,"C1.6.9.2",null,null,"Windrowing topsoil","m³",{"$nulls":5}," "]
["IHDR1","C1.6.10",{"$nulls":3},"Disposal of hazardous waste material:",{"$nulls":6}," "]
[]
["Item",null,"C1.6.10.1",null,null,"Disposal of hazardous waste material at an approved hazardous waste material facility","prov sum",{"$nulls":5}," "]
["Item3",null,"C1.6.10.2",null,null,"Handling cost, profit and all other charges in respect of item C1.6.10.1","%",{"$nulls":5}," "]
["IHDR","C1.6/ C1.7",{"$nulls":3},"LOADING AND HAULING",{"$nulls":6}," "]
[]
["IHDR1",null,"C1.7.2",null,null,"Hauling",{"$nulls":6}," "]
[]
["IHDR2",null,"C1.7.2.2",null,null,"Hauling material to spoil and off-loading it at a designated spoil or stockpile area:",{"$nulls":6}," "]
[]
["Item",null,null,"(a)",null,"Cleared and grubbed material (organic matter and all other unsuitable or waste material)","m³-km",{"$nulls":4},{"v":4.5,"d":"4.50"}," "]
{"$rows_empty":15}
["#BillEnd#"]
["#BillEnd#","TOTAL CARRIED FORWARD TO SUMMARY",{"$nulls":10},0]
["#BillEnd#"]

{"sheet":"1.7","index":5,"n_rows":54,"n_cols":15,"rows_kept":54,"hidden":true}
["#BillSheet#"]
["#BillSheet#","C1.7","LOADING AND HAULING",{"$nulls":3},"\n",null,null,"SCHEDULE A",{"$f":"SUBTOTAL(9,M$7:M1041)","v":0},null,{"$f":"J2","v":"SCHEDULE A"}]
["#BillSheet#"]
["ColHDR"]
["ColHDR","ITEM",{"$nulls":3},"DESCRIPTION","UNIT","QTY","RATE","AMT",null,"RATE","AMOUNT"]
["ColHDR"]
[{"$nulls":5},"LOADING AND HAULING"]
["IHDR1","C1.7.1",{"$nulls":3},"Loading:",{"$nulls":6},{"$f":"IF(ISNUMBER(H8),L8*H8,IF(ISNUMBER(J8),J8,IF(J8=\"RATE ONLY\",LOWER(\"RATE ONLY\"),\" \")))","v":" "}]
[]
["Item",null,"C1.7.1.1",null,null,"Loading from stockpile using machines and some hand labour where necessary","m³",{"$nulls":4},{"v":2.5,"d":"2.50"},{"$f":"IF(ISNUMBER(H10),L10*H10,IF(ISNUMBER(J10),J10,IF(J10=\"RATE ONLY\",LOWER(\"RATE ONLY\"),\" \")))","v":" "},null,"See BP & haul spreadsheet JC"]
[]
["Item",null,"C1.7.1.2",null,null,"Loading from heaps or windrows using machines and/some hand labour where necessary","m³",{"$nulls":4},{"v":3,"d":"3.00"},{"$f":"IF(ISNUMBER(H12),L12*H12,IF(ISNUMBER(J12),J12,IF(J12=\"RATE ONLY\",LOWER(\"RATE ONLY\"),\" \")))","v":" "},null,"Nominal"]
[]
["Item",null,"C1.7.1.3",null,null,"Loading by hand only from stockpile or heaps when labour enhancement work is specified or it is not possible to use machines","m³",{"$nulls":4},{"v":5,"d":"5.00"},{"$f":"IF(ISNUMBER(H14),L14*H14,IF(ISNUMBER(J14),J14,IF(J14=\"RATE ONLY\",LOWER(\"RATE ONLY\"),\" \")))","v":" "},null,"Nominal"]
[]
["IHDR1","C1.7.2",{"$nulls":3},"Hauling:",{"$nulls":6},{"$f":"IF(ISNUMBER(H16),L16*H16,IF(ISNUMBER(J16),J16,IF(J16=\"RATE ONLY\",LOWER(\"RATE ONLY\"),\" \")))","v":" "}]
[]
["IHDR2",null,"C1.7.2.1",null,null,"Hauling material for use in the Works and off-loading it on the site of the Works:",{"$nulls":6},{"$f":"IF(ISNUMBER(H18),L18*H18,IF(ISNUMBER(J18),J18,IF(J18=\"RATE ONLY\",LOWER(\"RATE ONLY\"),\" \")))","v":" "}]
[]
["Item",null,null,"(a)",null,"Soil, gravel, crushed stone and pavement layer material","m³-km",{"$nulls":4},{"v":4.5,"d":"4.50"},{"$f":"IF(ISNUMBER(H20),L20*H20,IF(ISNUMBER(J20),J20,IF(J20=\"RATE ONLY\",LOWER(\"RATE ONLY\"),\" \")))","v":" "}]
[]
["Item",null,null,"(b)",null,"Boulders and hard material","m³-km",{"$nulls":4},{"v":4,"d":"4.00"},{"$f":"IF(ISNUMBER(H22),L22*H22,IF(ISNUMBER(J22),J22,IF(J22=\"RATE ONLY\",LOWER(\"RATE ONLY\"),\" \")))","v":" "}]
[]
["IHDR2",null,"C1.7.2.2",null,null,"Hauling material to spoil and off-loading it at a designated spoil area:",{"$nulls":6},{"$f":"IF(ISNUMBER(H24),L24*H24,IF(ISNUMBER(J24),J24,IF(J24=\"RATE ONLY\",LOWER(\"RATE ONLY\"),\" \")))","v":" "}]
[]
["Item",null,null,"(a)",null,"Cleared and grubbed material (organic matter and all other unsuitable or waste material)","m³-km",{"$nulls":5},{"$f":"IF(ISNUMBER(H26),L26*H26,IF(ISNUMBER(J26),J26,IF(J26=\"RATE ONLY\",LOWER(\"RATE ONLY\"),\" \")))","v":" "},"Check Willem and Adr for quantity clear and grub , haul 5 km"]
["Item",null,null,"(b)",null,"Soil and gravel material","m³-km",{"$nulls":4},{"v":4.5,"d":"4.50"},{"$f":"IF(ISNUMBER(H27),L27*H27,IF(ISNUMBER(J27),J27,IF(J27=\"RATE ONLY\",LOWER(\"RATE ONLY\"),\" \")))","v":" "},null,"See BP & haul spreadsheet JC"]
[]
["Item",null,null,"(c)",null,"Boulders, hard material and concrete","m³-km",{"$nulls":4},{"v":4,"d":"4.00"},{"$f":"IF(ISNUMBER(H29),L29*H29,IF(ISNUMBER(J29),J29,IF(J29=\"RATE ONLY\",LOWER(\"RATE ONLY\"),\" \")))","v":" "},null,"See BP & haul spreadsheet JC"]
{"$rows_empty":22}
["#BillEnd#"]
["#BillEnd#","TOTAL CARRIED FORWARD TO SUMMARY",{"$nulls":10},{"$f":"SUBTOTAL(9,M$7:M30)","v":0}]
["#BillEnd#"]

{"sheet":"2.1","index":6,"n_rows":250,"n_cols":10,"rows_kept":250}
["#BillSheet#"]
["#BillSheet#","C2.1","GENERAL REQUIREMENTS AND TRENCHING FOR SERVICES",{"$nulls":3},"\n",null,null,"SCHEDULE A"]
["#BillSheet#"]
["ColHDR"]
["ColHDR","ITEM",{"$nulls":3},"DESCRIPTION","UNIT","QTY","RATE","AMT"]
["ColHDR"]
[{"$nulls":5},"GENERAL REQUIREMENTS AND TRENCHING FOR SERVICES"]
["IHDR1","C2.1.1",{"$nulls":3},"Location, identification, protection and relocation of existing services:"]
[]
["IHDR2",null,"C2.1.1.1",null,null,"Contractor’s obligations","lump sum",1,null,{"$f":"IF(ISNUMBER(H10),H10*I10,IF(H10=\"-\",\"rate only\",\" \"))","v":0}]
[]
["IHDR3",null,"C2.1.1.2",null,null,"Permanent services relocation or protection work by others"]
[]
["item",null,null,"(a)",null,"Underground services","PC sum",1,{"v":250000,"d":"250,000.00"},{"$f":"IF(ISNUMBER(H14),H14*I14,IF(H14=\"-\",\"rate only\",\" \"))","v":{"v":250000,"d":"250,000.00"}}]
[]
["item",null,null,"(b)",null,"CTO Stations","PC sum",1,{"v":1500000,"d":"1,500,000.00"},{"$f":"IF(ISNUMBER(H16),H16*I16,IF(H16=\"-\",\"rate only\",\" \"))","v":{"v":1500000,"d":"1,500,000.00"}}]
[]
["item",null,null,"(c)",null,"Underground services","PC sum"]
["item",null,null,"(d)",null,"ESKOM services","PC sum"]
["item",null,null,"(e)",null,"Underground optic fibre installations (FibreCo)","PC sum"]
["IHDR2",null,"C2.1.1.3",null,null,"Handling costs and profit in respect of item C2.1.1.2 above"]
[]
["item3",null,null,"(a)",null,"Underground services","%",{"$f":"J14","v":250000},null,{"$f":"IF(ISNUMBER(H23),H23*I23,IF(H23=\"-\",\"rate only\",\" \"))","v":0}]
[]
["item3",null,null,"(b)",null,"CTO Stations","%",{"$f":"J16","v":1500000},null,{"$f":"IF(ISNUMBER(H25),H25*I25,IF(H25=\"-\",\"rate only\",\" \"))","v":0}]
[]
["item3",null,null,"(c)",null,"Underground services"]
["item3",null,null,"(d)",null,"ESKOM services"]
["item3",null,null,"(e)",null,"Underground optic fibre installations (FibreCo)"]
["IHDR2",null,"C2.1.1.4",null,null,"Permanent services relocation or protection work by the Contractor","prov sum"]
[]
["IHDR1","C2.1.2",{"$nulls":3},"Existing services location, detection and verification:"]
[]
["item",null,"C2.1.2.1",null,null,"Using specialist detection services (ground penetrating radar, radio detection etc.)","PC sum"]
["item3",null,"C2.1.2.2",null,null,"Handling costs and profit in respect of item C2.1.2.1 above","%"]
["item",null,"C2.1.2.3",null,null,"Survey to verify existing service positions","PC sum"]
["item3",null,"C2.1.2.4",null,null,"Handling costs and profit in respect of item C2.1.2.3 above","%"]
["item",null,"C2.1.2.5",null,null,"Using hand excavation to locate, expose and verify services","m³"]
["IHDR1","C2.1.3",{"$nulls":3},"Obtaining construction or work permits","lump sum"]
[]
["IHDR1","C2.1.4",{"$nulls":3},"Provision of guarantees or deposits for services:"]
[]
["item",null,"C2.1.4.1",null,null,"Providing guarantees and deposits","PC sum"]
["item3",null,"C2.1.4.2",null,null,"Handling costs and profit in respect of item C2.1.4.1 above","%"]
["IHDR1","C2.1.5",{"$nulls":3},"Provision of record drawings and applicable data","lump sum"]
[]
["IHDR1","C2.1.6",{"$nulls":3},"Trench excavation (in soft material):"]
[]
["IHDR2",null,"C2.1.6.1",null,null,"Trenches up to 1,0 m wide:"]
[]
["Item",null,null,"(a)",null,"Up to 1,0 m deep","m³"]
["Item",null,null,"(b)",null,"Over 1,0 m and up to 2,0 m deep","m³"]
["Item",null,null,"(c)",null,"Over 2,0 m deep etc. to be inserted, increased by additional 1,0 m depths as required","m³"]
["IHDR2",null,"C2.1.6.2",null,null,"Trenches over 1,0 m and up to 2,0 m wide:"]
[]
["Item",null,null,"(a)",null,"Up to 1,0 m deep","m³"]
["Item",null,null,"(b)",null,"Over 1,0 m and up to 2,0 m deep","m³"]
["Item",null,null,"(c)",null,"Over 2,0 m deep etc., increased by additional 1,0 m depths as required","m³"]
["IHDR2",null,"C2.1.6.3",null,null,"Trenches over 2,0 m wide and up to 3,0 m etc., increased by additional 1,0 m widths as required:"]
[]
["Item",null,null,"(a)",null,"Up to 1,0 m deep","m³"]
["Item",null,null,"(b)",null,"Over 1,0 m and up to 2,0 m deep","m³"]
["Item",null,null,"(c)",null,"Over 2,0 m deep etc., increased by additional 1,0 m depths as required","m³"]
["IHDR1","C2.1.7",{"$nulls":3},"Extra over items C2.1.6, C2.1.8 and C2.1.16 for excavating in:"]
[]
["item",null,"C2.1.7.1",null,null,"Hard material irrespective of depth","m³"]
["item",null,"C2.1.7.2",null,null,"Stabilised material irrespective of depth","m³"]
["IHDR1","C2.1.8",{"$nulls":3},"Excavations outside the normal trench profile","m³"]
[]
["IHDR1","C2.1.9",{"$nulls":3},"Trench excavation using labour enhanced construction methods:"]
[]
["IHDR2",null,"C2.1.9.1",null,null,"Trenches up to 1,0 m wide (in soft material):"]
[]
["Item",null,null,"(a)",null,"Up to 1,0 m deep","m³"]
["Item",null,null,"(b)",null,"Over 1,0 m and up to 1,5 m deep","m³"]
["IHDR2",null,"C2.1.9.2",null,null,"Trenches over 1,0 m and up to 2,0 m wide (in soft material):"]
[]
["Item",null,null,"(a)",null,"Up to 1,0 m deep","m³"]
["Item",null,null,"(b)",null,"Over 1,0 m and up to 1,5 m deep","m³"]
["IHDR2",null,"C2.1.9.3",null,null,"Trenches up to 1,0 m wide (in intermediate material):"]
[]
["Item",null,null,"(a)",null,"Up to 1,0 m deep","m³"]
["Item",null,null,"(b)",null,"Over 1,0 m and up to 1,5 m deep","m³"]
["IHDR2",null,"C2.1.9.4",null,null,"Trenches over 1,0 m and up to 2,0 m wide (in intermediate material):"]
[]
["Item",null,null,"(a)",null,"Up to 1,0 m deep","m³"]
["Item",null,null,"(b)",null,"Over 1,0 m and up to 1,5 m deep","m³"]
["IHDR1","C2.1.10",{"$nulls":3},"Excavation in tunnels exceeding 3,0 m in length in:"]
[]
["item",null,"C2.1.10.1",null,null,"Soft material","m³"]
["item",null,"C2.1.10.2",null,null,"Hard material","m³"]
["IHDR1","C2.1.11",{"$nulls":3},"Backfilling of trenches:"]
[]
["IHDR2",null,"C2.1.11.1",null,null,"Backfill compacted to 93 % (100 % for sand) of MDD (areas subject to traffic loads) using material:"]
[]
["Item",null,null,"(a)",null,"From the excavated trench material","m³"]
["Item",null,null,"(b)",null,"From other excavations on Site","m³"]
["Item",null,null,"(c)",null,"From approved borrow areas","m³"]
["Item",null,null,"(d)",null,"From sources provided by the Contractor","m³"]
["Item",null,null,"(e)",null,"From commercial sources (state material type)","m³"]
["IHDR2",null,"C2.1.11.2",null,null,"Backfill compacted to 90 % (100 % for sand) of MDD or complying with the DCP requirements of Clause A2.1.8.2c) (areas not subject to traffic loads) using material:"]
[]
["Item",null,null,"(a)",null,"From the excavated trench material","m³"]
["Item",null,null,"(b)",null,"From other excavations on Site","m³"]
["Item",null,null,"(c)",null,"From approved borrow areas","m³"]
["Item",null,null,"(d)",null,"From sources provided by the Contractor","m³"]
["Item",null,null,"(e)",null,"From commercial sources (state material type)","m³"]
["IHDR1","C2.1.12",{"$nulls":3},"Backfilling additional excavations in trench floors due to poor founding conditions using:"]
[]
["item",null,"C2.1.12.1",null,null,"Geotextile (state grade or class)","m²"]
["item",null,"C2.1.12.2",null,null,"Concrete aggregate (37,5 mm aggregate size)","m³"]
["IHDR2",null,"C2.1.12.3",null,null,"Concrete (state class)","m³"]
[]
["IHDR1","C2.1.13",{"$nulls":3},"Extra over item C2.1.11 for backfilling with soil cement or stabilised material:"]
[]
["item",null,"C2.1.13.1",null,null,"Backfilling trenches using soil cement using (state type of material i.e. G5, G7 or G8) material","m³"]
["item",null,"C2.1.13.2",null,null,"Backfilling trenches using stabilised (state type of material i.e. G5, G7 or G8) material compacted to 93 % of MDD","m³"]
["item",null,"C2.1.13.3",null,null,"Backfilling around poles using stabilised (state type of material i.e. G5, G7 or G8) material compacted to 95 % of MDD","m³"]
["item",null,"C2.1.13.4",null,null,"Cement (state class of cement)","kg"]
["IHDR1","C2.1.14",{"$nulls":3},"Extra over items C2.1.11, C2.1.12 and C2.1.13 for additional compaction of backfill:"]
[]
["item",null,"C2.1.14.1",null,null,"Compaction increased from 90 % of MDD to 93 % of MDD","m³"]
["item",null,"C2.1.14.2",null,null,"Compaction increased from 93 % of MDD to 95 % of MDD","m³"]
["item",null,"C2.1.14.3",null,null,"Compaction increased from 95 % of MDD to 98 % of MDD","m³"]
["IHDR1","C2.1.15",{"$nulls":3},"Stone packing:"]
[]
["item",null,"C2.1.15.1",null,null,"In bolsters","m³"]
["item",null,"C2.1.15.2",null,null,"In tunnels","m³"]
["IHDR1","C2.1.16",{"$nulls":3},"Subsurface drains in trench bottoms (Contract Documentation reference or drawing number indicated)","m"]
[]
["IHDR1","C2.1.17",{"$nulls":3},"Removal and disposal of spoil material from trench excavations:"]
[]
["item",null,"C2.1.17.1",null,null,"To spoil sites provided by the Employer as indicated in the Contract Documentation or as instructed by the Engineer","m³"]
["item",null,"C2.1.17.2",null,null,"To spoil sites or dumping areas provided by the Contractor","m³"]
["IHDR1","C2.1.18",{"$nulls":3},"Timbering, strutting and shoring:"]
[]
["item",null,"C2.1.18.1",null,null,"Timbering, strutting and shoring left in excavations","m²"]
["item",null,"C2.1.18.2",null,null,"Timbering, strutting and shoring opposite a structure or service (state reference in Contract Documentation or indicate drawing number etc.)","m"]
["IHDR1","C2.1.19",{"$nulls":3},"Dealing with water during services work:"]
[]
["item",null,"C2.1.19.1",null,null,"Dealing with surface water","lump sum"]
["item",null,"C2.1.19.2",null,null,"Dealing with subsurface water","lump sum"]
["IHDR1","C2.1.20",{"$nulls":3},"Specified temporary works to control water inflow (state reference in Contract Documentation or indicate drawing number etc.):"]
[]
["item",null,"C2.1.20.1",null,null,"Provide equipment","lump sum"]
["item",null,"C2.1.20.2",null,null,"Operate and maintain","day"]
["item",null,"C2.1.20.3",null,null,"Remove equipment","lump sum"]
["IHDR1","C2.1.21",{"$nulls":3},"Supply and installation of sandbags in trenches:"]
[]
["item",null,"C2.1.21.1",null,null,"Biodegradable bags (state bag size, material type and description)","No."]
["item",null,"C2.1.21.2",null,null,"Geofabric bags (state bag size, material type and description)","No."]
["IHDR1","C2.1.22",{"$nulls":3},"Existing services that intersect or adjoin a trench:"]
[]
["IHDR2",null,"C2.1.22.1",null,null,"Services that intersect a trench (angles between centre-lines in plan 45° to 90°):"]
[]
["Item",null,null,"(a)",null,"State type and size of each intersecting service","No."]
["Item",null,null,"(b)",null,"State type and size of each intersecting service","No."]
["Item",null,null,"(c)",null,"State type and size of each intersecting service etc.","No."]
["IHDR2",null,"C2.1.22.2",null,null,"Services that adjoin a trench (parallel to or at an angle between centre-lines in plan of less than 45°):"]
[]
["Item",null,null,"(a)",null,"State type and size of each intersecting service","m"]
["Item",null,null,"(b)",null,"State type and size of each intersecting service","m"]
["Item",null,null,"(c)",null,"State type and size of each intersecting service etc.","m"]
["IHDR1","C2.1.23",{"$nulls":3},"Reinstatement of trenches in existing surfaced roads using:"]
[]
["item",null,"C2.1.23.1",null,null,"Selected material (state material type and source e.g. G7 or G8, commercial/borrow pits/etc. and layer thickness) compacted to (state minimum compaction) % of MDD","m³"]
["item",null,"C2.1.23.2",null,null,"Subbase material (state material type and source e.g. G5 or G6, commercial/borrow pit etc. and layer thickness) compacted to (state minimum compaction) % of MDD","m³"]
["item",null,"C2.1.23.3",null,null,"Stabilised subbase material (state material type and source e.g. C3 or C4, commercial/borrow pit etc. and layer thickness) using (state percentage and type of stabilising agent) compacted to (state minimum compaction) % of MDD","m³"]
["item",null,"C2.1.23.4",null,null,"Base material (state material type and source e.g. G1 or G2, commercial/quarry etc. and layer thickness) compacted to (state minimum compaction either 102 % for G2 or 104 % for G1) % of MDD","m³"]
["item",null,"C2.1.23.5",null,null,"Prime coat (state type of material and application rate)","m²"]
["item",null,"C2.1.23.6",null,null,"Tack coat (state type of material and application rate)","m²"]
["item",null,"C2.1.23.7",null,null,"Asphalt material (state asphalt type e.g. continuously graded, binder type, layer thickness and minimum density)","t"]
["item",null,"C2.1.23.8",null,null,"Surface treatments (state surfacing type, binder type and application rate, aggregate size and application rate etc.)","m²"]
["IHDR1","C2.1.24",{"$nulls":3},"Saw-cutting before excavation:"]
[]
["IHDR2",null,"C2.1.24.1",null,null,"Saw-cutting asphalt to an average depth:"]
[]
["Item",null,null,"(a)",null,"Not exceeding 50 mm","m²"]
["Item",null,null,"(b)",null,"Exceeding 50 mm but not exceeding 100 mm","m²"]
["Item",null,null,"(c)",null,"Exceeding 100 mm but not exceeding 150 mm","m²"]
["IHDR2",null,"C2.1.24.2",null,null,"Saw-cutting concrete to an average depth:"]
[]
["Item",null,null,"(a)",null,"Not exceeding 50 mm","m²"]
["Item",null,null,"(b)",null,"Exceeding 50 mm but not exceeding 100 mm","m²"]
["Item",null,null,"(c)",null,"Exceeding 100 mm but not exceeding 150 mm","m²"]
["IHDR2",null,"C2.1.24.3",null,null,"Saw-cutting other materials (type of material to be specified) to an average depth:"]
[]
["Item",null,null,"(a)",null,"Not exceeding 50 mm","m²"]
["Item",null,null,"(b)",null,"Exceeding 50 mm but not exceeding 100 mm","m²"]
["Item",null,null,"(c)",null,"Exceeding 100 mm but not exceeding 150 mm","m²"]
["IHDR1","C2.1.25",{"$nulls":3},"Removal of existing services:"]
[]
["item",null,"C2.1.25.1",null,null,"Redundant Telkom telephone poles","No."]
["item",null,"C2.1.25.2",null,null,"State type and size of each service (duct, pipe or cable) removed","m"]
["item",null,"C2.1.25.3",null,null,"Etc., insert additional items as required","m"]
["IHDR1","C2.1.26",{"$nulls":3},"Disposal of existing service materials:"]
[]
["item",null,"C2.1.26.1",null,null,"Redundant Telkom telephone poles to be disposed of at Telkom yard in Virginia","No."]
["item",null,"C2.1.26.2",null,null,"State type and size of each service (duct, pipe or cable) disposed of","m"]
["item",null,"C2.1.26.3",null,null,"Etc., insert additional items as required","m"]
["IHDR1","C2.1.27",{"$nulls":3},"Demolition of existing manholes, access chambers and other service structures consisting of:"]
[]
["item",null,"C2.1.27.1",null,null,"Unreinforced concrete","m³"]
["item",null,"C2.1.27.2",null,null,"Reinforced concrete","m³"]
["item",null,"C2.1.27.3",null,null,"Masonry","m³"]
{"$rows_empty":42}
["#BillEnd#"]
["#BillEnd#","TOTAL CARRIED FORWARD TO SUMMARY",{"$nulls":7},{"$f":"SUM(J8:J247)","v":{"v":1750000,"d":"1,750,000.00"}}]
["#BillEnd#"]

{"sheet":"2.2","index":7,"n_rows":176,"n_cols":13,"rows_kept":176,"hidden":true}
["#BillSheet#"]
["#BillSheet#","C2.2","DRY SERVICES",{"$nulls":3},"\n",null,null,"SCHEDULE A",{"$f":"SUBTOTAL(9,M$7:M1031)","v":0},null,{"$f":"J2","v":"SCHEDULE A"}]
["#BillSheet#"]
["ColHDR"]
["ColHDR","ITEM",{"$nulls":3},"DESCRIPTION","UNIT","QTY","RATE","AMT",null,"RATE","AMOUNT"]
["ColHDR"]
[{"$nulls":5},"DRY SERVICES"]
["IHDR1","C2.2.1",{"$nulls":3},"Supply, lay and prove ducts:",{"$nulls":6},{"$f":"IF(ISNUMBER(H8),L8*H8,IF(ISNUMBER(J8),J8,IF(J8=\"RATE ONLY\",LOWER(\"RATE ONLY\"),\" \")))","v":" "}]
[]
["IHDR2",null,"C2.2.1.1",null,null,"Normal duty uPVC pipes with rubber ring type joint. ",{"$nulls":6},{"$f":"IF(ISNUMBER(H10),L10*H10,IF(ISNUMBER(J10),J10,IF(J10=\"RATE ONLY\",LOWER(\"RATE ONLY\"),\" \")))","v":" "}]
[]
["Item",null,null,"(a)",null,"110 mm diameter (OD)","m",{"$nulls":4},{"v":310,"d":"310.00"},{"$f":"IF(ISNUMBER(H12),L12*H12,IF(ISNUMBER(J12),J12,IF(J12=\"RATE ONLY\",LOWER(\"RATE ONLY\"),\" \")))","v":" "}]
[]
["Item",null,null,"(b)",null,"160 mm diameter (OD)","m",{"$nulls":4},{"v":350,"d":"350.00"},{"$f":"IF(ISNUMBER(H14),L14*H14,IF(ISNUMBER(J14),J14,IF(J14=\"RATE ONLY\",LOWER(\"RATE ONLY\"),\" \")))","v":" "}]
[]
[{"$nulls":3},"(c)",null,"210 mm diameter (OD)","m",{"$nulls":5},{"$f":"IF(ISNUMBER(H16),L16*H16,IF(ISNUMBER(J16),J16,IF(J16=\"RATE ONLY\",LOWER(\"RATE ONLY\"),\" \")))","v":" "}]
["IHDR2",null,"C2.2.1.2",null,null,"State for each duct the material type, class, joint type etc.",{"$nulls":6},{"$f":"IF(ISNUMBER(H17),L17*H17,IF(ISNUMBER(J17),J17,IF(J17=\"RATE ONLY\",LOWER(\"RATE ONLY\"),\" \")))","v":" "}]
[]
["Item",null,null,"(a)",null,"State diameter ","m",{"$nulls":5}," "]
["Item",null,null,"(b)",null,"State diameter ","m",{"$nulls":5}," "]
["IHDR1","C2.2.2",{"$nulls":3},"Extra over item C2.2.1 for the provision of split ducts:",{"$nulls":6},{"$f":"IF(ISNUMBER(H21),L21*H21,IF(ISNUMBER(J21),J21,IF(J21=\"RATE ONLY\",LOWER(\"RATE ONLY\"),\" \")))","v":" "}]
[]
["IHDR2",null,"C2.2.2.1",null,null,"Normal duty uPVC pipes with rubber ring type joint. ",{"$nulls":6},{"$f":"IF(ISNUMBER(H23),L23*H23,IF(ISNUMBER(J23),J23,IF(J23=\"RATE ONLY\",LOWER(\"RATE ONLY\"),\" \")))","v":" "}]
[]
["Item",null,null,"(a)",null,"110 mm diameter (OD)","m",{"$nulls":4},{"v":370,"d":"370.00"},{"$f":"IF(ISNUMBER(H25),L25*H25,IF(ISNUMBER(J25),J25,IF(J25=\"RATE ONLY\",LOWER(\"RATE ONLY\"),\" \")))","v":" "}]
[]
["Item",null,null,"(b)",null,"160 mm diameter (OD)","m",{"$nulls":4},{"v":410,"d":"410.00"},{"$f":"IF(ISNUMBER(H27),L27*H27,IF(ISNUMBER(J27),J27,IF(J27=\"RATE ONLY\",LOWER(\"RATE ONLY\"),\" \")))","v":" "}]
[]
[{"$nulls":3},"(c)",null,"210 mm diameter (OD)","m"]
["IHDR2",null,"C2.2.2.2",null,null,"State for each duct the material type, class, etc.",{"$nulls":6},{"$f":"IF(ISNUMBER(H30),L30*H30,IF(ISNUMBER(J30),J30,IF(J30=\"RATE ONLY\",LOWER(\"RATE ONLY\"),\" \")))","v":" "}]
[]
["Item",null,null,"(a)",null,"State diameter ","m",{"$nulls":5}," "]
["Item",null,null,"(b)",null,"State diameter ","m",{"$nulls":5}," "]
["IHDR1","C2.2.3",{"$nulls":3},"Lay and prove ducts provided by others:",{"$nulls":6},{"$f":"IF(ISNUMBER(H34),L34*H34,IF(ISNUMBER(J34),J34,IF(J34=\"RATE ONLY\",LOWER(\"RATE ONLY\"),\" \")))","v":" "}]
[]
["IHDR2",null,"C2.2.3.1",null,null,"State for each duct to be laid the material type",{"$nulls":6},{"$f":"IF(ISNUMBER(H36),L36*H36,IF(ISNUMBER(J36),J36,IF(J36=\"RATE ONLY\",LOWER(\"RATE ONLY\"),\" \")))","v":" "}]
[]
["Item",null,null,"(a)",null,"State diameter (example 110 mm diameter (OD))","m",{"$nulls":5}," "]
["Item",null,null,"(b)",null,"State diameter (example 160 mm diameter (OD))","m",{"$nulls":5}," "]
["IHDR2",null,"C2.2.3.2",null,null,"State for each duct to be laid the material type",{"$nulls":6},{"$f":"IF(ISNUMBER(H40),L40*H40,IF(ISNUMBER(J40),J40,IF(J40=\"RATE ONLY\",LOWER(\"RATE ONLY\"),\" \")))","v":" "}]
[]
["Item",null,null,"(a)",null,"State diameter ","m",{"$nulls":5}," "]
["Item",null,null,"(b)",null,"State diameter ","m",{"$nulls":5}," "]
["IHDR1","C2.2.4",{"$nulls":3},"Bedding for ducts compacted to 90 % of MDD (100 % for sand) using material:",{"$nulls":6},{"$f":"IF(ISNUMBER(H44),L44*H44,IF(ISNUMBER(J44),J44,IF(J44=\"RATE ONLY\",LOWER(\"RATE ONLY\"),\" \")))","v":" "}]
[]
["IHDR2",null,"C2.2.4.1",null,null,"Selected from the excavated trench material","m³",{"$nulls":5},{"$f":"IF(ISNUMBER(H46),L46*H46,IF(ISNUMBER(J46),J46,IF(J46=\"RATE ONLY\",LOWER(\"RATE ONLY\"),\" \")))","v":" "}]
[]
["IHDR2",null,"C2.2.4.2",null,null,"Selected from other excavations on site","m³",{"$nulls":5},{"$f":"IF(ISNUMBER(H48),L48*H48,IF(ISNUMBER(J48),J48,IF(J48=\"RATE ONLY\",LOWER(\"RATE ONLY\"),\" \")))","v":" "}]
[]
["IHDR2",null,"C2.2.4.3",null,null,"Selected from approved borrow areas","m³",{"$nulls":5},{"$f":"IF(ISNUMBER(H50),L50*H50,IF(ISNUMBER(J50),J50,IF(J50=\"RATE ONLY\",LOWER(\"RATE ONLY\"),\" \")))","v":" "}]
[]
["IHDR2",null,"C2.2.4.4",null,null,"Selected from sources provided by the Contractor","m³",{"$nulls":5},{"$f":"IF(ISNUMBER(H52),L52*H52,IF(ISNUMBER(J52),J52,IF(J52=\"RATE ONLY\",LOWER(\"RATE ONLY\"),\" \")))","v":" "}]
[]
["IHDR2",null,"C2.2.4.5",null,null,"From commercial sources:",{"$nulls":6},{"$f":"IF(ISNUMBER(H54),L54*H54,IF(ISNUMBER(J54),J54,IF(J54=\"RATE ONLY\",LOWER(\"RATE ONLY\"),\" \")))","v":" "}]
[]
["Item",null,null,"(a)",null,"Non-cohesive material (state material type)","m³",{"$nulls":5}," "]
["Item",null,null,"(b)",null,"Crushed stone material (state material type)","m³",{"$nulls":5}," "]
["IHDR2",null,"C2.2.4.6",null,null,"Extra over items C2.2.4.1 to C2.2.4.5 for stabilising material with cement","m³",{"$nulls":5},{"$f":"IF(ISNUMBER(H58),L58*H58,IF(ISNUMBER(J58),J58,IF(J58=\"RATE ONLY\",LOWER(\"RATE ONLY\"),\" \")))","v":" "}]
[]
["IHDR2",null,"C2.2.4.7",null,null,"Cement (state class/type of cement) for stabilising bedding","kg",{"$nulls":5},{"$f":"IF(ISNUMBER(H60),L60*H60,IF(ISNUMBER(J60),J60,IF(J60=\"RATE ONLY\",LOWER(\"RATE ONLY\"),\" \")))","v":" "}]
[]
["IHDR1","C2.2.5",{"$nulls":3},"Concrete for bedding and encasement of ducts:",{"$nulls":6},{"$f":"IF(ISNUMBER(H62),L62*H62,IF(ISNUMBER(J62),J62,IF(J62=\"RATE ONLY\",LOWER(\"RATE ONLY\"),\" \")))","v":" "}]
[]
["Item",null,"C2.2.5.1",null,null,"Concrete bedding (state class of concrete)","m³",{"$nulls":5},{"$f":"IF(ISNUMBER(H64),L64*H64,IF(ISNUMBER(J64),J64,IF(J64=\"RATE ONLY\",LOWER(\"RATE ONLY\"),\" \")))","v":" "}]
["Item",null,"C2.2.5.2",null,null,"Concrete encasement of ducts (Class C12/15-37.5 concrete)","m³",{"$nulls":4},{"v":1800,"d":"1,800.00"},{"$f":"IF(ISNUMBER(H65),L65*H65,IF(ISNUMBER(J65),J65,IF(J65=\"RATE ONLY\",LOWER(\"RATE ONLY\"),\" \")))","v":" "}]
[]
["IHDR1","C2.2.6",{"$nulls":3},"Duct accessories (markers, marking, draw wires and end caps etc.):",{"$nulls":6},{"$f":"IF(ISNUMBER(H67),L67*H67,IF(ISNUMBER(J67),J67,IF(J67=\"RATE ONLY\",LOWER(\"RATE ONLY\"),\" \")))","v":" "}]
[]
["IHDR2",null,"C2.2.6.1",null,null,"Duct markers (Class C25/30-20 concrete, complete as shown on drawings)","No.",{"$nulls":4},{"v":260,"d":"260.00"},{"$f":"IF(ISNUMBER(H69),L69*H69,IF(ISNUMBER(J69),J69,IF(J69=\"RATE ONLY\",LOWER(\"RATE ONLY\"),\" \")))","v":" "}]
[]
["IHDR2",null,"C2.2.6.2",null,null,"Duct marking (state type)","No.",{"$nulls":5},{"$f":"IF(ISNUMBER(H71),L71*H71,IF(ISNUMBER(J71),J71,IF(J71=\"RATE ONLY\",LOWER(\"RATE ONLY\"),\" \")))","v":" "}]
[]
["IHDR2",null,"C2.2.6.3",null,null,"Draw wires (2.5mm dia, 2 strands)","m",{"$nulls":4},{"v":5,"d":"5.00"},{"$f":"IF(ISNUMBER(H73),L73*H73,IF(ISNUMBER(J73),J73,IF(J73=\"RATE ONLY\",LOWER(\"RATE ONLY\"),\" \")))","v":" "}]
[]
["IHDR2",null,"C2.2.6.4",null,null,"End caps or plugs (cement and sand plug)","No.",{"$nulls":4},{"v":60,"d":"60.00"},{"$f":"IF(ISNUMBER(H75),L75*H75,IF(ISNUMBER(J75),J75,IF(J75=\"RATE ONLY\",LOWER(\"RATE ONLY\"),\" \")))","v":" "}]
[]
["IHDR2",null,"C2.2.6.5",null,null,"Other accessories:",{"$nulls":6},{"$f":"IF(ISNUMBER(H77),L77*H77,IF(ISNUMBER(J77),J77,IF(J77=\"RATE ONLY\",LOWER(\"RATE ONLY\"),\" \")))","v":" "}]
[]
["Item",null,null,"(a)",null,"State type","No.",{"$nulls":5}," "]
["Item",null,null,"(b)",null,"State type","m",{"$nulls":5}," "]
["IHDR1","C2.2.7",{"$nulls":3},"Handholes, manholes and access chambers for ducts:",{"$nulls":6},{"$f":"IF(ISNUMBER(H81),L81*H81,IF(ISNUMBER(J81),J81,IF(J81=\"RATE ONLY\",LOWER(\"RATE ONLY\"),\" \")))","v":" "}]
[]
["IHDR2",null,"C2.2.7.1",null,null,"Handholes (state type and drawing reference etc.):",{"$nulls":6},{"$f":"IF(ISNUMBER(H83),L83*H83,IF(ISNUMBER(J83),J83,IF(J83=\"RATE ONLY\",LOWER(\"RATE ONLY\"),\" \")))","v":" "}]
[]
["Item",null,null,"(a)",null,"State depth range (example over 1,0 m and up to 1,5 m deep)","No.",{"$nulls":5}," "]
["Item",null,null,"(b)",null,"State depth range (example over 1,5 m and up to 2,0 m deep)","No.",{"$nulls":5}," "]
["IHDR2",null,"C2.2.7.2",null,null,"Manholes (state type and drawing reference etc.):",{"$nulls":6},{"$f":"IF(ISNUMBER(H87),L87*H87,IF(ISNUMBER(J87),J87,IF(J87=\"RATE ONLY\",LOWER(\"RATE ONLY\"),\" \")))","v":" "}]
[]
["Item",null,null,"(a)",null,"State depth range ","No.",{"$nulls":5}," "]
["Item",null,null,"(b)",null,"State depth range ","No.",{"$nulls":5}," "]
["IHDR2",null,"C2.2.7.3",null,null,"Access chambers (state type and drawing reference etc.):",{"$nulls":6},{"$f":"IF(ISNUMBER(H91),L91*H91,IF(ISNUMBER(J91),J91,IF(J91=\"RATE ONLY\",LOWER(\"RATE ONLY\"),\" \")))","v":" "}]
[]
["Item",null,null,"(a)",null,"State depth range ","No.",{"$nulls":5}," "]
["Item",null,null,"(b)",null,"State depth range ","No.",{"$nulls":5}," "]
["IHDR2",null,"C2.2.7.4",null,null,"Other structures:","No.",{"$nulls":5},{"$f":"IF(ISNUMBER(H95),L95*H95,IF(ISNUMBER(J95),J95,IF(J95=\"RATE ONLY\",LOWER(\"RATE ONLY\"),\" \")))","v":" "}]
[]
["Item",null,null,"(a)",null,"State type, depth range and drawing reference etc.","No.",{"$nulls":5}," "]
["Item",null,null,"(b)",null,"State type, depth range and drawing reference etc.","No.",{"$nulls":5}," "]
["IHDR1","C2.2.8",{"$nulls":3},"Covers and frames for duct handholes, manholes and access chambers:",{"$nulls":6},{"$f":"IF(ISNUMBER(H99),L99*H99,IF(ISNUMBER(J99),J99,IF(J99=\"RATE ONLY\",LOWER(\"RATE ONLY\"),\" \")))","v":" "}]
[]
["Item",null,"C2.2.8.1",null,null,"State type, strength class and size of cover and frame","No.",{"$nulls":5}," "]
["Item",null,"C2.2.8.2",null,null,"State type, strength class and size of cover and frame","No.",{"$nulls":5}," "]
["Item",null,"C2.2.8.3",null,null,"State type, strength class and size of cover and frame","No.",{"$nulls":5}," "]
["Item",null,"C2.2.8.4",null,null,"Etc., insert additional items as required","No.",{"$nulls":5}," "]
["IHDR1","C2.2.9",{"$nulls":3},"Install duct handhole, manhole and access chamber covers and frames provided by others:",{"$nulls":6},{"$f":"IF(ISNUMBER(H105),L105*H105,IF(ISNUMBER(J105),J105,IF(J105=\"RATE ONLY\",LOWER(\"RATE ONLY\"),\" \")))","v":" "}]
[]
["Item",null,"C2.2.9.1",null,null,"State type, strength class and size of cover and frame","No.",{"$nulls":5}," "]
["Item",null,"C2.2.9.2",null,null,"State type, strength class and size of cover and frame","No.",{"$nulls":5}," "]
["Item",null,"C2.2.9.3",null,null,"State type, strength class and size of cover and frame","No.",{"$nulls":5}," "]
["Item",null,"C2.2.9.4",null,null,"Etc., insert additional items as required","No.",{"$nulls":5}," "]
["IHDR","C1.5/ C12.7",{"$nulls":3},"TRENCHLESS METHODS",{"$nulls":6},{"$f":"IF(ISNUMBER(H111),L111*H111,IF(ISNUMBER(J111),J111,IF(J111=\"RATE ONLY\",LOWER(\"RATE ONLY\"),\" \")))","v":" "}]
[]
["IHDR1",null,"C12.7.1",null,null,"Establishment on site for horizontal directional drilling","lump sum",{"$nulls":4},{"v":50000,"d":"50,000.00"},{"$f":"IF(ISNUMBER(H113),L113*H113,IF(ISNUMBER(J113),J113,IF(J113=\"RATE ONLY\",LOWER(\"RATE ONLY\"),\" \")))","v":" "}]
[]
["IHDR1",null,"C12.7.2",null,null,"Moving to and setting up equipment at each position for horizontal directional drilling","No.",{"$nulls":4},{"v":10000,"d":"10,000.00"},{"$f":"IF(ISNUMBER(H115),L115*H115,IF(ISNUMBER(J115),J115,IF(J115=\"RATE ONLY\",LOWER(\"RATE ONLY\"),\" \")))","v":" "}]
[]
["IHDR1",null,"C12.7.3",null,null,"Installing holes (160 mm (OD) smooth wall, PE 100 material with PN 10 pressure rating) to required length for horizontal directional drilling","m",{"$nulls":4},{"v":750,"d":"750.00"},{"$f":"IF(ISNUMBER(H117),L117*H117,IF(ISNUMBER(J117),J117,IF(J117=\"RATE ONLY\",LOWER(\"RATE ONLY\"),\" \")))","v":" "}]
[]
["IHDR1",null,"C12.7.4",null,null,"Penetrating unidentified obstructions/services with horizontal directional drilling for penetration of:",{"$nulls":6},{"$f":"IF(ISNUMBER(H119),L119*H119,IF(ISNUMBER(J119),J119,IF(J119=\"RATE ONLY\",LOWER(\"RATE ONLY\"),\" \")))","v":" "}]
["PB"]
["PB","CARRIED FORWARD",{"$nulls":10},{"$f":"SUBTOTAL(9,M$7:M119)","v":0}]
["PB"]
["PB"]
["PB","BROUGHT FORWARD",{"$nulls":10},{"$f":"SUBTOTAL(9,M$7:M122)","v":0}]
["PB"]
[]
["Item",null,"C12.7.4.3",null,null,"Rock of UCS > 3 Mpa","m",{"$nulls":4},{"v":3100,"d":"3,100.00"},{"$f":"IF(ISNUMBER(H127),L127*H127,IF(ISNUMBER(J127),J127,IF(J127=\"RATE ONLY\",LOWER(\"RATE ONLY\"),\" \")))","v":" "}]
{"$rows_empty":46}
["#BillEnd#"]
["#BillEnd#","TOTAL CARRIED FORWARD TO SUMMARY",{"$nulls":10},{"$f":"SUBTOTAL(9,M$7:M128)","v":0}]
["#BillEnd#"]

{"sheet":"2.3","index":8,"n_rows":220,"n_cols":13,"rows_kept":220,"hidden":true}
["#BillSheet#"]
["#BillSheet#","C2.3","WET SERVICES",{"$nulls":3},"\n",null,null,"SCHEDULE A",{"$f":"SUBTOTAL(9,M$7:M1075)","v":0},null,{"$f":"J2","v":"SCHEDULE A"}]
["#BillSheet#"]
["ColHDR"]
["ColHDR","ITEM",{"$nulls":3},"DESCRIPTION","UNIT","QTY","RATE","AMT",null,"RATE","AMOUNT"]
["ColHDR"]
[{"$nulls":5},"WET SERVICES"]
["IHDR1","C2.3.1",{"$nulls":3},"Supply, lay, joint and test sewers:",{"$nulls":6},{"$f":"IF(ISNUMBER(H8),L8*H8,IF(ISNUMBER(J8),J8,IF(J8=\"RATE ONLY\",LOWER(\"RATE ONLY\"),\" \")))","v":" "}]
["IHDR2",null,"C2.3.1.1",null,null,"State for each sewer the pipe material type, class, joint type and the class of bedding etc.:",{"$nulls":6},{"$f":"IF(ISNUMBER(H9),L9*H9,IF(ISNUMBER(J9),J9,IF(J9=\"RATE ONLY\",LOWER(\"RATE ONLY\"),\" \")))","v":" "}]
["Item",null,null,"(a)",null,"State diameter ","m",{"$nulls":5},{"$f":"IF(ISNUMBER(H10),L10*H10,IF(ISNUMBER(J10),J10,IF(J10=\"RATE ONLY\",LOWER(\"RATE ONLY\"),\" \")))","v":" "}]
["Item",null,null,"(b)",null,"State diameter ","m",{"$nulls":5}," "]
["IHDR2",null,"C2.3.1.2",null,null,"State for each sewer the pipe material type, class, joint type and the class of bedding etc.:",{"$nulls":6},{"$f":"IF(ISNUMBER(H12),L12*H12,IF(ISNUMBER(J12),J12,IF(J12=\"RATE ONLY\",LOWER(\"RATE ONLY\"),\" \")))","v":" "}]
["Item",null,null,"(a)",null,"State diameter ","m",{"$nulls":5}," "]
["Item",null,null,"(b)",null,"State diameter ","m",{"$nulls":5}," "]
["IHDR2",null,"C2.3.1.3",null,null,"Etc, insert additional items as required",{"$nulls":6},{"$f":"IF(ISNUMBER(H15),L15*H15,IF(ISNUMBER(J15),J15,IF(J15=\"RATE ONLY\",LOWER(\"RATE ONLY\"),\" \")))","v":" "}]
["IHDR1","C2.3.2",{"$nulls":3},"Extra over item C2.3.1 for sewer specials:",{"$nulls":6},{"$f":"IF(ISNUMBER(H16),L16*H16,IF(ISNUMBER(J16),J16,IF(J16=\"RATE ONLY\",LOWER(\"RATE ONLY\"),\" \")))","v":" "}]
["IHDR2",null,"C2.3.2.1",null,null,"State for each sewer special the type, class, etc.:",{"$nulls":6},{"$f":"IF(ISNUMBER(H17),L17*H17,IF(ISNUMBER(J17),J17,IF(J17=\"RATE ONLY\",LOWER(\"RATE ONLY\"),\" \")))","v":" "}]
["Item",null,null,"(a)",null,"State diameter","No.",{"$nulls":5}," "]
["Item",null,null,"(b)",null,"State diameter","No.",{"$nulls":5}," "]
["IHDR2",null,"C2.3.2.2",null,null,"State for each sewer special the type, class, etc.:",{"$nulls":6},{"$f":"IF(ISNUMBER(H20),L20*H20,IF(ISNUMBER(J20),J20,IF(J20=\"RATE ONLY\",LOWER(\"RATE ONLY\"),\" \")))","v":" "}]
["Item",null,null,"(a)",null,"State diameter ","No.",{"$nulls":5}," "]
["Item",null,null,"(b)",null,"State diameter ","No.",{"$nulls":5}," "]
["IHDR2",null,"C2.3.2.3",null,null,"Etc, insert additional items as required",{"$nulls":6},{"$f":"IF(ISNUMBER(H23),L23*H23,IF(ISNUMBER(J23),J23,IF(J23=\"RATE ONLY\",LOWER(\"RATE ONLY\"),\" \")))","v":" "}]
["IHDR1","C2.3.3",{"$nulls":3},"Bedding for sewers (Class B and C) and fill blanket compacted to 90 % of MDD (100 % for sand):",{"$nulls":6},{"$f":"IF(ISNUMBER(H24),L24*H24,IF(ISNUMBER(J24),J24,IF(J24=\"RATE ONLY\",LOWER(\"RATE ONLY\"),\" \")))","v":" "}]
["IHDR2",null,"C2.3.3.1",null,null,"Bedding using selected granular material:",{"$nulls":6},{"$f":"IF(ISNUMBER(H25),L25*H25,IF(ISNUMBER(J25),J25,IF(J25=\"RATE ONLY\",LOWER(\"RATE ONLY\"),\" \")))","v":" "}]
["Item",null,null,"(a)",null,"From the excavated trench material","m³",{"$nulls":5}," "]
["Item",null,null,"(b)",null,"From other excavations on Site","m³",{"$nulls":5}," "]
["Item",null,null,"(c)",null,"From approved borrow areas","m³",{"$nulls":5}," "]
["Item",null,null,"(d)",null,"From sources provided by the Contractor","m³",{"$nulls":5}," "]
["Item",null,null,"(e)",null,"From commercial sources","m³",{"$nulls":5}," "]
["IHDR2",null,"C2.3.3.2",null,null,"Selected fill blanket material:",{"$nulls":6},{"$f":"IF(ISNUMBER(H31),L31*H31,IF(ISNUMBER(J31),J31,IF(J31=\"RATE ONLY\",LOWER(\"RATE ONLY\"),\" \")))","v":" "}]
["Item",null,null,"(a)",null,"From the excavated trench material","m³",{"$nulls":5}," "]
["Item",null,null,"(b)",null,"From other excavations on Site","m³",{"$nulls":5}," "]
["Item",null,null,"(c)",null,"From approved borrow areas","m³",{"$nulls":5}," "]
["Item",null,null,"(d)",null,"From sources provided by the Contractor","m³",{"$nulls":5}," "]
["Item",null,null,"(e)",null,"From commercial sources","m³",{"$nulls":5}," "]
["IHDR2",null,"C2.3.3.3",null,null,"Extra over items C2.3.3.1(a) to C2.3.3.1(c) and C2.3.3.2(a) to C2.3.3.2(c) for screening material","m³",{"$nulls":5},{"$f":"IF(ISNUMBER(H37),L37*H37,IF(ISNUMBER(J37),J37,IF(J37=\"RATE ONLY\",LOWER(\"RATE ONLY\"),\" \")))","v":" "}]
["IHDR1","C2.3.4",{"$nulls":3},"Concrete for bedding (Class A) and encasement for sewers:",{"$nulls":6}," "]
["Item",null,"C2.3.4.1",null,null,"Concrete (Class A) bedding (state class of concrete)","m³",{"$nulls":5}," "]
["Item",null,"C2.3.4.2",null,null,"Concrete encasement (state class of concrete)","m³",{"$nulls":5}," "]
["IHDR1","C2.3.5",{"$nulls":3},"Manholes, inspection chambers and cleaning eyes for sewers:",{"$nulls":6}," "]
["IHDR2",null,"C2.3.5.1",null,null,"Manholes (state type and drawing reference etc.):",{"$nulls":6}," "]
["Item",null,null,"(a)",null,"State pipe size and depth range","No.",{"$nulls":5},{"$f":"IF(ISNUMBER(H43),L43*H43,IF(ISNUMBER(J43),J43,IF(J43=\"RATE ONLY\",LOWER(\"RATE ONLY\"),\" \")))","v":" "}]
["Item",null,null,"(b)",null,"State pipe size and depth range","No.",{"$nulls":5}," "]
["IHDR2",null,"C2.3.5.2",null,null,"Extra over item C2.3.5.1 for backdrops for manholes (state type and drawing reference etc.):",{"$nulls":6}," "]
["Item",null,null,"(a)",null,"State pipe size and depth range","No.",{"$nulls":5}," "]
["Item",null,null,"(b)",null,"State pipe size and depth range","No.",{"$nulls":5}," "]
["IHDR2",null,"C2.3.5.3",null,null,"Inspection chambers (state type and drawing reference etc.):",{"$nulls":6}," "]
["Item",null,null,"(a)",null,"State pipe size and depth range","No.",{"$nulls":5}," "]
["Item",null,null,"(b)",null,"State pipe size and depth range","No.",{"$nulls":5}," "]
["IHDR2",null,"C2.3.5.4",null,null,"Cleaning eyes (state type and drawing reference etc.):",{"$nulls":6}," "]
["Item",null,null,"(a)",null,"State depth range","No.",{"$nulls":5}," "]
["Item",null,null,"(b)",null,"State depth range","No.",{"$nulls":5}," "]
["IHDR2",null,"C2.3.5.5",null,null,"Other structures (state type and drawing reference etc.):",{"$nulls":6}," "]
["Item",null,null,"(a)",null,"State pipe size and depth range","No.",{"$nulls":5}," "]
["Item",null,null,"(b)",null,"State pipe size and depth range","No.",{"$nulls":5}," "]
["IHDR1","C2.3.6",{"$nulls":3},"Covers and frames for sewer manholes, inspection chambers and other structures:",{"$nulls":6},{"$f":"IF(ISNUMBER(H57),L57*H57,IF(ISNUMBER(J57),J57,IF(J57=\"RATE ONLY\",LOWER(\"RATE ONLY\"),\" \")))","v":" "}]
["Item",null,"C2.3.6.1",null,null,"State type, strength class and size of cover and frame","No.",{"$nulls":5}," "]
["Item",null,"C2.3.6.2",null,null,"State type, strength class and size of cover and frame","No.",{"$nulls":5}," "]
["Item",null,"C2.3.6.3",null,null,"State type, strength class and size of cover and frame","No.",{"$nulls":5}," "]
["Item",null,"C2.3.6.4",null,null,"Etc., insert additional items as required","No.",{"$nulls":5}," "]
["IHDR1","C2.3.7",{"$nulls":3},"Sewer accessories (anchor blocks, marker posts, plug stoppers etc.):",{"$nulls":6}," "]
["IHDR2",null,"C2.3.7.1",null,null,"Anchor blocks (state type and drawing reference)","No.",{"$nulls":5}," "]
["IHDR2",null,"C2.3.7.2",null,null,"Anchor blocks (state type and drawing reference)","m³",{"$nulls":5}," "]
["IHDR2",null,"C2.3.7.3",null,null,"Marker posts (state type and drawing reference)","No.",{"$nulls":5}," "]
["IHDR2",null,"C2.3.7.4",null,null,"Plug stoppers (state type)","No.",{"$nulls":5}," "]
["IHDR2",null,"C2.3.7.5",null,null,"Other accessories:",{"$nulls":6}," "]
["Item",null,null,"(a)",null,"State type","No.",{"$nulls":5},{"$f":"IF(ISNUMBER(H68),L68*H68,IF(ISNUMBER(J68),J68,IF(J68=\"RATE ONLY\",LOWER(\"RATE ONLY\"),\" \")))","v":" "}]
["Item",null,null,"(b)",null,"State type","No.",{"$nulls":5},{"$f":"IF(ISNUMBER(H69),L69*H69,IF(ISNUMBER(J69),J69,IF(J69=\"RATE ONLY\",LOWER(\"RATE ONLY\"),\" \")))","v":" "}]
["IHDR1","C2.3.8",{"$nulls":3},"Sewer connections (erf and existing line connections):",{"$nulls":6},{"$f":"IF(ISNUMBER(H70),L70*H70,IF(ISNUMBER(J70),J70,IF(J70=\"RATE ONLY\",LOWER(\"RATE ONLY\"),\" \")))","v":" "}]
["IHDR2",null,"C2.3.8.1",null,null,"Erf connections (state type, depth range and drawing reference):",{"$nulls":6},{"$f":"IF(ISNUMBER(H71),L71*H71,IF(ISNUMBER(J71),J71,IF(J71=\"RATE ONLY\",LOWER(\"RATE ONLY\"),\" \")))","v":" "}]
["Item",null,null,"(a)",null,"Connection length (state length in metres)","No.",{"$nulls":5},{"$f":"IF(ISNUMBER(H72),L72*H72,IF(ISNUMBER(J72),J72,IF(J72=\"RATE ONLY\",LOWER(\"RATE ONLY\"),\" \")))","v":" "}]
["Item",null,null,"(b)",null,"Connection length (state length in metres)","No.",{"$nulls":5}," "]
["Item",null,null,"(c)",null,"Etc., insert additional items as required","No.",{"$nulls":5}," "]
["IHDR2",null,"C2.3.8.2",null,null,"Erf connections (state type, depth range and drawing reference):",{"$nulls":6},{"$f":"IF(ISNUMBER(H75),L75*H75,IF(ISNUMBER(J75),J75,IF(J75=\"RATE ONLY\",LOWER(\"RATE ONLY\"),\" \")))","v":" "}]
["Item",null,null,"(a)",null,"Connection length (state length in metres)","No.",{"$nulls":5}," "]
["Item",null,null,"(b)",null,"Connection length (state length in metres)","No.",{"$nulls":5}," "]
["Item",null,null,"(c)",null,"Etc., insert additional items as required","No.",{"$nulls":5}," "]
["IHDR2",null,"C2.3.8.3",null,null,"Erf connections to sewer manholes:",{"$nulls":6},{"$f":"IF(ISNUMBER(H79),L79*H79,IF(ISNUMBER(J79),J79,IF(J79=\"RATE ONLY\",LOWER(\"RATE ONLY\"),\" \")))","v":" "}]
["Item",null,null,"(a)",null,"State type, depth range, etc.","sum",{"$nulls":5}," "]
["Item",null,null,"(b)",null,"State type, depth range, etc.","sum",{"$nulls":5}," "]
["IHDR2",null,"C2.3.8.4",null,null,"Connecting sewers to existing manholes:",{"$nulls":6},{"$f":"IF(ISNUMBER(H82),L82*H82,IF(ISNUMBER(J82),J82,IF(J82=\"RATE ONLY\",LOWER(\"RATE ONLY\"),\" \")))","v":" "}]
["Item",null,null,"(a)",null,"State position, specification and drawing reference etc.","sum",{"$nulls":5}," "]
["Item",null,null,"(b)",null,"State position, specification and drawing reference etc.","sum",{"$nulls":5}," "]
["Item",null,null,"(c)",null,"Etc. insert additional items as required","sum",{"$nulls":5}," "]
["IHDR2",null,"C2.3.8.5",null,null,"Breaking into an existing sewer and building a new manhole:",{"$nulls":6},{"$f":"IF(ISNUMBER(H86),L86*H86,IF(ISNUMBER(J86),J86,IF(J86=\"RATE ONLY\",LOWER(\"RATE ONLY\"),\" \")))","v":" "}]
["Item",null,null,"(a)",null,"State position, specification and drawing reference etc.","sum",{"$nulls":5}," "]
["Item",null,null,"(b)",null,"State position, specification and drawing reference etc.","sum",{"$nulls":5}," "]
["Item",{"$nulls":4},"Etc. insert additional items as required","sum",{"$nulls":5}," "]
["IHDR1","C2.3.9",{"$nulls":3},"Raising and lowering existing sewer manholes:",{"$nulls":6},{"$f":"IF(ISNUMBER(H90),L90*H90,IF(ISNUMBER(J90),J90,IF(J90=\"RATE ONLY\",LOWER(\"RATE ONLY\"),\" \")))","v":" "}]
["IHDR2",null,"C2.3.9.1",null,null,"Raising manholes:",{"$nulls":6},{"$f":"IF(ISNUMBER(H91),L91*H91,IF(ISNUMBER(J91),J91,IF(J91=\"RATE ONLY\",LOWER(\"RATE ONLY\"),\" \")))","v":" "}]
["Item",null,null,"(a)",null,"State manhole type and drawing reference and height raised","No.",{"$nulls":5}," "]
["Item",null,null,"(b)",null,"State manhole type and drawing reference and height raised","No.",{"$nulls":5}," "]
["IHDR2",null,"C2.3.9.2",null,null,"Lowering manholes:",{"$nulls":6},{"$f":"IF(ISNUMBER(H94),L94*H94,IF(ISNUMBER(J94),J94,IF(J94=\"RATE ONLY\",LOWER(\"RATE ONLY\"),\" \")))","v":" "}]
["Item",null,null,"(a)",null,"State manhole type and drawing reference and height lowered","No.",{"$nulls":5}," "]
["Item",null,null,"(b)",null,"State manhole type and drawing reference and height lowered","No.",{"$nulls":5}," "]
["IHDR1","C2.3.10",{"$nulls":3},"Testing of sewer manholes","No.",{"$nulls":5},{"$f":"IF(ISNUMBER(H97),L97*H97,IF(ISNUMBER(J97),J97,IF(J97=\"RATE ONLY\",LOWER(\"RATE ONLY\"),\" \")))","v":" "}]
["IHDR1","C2.3.11",{"$nulls":3},"CCTV camera inspections:",{"$nulls":6},{"$f":"IF(ISNUMBER(H98),L98*H98,IF(ISNUMBER(J98),J98,IF(J98=\"RATE ONLY\",LOWER(\"RATE ONLY\"),\" \")))","v":" "}]
["Item",null,"C2.3.11.1",null,null,"State pipe diameter","m",{"$nulls":5},{"$f":"IF(ISNUMBER(H99),L99*H99,IF(ISNUMBER(J99),J99,IF(J99=\"RATE ONLY\",LOWER(\"RATE ONLY\"),\" \")))","v":" "}]
["Item",null,"C2.3.11.2",null,null,"State pipe diameter","m",{"$nulls":5},{"$f":"IF(ISNUMBER(H100),L100*H100,IF(ISNUMBER(J100),J100,IF(J100=\"RATE ONLY\",LOWER(\"RATE ONLY\"),\" \")))","v":" "}]
[{"$nulls":5},"Pay items C2.3.12 to C2.3.20 have been deliberately left for use for additional contract specific sewer related pay items inserted via the Contract Documentation."]
["IHDR1","C2.3.21",{"$nulls":3},"Supply and lay water mains complete with couplings:",{"$nulls":6},{"$f":"IF(ISNUMBER(H102),L102*H102,IF(ISNUMBER(J102),J102,IF(J102=\"RATE ONLY\",LOWER(\"RATE ONLY\"),\" \")))","v":" "}]
["IHDR2",null,"C2.3.21.1",null,null,"State for each water main the pipe material type, class, coupling type and the class of bedding etc.:",{"$nulls":6},{"$f":"IF(ISNUMBER(H103),L103*H103,IF(ISNUMBER(J103),J103,IF(J103=\"RATE ONLY\",LOWER(\"RATE ONLY\"),\" \")))","v":" "}]
["Item",null,null,"(a)",null,"State diameter","m",{"$nulls":5},{"$f":"IF(ISNUMBER(H104),L104*H104,IF(ISNUMBER(J104),J104,IF(J104=\"RATE ONLY\",LOWER(\"RATE ONLY\"),\" \")))","v":" "}]
["Item",null,null,"(b)",null,"State diameter","m",{"$nulls":5}," "]
["IHDR2",null,"C2.3.21.2",null,null,"State for each water main the pipe material type, class, coupling type and the class of bedding etc.:",{"$nulls":6},{"$f":"IF(ISNUMBER(H106),L106*H106,IF(ISNUMBER(J106),J106,IF(J106=\"RATE ONLY\",LOWER(\"RATE ONLY\"),\" \")))","v":" "}]
["Item",null,null,"(a)",null,"State diameter","m",{"$nulls":5}," "]
["Item",null,null,"(b)",null,"State diameter","m",{"$nulls":5}," "]
["IHDR2",null,"C2.3.21.3",null,null,"Etc., insert additional items as required",{"$nulls":6},{"$f":"IF(ISNUMBER(H109),L109*H109,IF(ISNUMBER(J109),J109,IF(J109=\"RATE ONLY\",LOWER(\"RATE ONLY\"),\" \")))","v":" "}]
["IHDR1","C2.3.22",{"$nulls":3},"Extra over item C2.3.21 for supplying and fixing water main fittings or specials complete with couplings:",{"$nulls":6},{"$f":"IF(ISNUMBER(H110),L110*H110,IF(ISNUMBER(J110),J110,IF(J110=\"RATE ONLY\",LOWER(\"RATE ONLY\"),\" \")))","v":" "}]
["IHDR2",null,"C2.3.22.1",null,null,"State for each water main fitting or special the type, class etc.:",{"$nulls":6},{"$f":"IF(ISNUMBER(H111),L111*H111,IF(ISNUMBER(J111),J111,IF(J111=\"RATE ONLY\",LOWER(\"RATE ONLY\"),\" \")))","v":" "}]
["Item",null,null,"(a)",null,"State diameter","No.",{"$nulls":5}," "]
["Item",null,null,"(b)",null,"State diameter","No.",{"$nulls":5}," "]
["IHDR2",null,"C2.3.22.2",null,null,"State for each water main fitting or special the type, class etc.:",{"$nulls":6},{"$f":"IF(ISNUMBER(H114),L114*H114,IF(ISNUMBER(J114),J114,IF(J114=\"RATE ONLY\",LOWER(\"RATE ONLY\"),\" \")))","v":" "}]
["Item",null,null,"(a)",null,"State diameter","No.",{"$nulls":5}," "]
["Item",null,null,"(b)",null,"State diameter","No.",{"$nulls":5}," "]
["IHDR2",null,"C2.3.22.3",null,null,"Etc., insert additional items as required",{"$nulls":6},{"$f":"IF(ISNUMBER(H117),L117*H117,IF(ISNUMBER(J117),J117,IF(J117=\"RATE ONLY\",LOWER(\"RATE ONLY\"),\" \")))","v":" "}]
["IHDR1","C2.3.23",{"$nulls":3},"Extra over item C2.3.21 for supplying and fixing water main valves:",{"$nulls":6},{"$f":"IF(ISNUMBER(H118),L118*H118,IF(ISNUMBER(J118),J118,IF(J118=\"RATE ONLY\",LOWER(\"RATE ONLY\"),\" \")))","v":" "}]
["IHDR2",null,"C2.3.23.1",null,null,"State for each water main valve the type, class etc.:",{"$nulls":6},{"$f":"IF(ISNUMBER(H119),L119*H119,IF(ISNUMBER(J119),J119,IF(J119=\"RATE ONLY\",LOWER(\"RATE ONLY\"),\" \")))","v":" "}]
["Item",null,null,"(a)",null,"State diameter","No.",{"$nulls":5}," "]
["Item",null,null,"(b)",null,"State diameter","No.",{"$nulls":5}," "]
["IHDR2",null,"C2.3.23.2",null,null,"State for each water main valve the type, class etc.:",{"$nulls":6},{"$f":"IF(ISNUMBER(H122),L122*H122,IF(ISNUMBER(J122),J122,IF(J122=\"RATE ONLY\",LOWER(\"RATE ONLY\"),\" \")))","v":" "}]
["Item",null,null,"(a)",null,"State diameter","No.",{"$nulls":5}," "]
["Item",null,null,"(b)",null,"State diameter","No.",{"$nulls":5}," "]
["IHDR2",null,"C2.3.23.3",null,null,"Etc., insert additional items as required",{"$nulls":6},{"$f":"IF(ISNUMBER(H125),L125*H125,IF(ISNUMBER(J125),J125,IF(J125=\"RATE ONLY\",LOWER(\"RATE ONLY\"),\" \")))","v":" "}]
["IHDR1","C2.3.24",{"$nulls":3},"Extra over item C2.3.21 for cutting of pipes and the supplying and fixing of extra couplings:",{"$nulls":6},{"$f":"IF(ISNUMBER(H126),L126*H126,IF(ISNUMBER(J126),J126,IF(J126=\"RATE ONLY\",LOWER(\"RATE ONLY\"),\" \")))","v":" "}]
["IHDR2",null,"C2.3.24.1",null,null,"State for each water main the pipe material type and coupling type:",{"$nulls":6},{"$f":"IF(ISNUMBER(H127),L127*H127,IF(ISNUMBER(J127),J127,IF(J127=\"RATE ONLY\",LOWER(\"RATE ONLY\"),\" \")))","v":" "}]
["Item",null,null,"(a)",null,"State diameter","No.",{"$nulls":5}," "]
["Item",null,null,"(b)",null,"State diameter","No.",{"$nulls":5}," "]
["IHDR2",null,"C2.3.24.2",null,null,"State for each water main the pipe material type and coupling type:",{"$nulls":6},{"$f":"IF(ISNUMBER(H130),L130*H130,IF(ISNUMBER(J130),J130,IF(J130=\"RATE ONLY\",LOWER(\"RATE ONLY\"),\" \")))","v":" "}]
["Item",null,null,"(a)",null,"State diameter","No.",{"$nulls":5}," "]
["Item",null,null,"(b)",null,"State diameter","No.",{"$nulls":5}," "]
["IHDR2",null,"C2.3.24.3",null,null,"Etc., insert additional items as required","No.",{"$nulls":5},{"$f":"IF(ISNUMBER(H133),L133*H133,IF(ISNUMBER(J133),J133,IF(J133=\"RATE ONLY\",LOWER(\"RATE ONLY\"),\" \")))","v":" "}]
["IHDR1","C2.3.25",{"$nulls":3},"Extra over items C2.3.21, C2.3.22 and C2.3.23 for supplying and installing joints with machined collars and special couplings:",{"$nulls":6},{"$f":"IF(ISNUMBER(H134),L134*H134,IF(ISNUMBER(J134),J134,IF(J134=\"RATE ONLY\",LOWER(\"RATE ONLY\"),\" \")))","v":" "}]
["IHDR2",null,"C2.3.25.1",null,null,"State for each water main the pipe collar and special coupling type:",{"$nulls":6},{"$f":"IF(ISNUMBER(H135),L135*H135,IF(ISNUMBER(J135),J135,IF(J135=\"RATE ONLY\",LOWER(\"RATE ONLY\"),\" \")))","v":" "}]
["Item",null,null,"(a)",null,"State diameter","No.",{"$nulls":5},{"$f":"IF(ISNUMBER(H136),L136*H136,IF(ISNUMBER(J136),J136,IF(J136=\"RATE ONLY\",LOWER(\"RATE ONLY\"),\" \")))","v":" "}]
["Item",null,null,"(b)",null,"State diameter","No.",{"$nulls":5}," "]
["IHDR2",null,"C2.3.25.2",null,null,"State for each water main the pipe collar and special coupling type:",{"$nulls":6},{"$f":"IF(ISNUMBER(H138),L138*H138,IF(ISNUMBER(J138),J138,IF(J138=\"RATE ONLY\",LOWER(\"RATE ONLY\"),\" \")))","v":" "}]
["Item",null,null,"(a)",null,"State diameter","No.",{"$nulls":5}," "]
["Item",null,null,"(b)",null,"State diameter","No.",{"$nulls":5}," "]
["IHDR2",null,"C2.3.25.3",null,null,"Etc., insert additional items as required",{"$nulls":6},{"$f":"IF(ISNUMBER(H141),L141*H141,IF(ISNUMBER(J141),J141,IF(J141=\"RATE ONLY\",LOWER(\"RATE ONLY\"),\" \")))","v":" "}]
["IHDR1","C2.3.26",{"$nulls":3},"Supplying and installing pipes, specials and valves on short pipe runs:",{"$nulls":6},{"$f":"IF(ISNUMBER(H142),L142*H142,IF(ISNUMBER(J142),J142,IF(J142=\"RATE ONLY\",LOWER(\"RATE ONLY\"),\" \")))","v":" "}]
["IHDR2",null,"C2.3.26.1",null,null,"State for each short run water main the pipe material type, class and class of bedding etc.:",{"$nulls":6},{"$f":"IF(ISNUMBER(H143),L143*H143,IF(ISNUMBER(J143),J143,IF(J143=\"RATE ONLY\",LOWER(\"RATE ONLY\"),\" \")))","v":" "}]
["Item",null,null,"(a)",null,"State diameter and length","m",{"$nulls":5}," "]
["Item",null,null,"(b)",null,"State diameter and length","m",{"$nulls":5}," "]
["IHDR2",null,"C2.3.26.2",null,null,"State for each short run water main the pipe material type, class and class of bedding etc.:",{"$nulls":6},{"$f":"IF(ISNUMBER(H146),L146*H146,IF(ISNUMBER(J146),J146,IF(J146=\"RATE ONLY\",LOWER(\"RATE ONLY\"),\" \")))","v":" "}]
["Item",null,null,"(a)",null,"State diameter","No.",{"$nulls":5}," "]
["Item",null,null,"(b)",null,"State diameter","No.",{"$nulls":5}," "]
["IHDR2",null,"C2.3.26.3",null,null,"Etc., insert additional items as required",{"$nulls":6},{"$f":"IF(ISNUMBER(H149),L149*H149,IF(ISNUMBER(J149),J149,IF(J149=\"RATE ONLY\",LOWER(\"RATE ONLY\"),\" \")))","v":" "}]
["IHDR1","C2.3.27",{"$nulls":3},"Extra over item C2.3.21 for encasing (wrapping) joints:",{"$nulls":6},{"$f":"IF(ISNUMBER(H150),L150*H150,IF(ISNUMBER(J150),J150,IF(J150=\"RATE ONLY\",LOWER(\"RATE ONLY\"),\" \")))","v":" "}]
["IHDR2",null,"C2.3.27.1",null,null,"State for each water main the number of joints to be encased (wrapped):",{"$nulls":6},{"$f":"IF(ISNUMBER(H151),L151*H151,IF(ISNUMBER(J151),J151,IF(J151=\"RATE ONLY\",LOWER(\"RATE ONLY\"),\" \")))","v":" "}]
["Item",null,null,"(a)",null,"State diameter","No.",{"$nulls":5}," "]
["Item",null,null,"(b)",null,"State diameter","No.",{"$nulls":5}," "]
["IHDR1","C2.3.28",{"$nulls":3},"Installation of hydrants and water meters:",{"$nulls":6},{"$f":"IF(ISNUMBER(H154),L154*H154,IF(ISNUMBER(J154),J154,IF(J154=\"RATE ONLY\",LOWER(\"RATE ONLY\"),\" \")))","v":" "}]
["IHDR2",null,"C2.3.28.1",null,null,"Describe hydrant type","No.",{"$nulls":5}," "]
["IHDR2",null,"C2.3.28.2",null,null,"Describe water meter type","No.",{"$nulls":5}," "]
["IHDR2",null,"C2.3.28.3",null,null,"Etc., insert additional items as required","No.",{"$nulls":5}," "]
["IHDR1","C2.3.29",{"$nulls":3},"Bedding for water mains (Class B and C) and fill blanket compacted to 90 % of MDD (100 % for sand):",{"$nulls":6}," "]
["IHDR2",null,"C2.3.29.1",null,null,"Bedding using selected granular material:",{"$nulls":6}," "]
["Item",null,null,"(a)",null,"From the excavated trench material","m³",{"$nulls":5}," "]
["Item",null,null,"(b)",null,"From other excavations on Site","m³",{"$nulls":5}," "]
["Item",null,null,"(c)",null,"From approved borrow areas","m³",{"$nulls":5}," "]
["Item",null,null,"(d)",null,"From sources provided by the Contractor","m³",{"$nulls":5}," "]
["Item",null,null,"(e)",null,"From commercial sources","m³",{"$nulls":5}," "]
["IHDR2",null,"C2.3.29.2",null,null,"Selected fill blanket material:",{"$nulls":6},{"$f":"IF(ISNUMBER(H165),L165*H165,IF(ISNUMBER(J165),J165,IF(J165=\"RATE ONLY\",LOWER(\"RATE ONLY\"),\" \")))","v":" "}]
["Item",null,null,"(a)",null,"From the excavated trench material","m³",{"$nulls":5},{"$f":"IF(ISNUMBER(H166),L166*H166,IF(ISNUMBER(J166),J166,IF(J166=\"RATE ONLY\",LOWER(\"RATE ONLY\"),\" \")))","v":" "}]
["Item",null,null,"(b)",null,"From other excavations on Site","m³",{"$nulls":5}," "]
["Item",null,null,"(c)",null,"From approved borrow areas","m³",{"$nulls":5}," "]
["Item",null,null,"(d)",null,"From sources provided by the Contractor","m³",{"$nulls":5}," "]
["Item",null,null,"(e)",null,"From commercial sources","m³",{"$nulls":5}," "]
["IHDR2",null,"C2.3.29.3",null,null,"Extra over items C2.3.29.1(a) to C2.3.29.1(c) and C2.3.29.2(a) to C2.3.29.2(c) for screening material","m³",{"$nulls":5},{"$f":"IF(ISNUMBER(H171),L171*H171,IF(ISNUMBER(J171),J171,IF(J171=\"RATE ONLY\",LOWER(\"RATE ONLY\"),\" \")))","v":" "}]
["IHDR1","C2.3.30",{"$nulls":3},"Concrete for bedding (Class A) and encasement for water mains:",{"$nulls":6}," "]
["Item",null,"C2.3.30.1",null,null,"Concrete (Class A) bedding (state class of concrete)","m³",{"$nulls":5}," "]
["Item",null,"C2.3.30.2",null,null,"Concrete encasement (state class of concrete)","m³",{"$nulls":5}," "]
["IHDR1","C2.3.31",{"$nulls":3},"Manholes, valve and hydrant chambers etc. for water mains",{"$nulls":6}," "]
["IHDR2",null,"C2.3.31.1",null,null,"Manholes (state type and drawing references etc.):",{"$nulls":6}," "]
["Item",null,null,"(a)",null,"State pipe size and depth range","No.",{"$nulls":5}," "]
["Item",null,null,"(b)",null,"State pipe size and depth range","No.",{"$nulls":5}," "]
["IHDR2",null,"C2.3.31.2",null,null,"Valve chambers (state valve type (gate valve, single or double air valve etc.) and drawing references etc.):",{"$nulls":6},{"$f":"IF(ISNUMBER(H179),L179*H179,IF(ISNUMBER(J179),J179,IF(J179=\"RATE ONLY\",LOWER(\"RATE ONLY\"),\" \")))","v":" "}]
["Item",null,null,"(a)",null,"State pipe size and depth range","No.",{"$nulls":5}," "]
["Item",null,null,"(b)",null,"State pipe size and depth range","No.",{"$nulls":5}," "]
["IHDR2",null,"C2.3.31.3",null,null,"Hydrant chambers (state type etc. and drawing references etc.):",{"$nulls":6},{"$f":"IF(ISNUMBER(H182),L182*H182,IF(ISNUMBER(J182),J182,IF(J182=\"RATE ONLY\",LOWER(\"RATE ONLY\"),\" \")))","v":" "}]
["Item",null,null,"(a)",null,"(a) State pipe size and depth range","No.",{"$nulls":5}," "]
["Item",null,null,"(b)",null,"(b) State pipe size and depth range","No.",{"$nulls":5}," "]
["IHDR2",null,"C2.3.31.4",null,null,"Other structures (state type etc. and drawing reference etc.):",{"$nulls":6},{"$f":"IF(ISNUMBER(H185),L185*H185,IF(ISNUMBER(J185),J185,IF(J185=\"RATE ONLY\",LOWER(\"RATE ONLY\"),\" \")))","v":" "}]
["Item",null,null,"(a)",null,"(a) State pipe size and depth range","No.",{"$nulls":5}," "]
["Item",null,null,"(b)",null,"(b) State pipe size and depth range","No.",{"$nulls":5}," "]
["IHDR1","C2.3.32",{"$nulls":3},"Covers and frames for water main manholes, valve and hydrant chambers and other structures:",{"$nulls":6},{"$f":"IF(ISNUMBER(H188),L188*H188,IF(ISNUMBER(J188),J188,IF(J188=\"RATE ONLY\",LOWER(\"RATE ONLY\"),\" \")))","v":" "}]
["Item",null,"C2.3.32.1",null,null,"Describe manhole or chamber and state type of cover and frame","No.",{"$nulls":5}," "]
["Item",null,"C2.3.32.2",null,null,"Describe manhole or chamber and state type of cover and frame","No.",{"$nulls":5}," "]
["Item",null,"C2.3.32.3",null,null,"Describe manhole or chamber and state type of cover and frame","No.",{"$nulls":5}," "]
["Item",null,"C2.3.32.4",null,null,"Etc., insert additional items as required","No.",{"$nulls":5}," "]
["IHDR1","C2.3.33",{"$nulls":3},"Water main accessories (anchor or thrust blocks, pedestals or marker posts etc.):",{"$nulls":6}," "]
["IHDR2",null,"C2.3.33.1",null,null,"Anchor or thrust blocks (state type and drawing reference)","No.",{"$nulls":5}," "]
["IHDR2",null,"C2.3.33.2",null,null,"Anchor or thrust blocks (state type and drawing reference)","m³",{"$nulls":5}," "]
["IHDR2",null,"C2.3.33.3",null,null,"Pedestals (state type and drawing reference)","No.",{"$nulls":5}," "]
["IHDR2",null,"C2.3.33.4",null,null,"Pedestals (state type and drawing reference)","m³",{"$nulls":5}," "]
["IHDR2",null,"C2.3.33.5",null,null,"Marker posts or blocks (state type and drawing reference)","No.",{"$nulls":5}," "]
["IHDR2",null,"C2.3.33.6",null,null,"Other accessories:",{"$nulls":6}," "]
["Item",null,null,"(a)",null,"State type","No.",{"$nulls":5},{"$f":"IF(ISNUMBER(H200),L200*H200,IF(ISNUMBER(J200),J200,IF(J200=\"RATE ONLY\",LOWER(\"RATE ONLY\"),\" \")))","v":" "}]
["Item",null,null,"(b)",null,"State type","No.",{"$nulls":5},{"$f":"IF(ISNUMBER(H201),L201*H201,IF(ISNUMBER(J201),J201,IF(J201=\"RATE ONLY\",LOWER(\"RATE ONLY\"),\" \")))","v":" "}]
["IHDR1","C2.3.34",{"$nulls":3},"Connections to existing water mains:",{"$nulls":6},{"$f":"IF(ISNUMBER(H202),L202*H202,IF(ISNUMBER(J202),J202,IF(J202=\"RATE ONLY\",LOWER(\"RATE ONLY\"),\" \")))","v":" "}]
["Item",null,"C2.3.34.1",null,null,"State connection details","No.",{"$nulls":5}," "]
["Item",null,"C2.3.34.2",null,null,"State connection details","No.",{"$nulls":5}," "]
["Item",null,"C2.3.34.3",null,null,"State connection details","No.",{"$nulls":5}," "]
["Item",null,"C2.3.34.4",null,null,"Etc., insert additional items as required","No.",{"$nulls":5}," "]
["IHDR1","C2.3.35",{"$nulls":3},"Raising and lowering existing manholes or valve or hydrant chambers:",{"$nulls":6}," "]
["IHDR2",null,"C2.3.35.1",null,null,"Raising manholes or valve of hydrant chambers:",{"$nulls":6}," "]
["Item",null,null,"(a)",null,"State manhole type and drawing reference and height raised","No.",{"$nulls":5},{"$f":"IF(ISNUMBER(H209),L209*H209,IF(ISNUMBER(J209),J209,IF(J209=\"RATE ONLY\",LOWER(\"RATE ONLY\"),\" \")))","v":" "}]
["Item",null,null,"(b)",null,"State manhole type and drawing reference and height raised","No.",{"$nulls":5}," "]
["IHDR2",null,"C2.3.35.2",null,null,"Lowering manholes or valve or hydrant chambers:",{"$nulls":6}," "]
["Item",null,null,"(a)",null,"State type and drawing reference and height lowered","No.",{"$nulls":5}," "]
["Item",null,null,"(b)",null,"State type and drawing reference and height lowered","No.",{"$nulls":5}," "]
["IHDR1","C2.3.36",{"$nulls":3},"Disinfection of potable water pipelines:",{"$nulls":6}," "]
["Item",null,"C2.3.36.1",null,null,"State diameter of pipe disinfected","m",{"$nulls":5}," "]
["Item",null,"C2.3.36.2",null,null,"State diameter of pipe disinfected","m",{"$nulls":5}," "]
["Item",null,"C2.3.36.3",null,null,"Etc., insert additional items as required","m",{"$nulls":5}," "]
["#BillEnd#"]
["#BillEnd#","TOTAL CARRIED FORWARD TO SUMMARY",{"$nulls":10},{"$f":"SUBTOTAL(9,M$10:M217)","v":0}]
["#BillEnd#"]

{"sheet":"2.4","index":9,"n_rows":28,"n_cols":13,"rows_kept":28,"hidden":true}
["#BillSheet#"]
["#BillSheet#","C2.4","ENERGY AND OTHER SERVICES",{"$nulls":3},"\n",null,null,"SCHEDULE A",{"$f":"SUBTOTAL(9,M$7:M883)","v":0},null,{"$f":"J2","v":"SCHEDULE A"}]
["#BillSheet#"]
["ColHDR"]
["ColHDR","ITEM",{"$nulls":3},"DESCRIPTION","UNIT","QTY","RATE","AMT",null,"RATE","AMOUNT"]
["ColHDR"]
[{"$nulls":5},"ENERGY AND OTHER SERVICES"]
["IHDR1","C2.4.1",{"$nulls":3},"Bedding for electric power cables using material:",{"$nulls":6},{"$f":"IF(ISNUMBER(H8),L8*H8,IF(ISNUMBER(J8),J8,IF(J8=\"RATE ONLY\",LOWER(\"RATE ONLY\"),\" \")))","v":" "}]
["IHDR2",null,"C2.4.1.1",null,null,"Selected from the excavated trench material","m³",{"$nulls":5}," "]
["IHDR2",null,"C2.4.1.2",null,null,"Selected from other excavations on Site","m³",{"$nulls":5}," "]
["IHDR2",null,"C2.4.1.3",null,null,"Selected from approved borrow areas","m³",{"$nulls":5}," "]
["IHDR2",null,"C2.4.1.4",null,null,"Selected from sources provided by the Contractor","m³",{"$nulls":5}," "]
["IHDR2",null,"C2.4.1.5",null,null,"From commercial sources:",{"$nulls":6}," "]
["Item",null,null,"(a)",null,"Uncrushed material (state material type)","m³",{"$nulls":5},{"$f":"IF(ISNUMBER(H14),L14*H14,IF(ISNUMBER(J14),J14,IF(J14=\"RATE ONLY\",LOWER(\"RATE ONLY\"),\" \")))","v":" "}]
["Item",null,null,"(b)",null,"Crushed stone material (state material type)","m³",{"$nulls":5},{"$f":"IF(ISNUMBER(H15),L15*H15,IF(ISNUMBER(J15),J15,IF(J15=\"RATE ONLY\",LOWER(\"RATE ONLY\"),\" \")))","v":" "}]
["IHDR1","C2.4.2",{"$nulls":3},"Concrete for bedding and encasement for electric power cables",{"$nulls":6},{"$f":"IF(ISNUMBER(H16),L16*H16,IF(ISNUMBER(J16),J16,IF(J16=\"RATE ONLY\",LOWER(\"RATE ONLY\"),\" \")))","v":" "}]
["Item",null,"C2.4.2.1",null,null,"Concrete bedding (Class C16/20-20 concrete)","m³",{"$nulls":5}," "]
["Item",null,"C2.4.2.2",null,null,"Concrete encasement of cables (Class C16/20-20 concrete)","m³",{"$nulls":5}," "]
["IHDR1","C2.4.3",{"$nulls":3},"Cable laying accessories (warning tape, protection slabs, markers etc.)",{"$nulls":6}," "]
["IHDR2",null,"C2.4.3.1",null,null,"Electrical warning tape (state type)","m",{"$nulls":5}," "]
["IHDR2",null,"C2.4.3.2",null,null,"Concrete slab protection (state type and dimensions etc)","m",{"$nulls":5}," "]
["IHDR2",null,"C2.4.3.3",null,null,"Cable markers (state type)","No.",{"$nulls":5}," "]
["IHDR2",null,"C2.4.3.4",null,null,"Other accessories:",{"$nulls":6}," "]
["Item",null,null,"(a)",null,"State type","m",{"$nulls":5},{"$f":"IF(ISNUMBER(H24),L24*H24,IF(ISNUMBER(J24),J24,IF(J24=\"RATE ONLY\",LOWER(\"RATE ONLY\"),\" \")))","v":" "}]
["Item",null,null,"(b)",null,"State type","No.",{"$nulls":5},{"$f":"IF(ISNUMBER(H25),L25*H25,IF(ISNUMBER(J25),J25,IF(J25=\"RATE ONLY\",LOWER(\"RATE ONLY\"),\" \")))","v":" "}]
["#BillEnd#"]
["#BillEnd#","TOTAL CARRIED FORWARD TO SUMMARY",{"$nulls":10},{"$f":"SUBTOTAL(9,M$10:M25)","v":0}]
["#BillEnd#"]

{"sheet":"3.1","index":10,"n_rows":329,"n_cols":13,"rows_kept":329,"hidden":true}
["#BillSheet#"]
["#BillSheet#","C3.1","DRAINS",{"$nulls":3},"\n",null,null,"SCHEDULE A",{"$f":"SUBTOTAL(9,M$7:M1184)","v":0},null,{"$f":"J2","v":"SCHEDULE A"}]
["#BillSheet#"]
["ColHDR"]
["ColHDR","ITEM",{"$nulls":3},"DESCRIPTION","UNIT","QTY","RATE","AMT",null,"RATE","AMOUNT"]
["ColHDR"]
[{"$nulls":5},"DRAINS"]
["IHDR1","C3.1.1",{"$nulls":3},"Excavation for open drains:",{"$nulls":6},{"$f":"IF(ISNUMBER(H8),L8*H8,IF(ISNUMBER(J8),J8,IF(J8=\"RATE ONLY\",LOWER(\"RATE ONLY\"),\" \")))","v":" "}]
[]
["IHDR2",null,"C3.1.1.1",null,null,"Excavating all material situated within the following depth ranges below the surface level using conventional methods:",{"$nulls":6},{"$f":"IF(ISNUMBER(H10),L10*H10,IF(ISNUMBER(J10),J10,IF(J10=\"RATE ONLY\",LOWER(\"RATE ONLY\"),\" \")))","v":" "}]
[]
["Item",null,null,"(a)",null,"0 m to 1,5 m","m³",{"$nulls":4},{"v":45,"d":"45.00"},{"$f":"IF(ISNUMBER(H12),L12*H12,IF(ISNUMBER(J12),J12,IF(J12=\"RATE ONLY\",LOWER(\"RATE ONLY\"),\" \")))","v":" "}]
[]
["Item",null,null,"(b)",null,"Exceeding 1,5 m and up to 3,0 m","m³",{"$nulls":4},{"v":50,"d":"50.00"},{"$f":"IF(ISNUMBER(H14),L14*H14,IF(ISNUMBER(J14),J14,IF(J14=\"RATE ONLY\",LOWER(\"RATE ONLY\"),\" \")))","v":" "}]
[]
["Item",null,null,"(c)",null,"Etc, in increments of 1,5 m","m³",{"$nulls":5},{"$f":"IF(ISNUMBER(H16),L16*H16,IF(ISNUMBER(J16),J16,IF(J16=\"RATE ONLY\",LOWER(\"RATE ONLY\"),\" \")))","v":" "}]
["IHDR2",null,"C3.1.1.2",null,null,"Extra over sub-item C3.1.1.1 for excavation in hard and boulder material, irrespective of depth","m³",{"$nulls":4},{"v":250,"d":"250.00"},{"$f":"IF(ISNUMBER(H17),L17*H17,IF(ISNUMBER(J17),J17,IF(J17=\"RATE ONLY\",LOWER(\"RATE ONLY\"),\" \")))","v":" "}]
[]
["IHDR2",null,"C3.1.1.3",null,null,"Extra over sub-item C3.1.1.1 for excavation in stabilised existing road layers, irrespective of depth","m³",{"$nulls":4},{"v":19.5,"d":"19.50"},{"$f":"IF(ISNUMBER(H19),L19*H19,IF(ISNUMBER(J19),J19,IF(J19=\"RATE ONLY\",LOWER(\"RATE ONLY\"),\" \")))","v":" "}]
[]
["IHDR2",null,"C3.1.1.4",null,null,"Excavating soft material situated 0 m to 1,5 m below the surface level using labour enhanced construction methods","m³",{"$nulls":5},{"$f":"IF(ISNUMBER(H21),L21*H21,IF(ISNUMBER(J21),J21,IF(J21=\"RATE ONLY\",LOWER(\"RATE ONLY\"),\" \")))","v":" "}]
[]
["IHDR2",null,"C3.1.1.5",null,null,"Excavating intermediate material situated 0 m to 1,5 m below the surface level using labour enhanced construction methods","m³",{"$nulls":5},{"$f":"IF(ISNUMBER(H23),L23*H23,IF(ISNUMBER(J23),J23,IF(J23=\"RATE ONLY\",LOWER(\"RATE ONLY\"),\" \")))","v":" "}]
[]
["IHDR1","C3.1.2",{"$nulls":3},"Clearing, shaping and disposal of accumulated sediment in existing unlined open drains",{"$nulls":6},{"$f":"IF(ISNUMBER(H25),L25*H25,IF(ISNUMBER(J25),J25,IF(J25=\"RATE ONLY\",LOWER(\"RATE ONLY\"),\" \")))","v":" "}]
[]
["Item",null,"C3.1.2.1",null,null,"Using conventional methods","m³",{"$nulls":4},{"v":82,"d":"82.00"},{"$f":"IF(ISNUMBER(H27),L27*H27,IF(ISNUMBER(J27),J27,IF(J27=\"RATE ONLY\",LOWER(\"RATE ONLY\"),\" \")))","v":" "}]
[]
["Item",null,"C3.1.2.2",null,null,"Using labour enhanced construction methods","m³",{"$nulls":5},{"$f":"IF(ISNUMBER(H29),L29*H29,IF(ISNUMBER(J29),J29,IF(J29=\"RATE ONLY\",LOWER(\"RATE ONLY\"),\" \")))","v":" "}]
["IHDR1","C3.1.3",{"$nulls":3},"Excavation, clearing and disposal of accumulated sediment in existing lined drains and drainage systems:",{"$nulls":6},{"$f":"IF(ISNUMBER(H30),L30*H30,IF(ISNUMBER(J30),J30,IF(J30=\"RATE ONLY\",LOWER(\"RATE ONLY\"),\" \")))","v":" "}]
[]
["IHDR2",null,"C3.1.3.1",null,null,"Using conventional methods (up to 1,5 m):",{"$nulls":6},{"$f":"IF(ISNUMBER(H32),L32*H32,IF(ISNUMBER(J32),J32,IF(J32=\"RATE ONLY\",LOWER(\"RATE ONLY\"),\" \")))","v":" "}]
[]
["Item",null,null,"(a)",null,"Manholes and inlet and outlet structures","m³",{"$nulls":4},{"v":310,"d":"310.00"},{"$f":"IF(ISNUMBER(H34),L34*H34,IF(ISNUMBER(J34),J34,IF(J34=\"RATE ONLY\",LOWER(\"RATE ONLY\"),\" \")))","v":" "}]
[]
["Item",null,null,"(b)",null,"Culvert barrels","m³",{"$nulls":4},{"v":400,"d":"400.00"},{"$f":"IF(ISNUMBER(H36),L36*H36,IF(ISNUMBER(J36),J36,IF(J36=\"RATE ONLY\",LOWER(\"RATE ONLY\"),\" \")))","v":" "}]
[]
["Item",null,null,"(c)",null,"Concrete or other lined side drains","m³",{"$nulls":5},{"$f":"IF(ISNUMBER(H38),L38*H38,IF(ISNUMBER(J38),J38,IF(J38=\"RATE ONLY\",LOWER(\"RATE ONLY\"),\" \")))","v":" "}]
["IHDR2",null,"C3.1.3.2",null,null,"Using conventional methods (in excess of 1,5 m):",{"$nulls":6},{"$f":"IF(ISNUMBER(H39),L39*H39,IF(ISNUMBER(J39),J39,IF(J39=\"RATE ONLY\",LOWER(\"RATE ONLY\"),\" \")))","v":" "}]
[]
["Item",null,null,"(a)",null,"Manholes and inlet and outlet structures","m³",{"$nulls":5}," "]
["Item",null,null,"(b)",null,"Culvert barrels","m³",{"$nulls":5}," "]
["Item",null,null,"(c)",null,"Concrete or other lined side drains","m³",{"$nulls":5}," "]
["IHDR2",null,"C3.1.3.3",null,null,"Using labour enhanced construction methods:",{"$nulls":6},{"$f":"IF(ISNUMBER(H44),L44*H44,IF(ISNUMBER(J44),J44,IF(J44=\"RATE ONLY\",LOWER(\"RATE ONLY\"),\" \")))","v":" "}]
[]
["Item",null,null,"(a)",null,"Manholes and inlet and outlet structures","m³",{"$nulls":5}," "]
["Item",null,null,"(b)",null,"Culvert barrels","m³",{"$nulls":5}," "]
["Item",null,null,"(c)",null,"Concrete or other lined side drains","m³",{"$nulls":5}," "]
["IHDR1","C3.1.4",{"$nulls":3},"Excavation and disposal of material for subsoil drainage systems:",{"$nulls":6},{"$f":"IF(ISNUMBER(H49),L49*H49,IF(ISNUMBER(J49),J49,IF(J49=\"RATE ONLY\",LOWER(\"RATE ONLY\"),\" \")))","v":" "}]
[]
["IHDR2",null,"C3.1.4.1",null,null,"Excavating in all material situated within the following depth ranges below the surface:",{"$nulls":6},{"$f":"IF(ISNUMBER(H51),L51*H51,IF(ISNUMBER(J51),J51,IF(J51=\"RATE ONLY\",LOWER(\"RATE ONLY\"),\" \")))","v":" "}]
[]
["Item",null,null,"(a)",null,"0 m to 1,5 m","m³",{"$nulls":4},{"v":85,"d":"85.00"},{"$f":"IF(ISNUMBER(H53),L53*H53,IF(ISNUMBER(J53),J53,IF(J53=\"RATE ONLY\",LOWER(\"RATE ONLY\"),\" \")))","v":" "}]
[]
["Item",null,null,"(b)",null,"Exceeding 1,5 m and up to 3,0 m","m³",{"$nulls":4},{"v":290,"d":"290.00"},{"$f":"IF(ISNUMBER(H55),L55*H55,IF(ISNUMBER(J55),J55,IF(J55=\"RATE ONLY\",LOWER(\"RATE ONLY\"),\" \")))","v":" "}]
[]
["Item",null,null,"(c)",null,"Etc, in increments of 1,5 m","m³",{"$nulls":5}," "]
["IHDR2",null,"C3.1.4.2",null,null,"Excavating soft material situated within 0 m to 1,5 m below the surface level using labour enhanced construction methods","m³",{"$nulls":5},{"$f":"IF(ISNUMBER(H58),L58*H58,IF(ISNUMBER(J58),J58,IF(J58=\"RATE ONLY\",LOWER(\"RATE ONLY\"),\" \")))","v":" "}]
[]
["IHDR2",null,"C3.1.4.3",null,null,"Excavating intermediate material situated within 0 m to 1,5 m below the surface level using labour enhanced construction methods","m³",{"$nulls":5},{"$f":"IF(ISNUMBER(H60),L60*H60,IF(ISNUMBER(J60),J60,IF(J60=\"RATE ONLY\",LOWER(\"RATE ONLY\"),\" \")))","v":" "}]
[]
["IHDR2",null,"C3.1.4.4",null,null,"Extra over sub-item C3.1.4.1 for excavation in hard and boulder material, irrespective of depth","m³",{"$nulls":4},{"v":290,"d":"290.00"},{"$f":"IF(ISNUMBER(H62),L62*H62,IF(ISNUMBER(J62),J62,IF(J62=\"RATE ONLY\",LOWER(\"RATE ONLY\"),\" \")))","v":" "}]
[]
["IHDR2",null,"C3.1.4.5",null,null,"Extra over sub-item C3.1.4.1 for excavation through stabilised existing road layers","m³",{"$nulls":5},{"$f":"IF(ISNUMBER(H64),L64*H64,IF(ISNUMBER(J64),J64,IF(J64=\"RATE ONLY\",LOWER(\"RATE ONLY\"),\" \")))","v":" "}]
[]
["IHDR2",null,"C3.1.4.6",null,null,"Excavation and disposal of material for composite in-plane fin-drain type drainage systems using a trenching machine:",{"$nulls":6},{"$f":"IF(ISNUMBER(H66),L66*H66,IF(ISNUMBER(J66),J66,IF(J66=\"RATE ONLY\",LOWER(\"RATE ONLY\"),\" \")))","v":" "}]
[]
["Item",null,null,"(a)",null,"Trench width of …..and depth of.......","m",{"$nulls":5}," "]
["Item",null,null,"(b)",null,"Etc for width of…..and depth of......","m",{"$nulls":5}," "]
["IHDR1","C3.1.5",{"$nulls":3},"Impermeable backfilling to subsoil drainage systems:",{"$nulls":6},{"$f":"IF(ISNUMBER(H70),L70*H70,IF(ISNUMBER(J70),J70,IF(J70=\"RATE ONLY\",LOWER(\"RATE ONLY\"),\" \")))","v":" "}]
[]
["Item",null,"C3.1.5.1",null,null,"Un-stabilised natural gravel obtained from approved sources on the site","m³",{"$nulls":4},{"v":96,"d":"96.00"},{"$f":"IF(ISNUMBER(H72),L72*H72,IF(ISNUMBER(J72),J72,IF(J72=\"RATE ONLY\",LOWER(\"RATE ONLY\"),\" \")))","v":" "}]
["PB"]
["PB","CARRIED FORWARD",{"$nulls":10},{"$f":"SUBTOTAL(9,M$7:M72)","v":0}]
["PB"]
["PB"]
["PB","BROUGHT FORWARD",{"$nulls":10},{"$f":"SUBTOTAL(9,M$7:M75)","v":0}]
["PB"]
[]
["Item",null,"C3.1.5.2",null,null,"G5 material obtained from commercial sources","m³",{"$nulls":4},{"v":130,"d":"130.00"},{"$f":"IF(ISNUMBER(H80),L80*H80,IF(ISNUMBER(J80),J80,IF(J80=\"RATE ONLY\",LOWER(\"RATE ONLY\"),\" \")))","v":" "}]
[]
["Item",null,"C3.1.5.3",null,null,"Extra over items C3.1.5.1 and C3.1.5.2 for stabilisation with 4,0 % CEM II (32.5) cement","m³",{"$nulls":4},{"v":185,"d":"185.00"},{"$f":"IF(ISNUMBER(H82),L82*H82,IF(ISNUMBER(J82),J82,IF(J82=\"RATE ONLY\",LOWER(\"RATE ONLY\"),\" \")))","v":" "}]
[]
["IHDR1","C3.1.6",{"$nulls":3},"Construction of banks and dykes:",{"$nulls":6},{"$f":"IF(ISNUMBER(H84),L84*H84,IF(ISNUMBER(J84),J84,IF(J84=\"RATE ONLY\",LOWER(\"RATE ONLY\"),\" \")))","v":" "}]
[]
["Item",null,"C3.1.6.1",null,null,"Banks and dykes using conventional methods","m³",{"$nulls":4},{"v":70,"d":"70.00"},{"$f":"IF(ISNUMBER(H86),L86*H86,IF(ISNUMBER(J86),J86,IF(J86=\"RATE ONLY\",LOWER(\"RATE ONLY\"),\" \")))","v":" "}]
[]
["Item",null,"C3.1.6.2",null,null,"Banks and dykes using labour enhanced construction methods","m³",{"$nulls":5},{"$f":"IF(ISNUMBER(H88),L88*H88,IF(ISNUMBER(J88),J88,IF(J88=\"RATE ONLY\",LOWER(\"RATE ONLY\"),\" \")))","v":" "}]
["IHDR1","C3.1.7",{"$nulls":3},"Natural permeable material in subsoil drainage systems (approved crushed stone):",{"$nulls":6},{"$f":"IF(ISNUMBER(H89),L89*H89,IF(ISNUMBER(J89),J89,IF(J89=\"RATE ONLY\",LOWER(\"RATE ONLY\"),\" \")))","v":" "}]
[]
["IHDR2",null,"C3.1.7.1",null,null,"Crushed stone obtained from approved sources on the site:",{"$nulls":6},{"$f":"IF(ISNUMBER(H91),L91*H91,IF(ISNUMBER(J91),J91,IF(J91=\"RATE ONLY\",LOWER(\"RATE ONLY\"),\" \")))","v":" "}]
[]
["Item",null,null,"(a)",null,"Fine grade","m³",{"$nulls":4},{"v":375,"d":"375.00"},{"$f":"IF(ISNUMBER(H93),L93*H93,IF(ISNUMBER(J93),J93,IF(J93=\"RATE ONLY\",LOWER(\"RATE ONLY\"),\" \")))","v":" "}]
[]
["Item",null,null,"(b)",null,"Coarse grade","m³",{"$nulls":4},{"v":365,"d":"365.00"},{"$f":"IF(ISNUMBER(H95),L95*H95,IF(ISNUMBER(J95),J95,IF(J95=\"RATE ONLY\",LOWER(\"RATE ONLY\"),\" \")))","v":" "}]
[]
["IHDR2",null,"C3.1.7.2",null,null,"Crushed stone obtained from commercial sources:",{"$nulls":6},{"$f":"IF(ISNUMBER(H97),L97*H97,IF(ISNUMBER(J97),J97,IF(J97=\"RATE ONLY\",LOWER(\"RATE ONLY\"),\" \")))","v":" "}]
[]
["Item",null,null,"(a)",null,"Fine grade","m³",{"$nulls":4},{"v":400,"d":"400.00"},{"$f":"IF(ISNUMBER(H99),L99*H99,IF(ISNUMBER(J99),J99,IF(J99=\"RATE ONLY\",LOWER(\"RATE ONLY\"),\" \")))","v":" "}]
[]
["Item",null,null,"(b)",null,"Coarse grade","m³",{"$nulls":4},{"v":390,"d":"390.00"},{"$f":"IF(ISNUMBER(H101),L101*H101,IF(ISNUMBER(J101),J101,IF(J101=\"RATE ONLY\",LOWER(\"RATE ONLY\"),\" \")))","v":" "}]
[]
["IHDR1","C3.1.8",{"$nulls":3},"Natural permeable material in subsoil drainage systems (approved natural sand):",{"$nulls":6},{"$f":"IF(ISNUMBER(H103),L103*H103,IF(ISNUMBER(J103),J103,IF(J103=\"RATE ONLY\",LOWER(\"RATE ONLY\"),\" \")))","v":" "}]
[]
["IHDR2",null,"C3.1.8.1",null,null,"Natural sand obtained from approved sources:",{"$nulls":6},{"$f":"IF(ISNUMBER(H105),L105*H105,IF(ISNUMBER(J105),J105,IF(J105=\"RATE ONLY\",LOWER(\"RATE ONLY\"),\" \")))","v":" "}]
[]
["Item",null,null,"(a)",null,"Fine grade","m³",{"$nulls":4},{"v":300,"d":"300.00"},{"$f":"IF(ISNUMBER(H107),L107*H107,IF(ISNUMBER(J107),J107,IF(J107=\"RATE ONLY\",LOWER(\"RATE ONLY\"),\" \")))","v":" "}]
[]
["Item",null,null,"(b)",null,"Medium grade","m³",{"$nulls":4},{"v":290,"d":"290.00"},{"$f":"IF(ISNUMBER(H109),L109*H109,IF(ISNUMBER(J109),J109,IF(J109=\"RATE ONLY\",LOWER(\"RATE ONLY\"),\" \")))","v":" "}]
[]
["Item",null,null,"(c)",null,"Coarse grade","m³",{"$nulls":4},{"v":280,"d":"280.00"},{"$f":"IF(ISNUMBER(H111),L111*H111,IF(ISNUMBER(J111),J111,IF(J111=\"RATE ONLY\",LOWER(\"RATE ONLY\"),\" \")))","v":" "}]
[]
["IHDR2",null,"C3.1.8.2",null,null,"Natural sand from commercial sources:",{"$nulls":6},{"$f":"IF(ISNUMBER(H113),L113*H113,IF(ISNUMBER(J113),J113,IF(J113=\"RATE ONLY\",LOWER(\"RATE ONLY\"),\" \")))","v":" "}]
[]
["Item",null,null,"(a)",null,"Fine grade","m³",{"$nulls":4},{"v":360,"d":"360.00"},{"$f":"IF(ISNUMBER(H115),L115*H115,IF(ISNUMBER(J115),J115,IF(J115=\"RATE ONLY\",LOWER(\"RATE ONLY\"),\" \")))","v":" "}]
[]
["Item",null,null,"(b)",null,"Medium grade","m³",{"$nulls":4},{"v":350,"d":"350.00"},{"$f":"IF(ISNUMBER(H117),L117*H117,IF(ISNUMBER(J117),J117,IF(J117=\"RATE ONLY\",LOWER(\"RATE ONLY\"),\" \")))","v":" "}]
[]
["PB"]
["PB","CARRIED FORWARD",{"$nulls":10},{"$f":"SUBTOTAL(9,M$7:M118)","v":0}]
["PB"]
["PB"]
["PB","BROUGHT FORWARD",{"$nulls":10},{"$f":"SUBTOTAL(9,M$7:M121)","v":0}]
["PB"]
["Item",null,null,"(c)",null,"Coarse grade","m³",{"$nulls":4},{"v":340,"d":"340.00"},{"$f":"IF(ISNUMBER(H125),L125*H125,IF(ISNUMBER(J125),J125,IF(J125=\"RATE ONLY\",LOWER(\"RATE ONLY\"),\" \")))","v":" "}]
[]
["IHDR1","C3.1.9",{"$nulls":3},"Pipes in subsoil drainage systems:",{"$nulls":6},{"$f":"IF(ISNUMBER(H127),L127*H127,IF(ISNUMBER(J127),J127,IF(J127=\"RATE ONLY\",LOWER(\"RATE ONLY\"),\" \")))","v":" "}]
[]
["IHDR2",null,"C3.1.9.1",null,null,"U-PVC pipes and fittings, normal duty, complete with couplings:",{"$nulls":6},{"$f":"IF(ISNUMBER(H129),L129*H129,IF(ISNUMBER(J129),J129,IF(J129=\"RATE ONLY\",LOWER(\"RATE ONLY\"),\" \")))","v":" "}]
[]
["Item",null,null,"(a)",null,"100 mm internal dia, perforated or slotted","m",{"$nulls":4},{"v":44,"d":"44.00"},{"$f":"IF(ISNUMBER(H131),L131*H131,IF(ISNUMBER(J131),J131,IF(J131=\"RATE ONLY\",LOWER(\"RATE ONLY\"),\" \")))","v":" "}]
[]
["Item",null,null,"(b)",null,"100 mm internal dia, unperforated","m",{"$nulls":4},{"v":40,"d":"40.00"},{"$f":"IF(ISNUMBER(H133),L133*H133,IF(ISNUMBER(J133),J133,IF(J133=\"RATE ONLY\",LOWER(\"RATE ONLY\"),\" \")))","v":" "}]
[]
["Item",null,null,"(c)",null,"150 mm internal dia, perforated or slotted","m",{"$nulls":4},{"v":54,"d":"54.00"},{"$f":"IF(ISNUMBER(H135),L135*H135,IF(ISNUMBER(J135),J135,IF(J135=\"RATE ONLY\",LOWER(\"RATE ONLY\"),\" \")))","v":" "}]
[]
["Item",null,null,"(d)",null,"150 mm internal dia, unperforated","m",{"$nulls":4},{"v":50,"d":"50.00"},{"$f":"IF(ISNUMBER(H137),L137*H137,IF(ISNUMBER(J137),J137,IF(J137=\"RATE ONLY\",LOWER(\"RATE ONLY\"),\" \")))","v":" "}]
[]
["IHDR2",null,"PC3.1.9.2",null,null,"HDPE pipes and fittings, normal duty, complete with couplings:",{"$nulls":6},{"$f":"IF(ISNUMBER(H139),L139*H139,IF(ISNUMBER(J139),J139,IF(J139=\"RATE ONLY\",LOWER(\"RATE ONLY\"),\" \")))","v":" "}]
[]
["Item",null,null,"(a)",null,"100 mm internal dia, perforated or slotted","m",{"$nulls":4},{"v":54,"d":"54.00"},{"$f":"IF(ISNUMBER(H141),L141*H141,IF(ISNUMBER(J141),J141,IF(J141=\"RATE ONLY\",LOWER(\"RATE ONLY\"),\" \")))","v":" "}]
[]
["Item",null,null,"(b)",null,"100 mm internal dia, unperforated","m",{"$nulls":4},{"v":50,"d":"50.00"},{"$f":"IF(ISNUMBER(H143),L143*H143,IF(ISNUMBER(J143),J143,IF(J143=\"RATE ONLY\",LOWER(\"RATE ONLY\"),\" \")))","v":" "}]
[]
["Item",null,null,"(c)",null,"150 mm internal dia, perforated or slotted","m",{"$nulls":4},{"v":64,"d":"64.00"},{"$f":"IF(ISNUMBER(H145),L145*H145,IF(ISNUMBER(J145),J145,IF(J145=\"RATE ONLY\",LOWER(\"RATE ONLY\"),\" \")))","v":" "}]
[]
["Item",null,null,"(d)",null,"150 mm internal dia, unperforated","m",{"$nulls":4},{"v":60,"d":"60.00"},{"$f":"IF(ISNUMBER(H147),L147*H147,IF(ISNUMBER(J147),J147,IF(J147=\"RATE ONLY\",LOWER(\"RATE ONLY\"),\" \")))","v":" "}]
[]
["IHDR1","C3.1.10",{"$nulls":3},"Polymer film sheeting or similar approved material, for lining subsoil drainage systems:",{"$nulls":6},{"$f":"IF(ISNUMBER(H149),L149*H149,IF(ISNUMBER(J149),J149,IF(J149=\"RATE ONLY\",LOWER(\"RATE ONLY\"),\" \")))","v":" "}]
[]
["Item",null,"C3.1.10.1",null,null,"0,15 mm thick","m²",{"$nulls":4},{"v":9.2,"d":"9.20"},{"$f":"IF(ISNUMBER(H151),L151*H151,IF(ISNUMBER(J151),J151,IF(J151=\"RATE ONLY\",LOWER(\"RATE ONLY\"),\" \")))","v":" "}]
[]
["Item",null,"C3.1.10.2",null,null,"0,25 mm thick","m²",{"$nulls":5},{"$f":"IF(ISNUMBER(H153),L153*H153,IF(ISNUMBER(J153),J153,IF(J153=\"RATE ONLY\",LOWER(\"RATE ONLY\"),\" \")))","v":" "}]
["IHDR1","C3.1.11",{"$nulls":3},"Geotextiles (Grade 2)","m²",{"$nulls":4},{"v":18,"d":"18.00"},{"$f":"IF(ISNUMBER(H154),L154*H154,IF(ISNUMBER(J154),J154,IF(J154=\"RATE ONLY\",LOWER(\"RATE ONLY\"),\" \")))","v":" "}]
[]
["IHDR1","C3.1.12",{"$nulls":3},"Composite drainage systems:",{"$nulls":6},{"$f":"IF(ISNUMBER(H156),L156*H156,IF(ISNUMBER(J156),J156,IF(J156=\"RATE ONLY\",LOWER(\"RATE ONLY\"),\" \")))","v":" "}]
[]
["Item",null,"C3.1.12.1",null,null,"In-plane drainage systems (state size, type of core and type grade, etc. of geotextile)","m",{"$nulls":5}," "]
["Item",null,"C3.1.12.2",null,null,"Vertical subsoil strip drainage systems (state size, type of core and type grade, etc. of geotextile)","m",{"$nulls":5}," "]
["Item",null,"C3.1.12.3",null,null,"Panel drainage systems (state size, type of core and type grade, etc. of geotextile)","m",{"$nulls":5}," "]
["Item",null,"C3.1.12.4",null,null,"Alternative drainage systems as detailed in Contract Documentation (state size, type and other details)","m",{"$nulls":5}," "]
["IHDR1","C3.1.13",{"$nulls":3},"Concrete outlet structures, manhole boxes, junction boxes and cleaning eyes for subsoil drainage systems:",{"$nulls":6},{"$f":"IF(ISNUMBER(H162),L162*H162,IF(ISNUMBER(J162),J162,IF(J162=\"RATE ONLY\",LOWER(\"RATE ONLY\"),\" \")))","v":" "}]
[]
["Item",null,"C3.1.13.1",null,null,"Outlet structures (Type A: see DWG No 113142-0-DRG-RR-04-0019)","No.",{"$nulls":4},{"v":5300,"d":"5,300.00"},{"$f":"IF(ISNUMBER(H164),L164*H164,IF(ISNUMBER(J164),J164,IF(J164=\"RATE ONLY\",LOWER(\"RATE ONLY\"),\" \")))","v":" "}]
[]
["Item",null,"C3.1.13.2",null,null,"Inspection boxes (specify each type and drawing reference)","No.",{"$nulls":5}," "]
["Item",null,"C3.1.13.3",null,null,"Junction boxes (see DWG No 113142-0-DRG-RR-04-0019)","No.",{"$nulls":4},{"v":6800,"d":"6,800.00"},{"$f":"IF(ISNUMBER(H167),L167*H167,IF(ISNUMBER(J167),J167,IF(J167=\"RATE ONLY\",LOWER(\"RATE ONLY\"),\" \")))","v":" "}]
[]
["Item",null,"C3.1.13.4",null,null,"Cleaning eyes (see DWG No 113142-0-DRG-RR-04-0019)","No.",{"$nulls":4},{"v":3690,"d":"3,690.00"},{"$f":"IF(ISNUMBER(H169),L169*H169,IF(ISNUMBER(J169),J169,IF(J169=\"RATE ONLY\",LOWER(\"RATE ONLY\"),\" \")))","v":" "}]
[]
["IHDR1","C3.1.14",{"$nulls":3},"Caps for subsoil drain pipes:",{"$nulls":6},{"$f":"IF(ISNUMBER(H171),L171*H171,IF(ISNUMBER(J171),J171,IF(J171=\"RATE ONLY\",LOWER(\"RATE ONLY\"),\" \")))","v":" "}]
[]
["Item",null,"C3.1.14.1",null,null,"Concrete caps","No.",{"$nulls":4},{"v":90,"d":"90.00"},{"$f":"IF(ISNUMBER(H173),L173*H173,IF(ISNUMBER(J173),J173,IF(J173=\"RATE ONLY\",LOWER(\"RATE ONLY\"),\" \")))","v":" "}]
[]
["Item",null,"C3.1.14.2",null,null,"Cast metal iron caps","No.",{"$nulls":5}," "]
["Item",null,"C3.1.14.3",null,null,"Other (Glass fibre reinforced, PVC etc.) (specify)","No.",{"$nulls":5}," "]
["IHDR1","C3.1.15",{"$nulls":3},"Repairing or replacing existing drainage systems","prov sum",{"$nulls":5},{"$f":"IF(ISNUMBER(H177),L177*H177,IF(ISNUMBER(J177),J177,IF(J177=\"RATE ONLY\",LOWER(\"RATE ONLY\"),\" \")))","v":" "}]
["PB"]
["PB","CARRIED FORWARD",{"$nulls":10},{"$f":"SUBTOTAL(9,M$7:M177)","v":0}]
["PB"]
["PB"]
["PB","BROUGHT FORWARD",{"$nulls":10},{"$f":"SUBTOTAL(9,M$7:M180)","v":0}]
["PB"]
[]
["IHDR1","C3.1.16",{"$nulls":3},"Loading and hauling of material in excess of 1,0 km","m³-km",{"$nulls":4},{"v":4.5,"d":"4.50"},{"$f":"IF(ISNUMBER(H185),L185*H185,IF(ISNUMBER(J185),J185,IF(J185=\"RATE ONLY\",LOWER(\"RATE ONLY\"),\" \")))","v":" "}]
[]
["IHDR1","C3.1.17",{"$nulls":3},"Backfilling existing eroded side drains","m³",{"$nulls":5},{"$f":"IF(ISNUMBER(H187),L187*H187,IF(ISNUMBER(J187),J187,IF(J187=\"RATE ONLY\",LOWER(\"RATE ONLY\"),\" \")))","v":" "}]
[]
["IHDR1","C3.1.18",{"$nulls":3},"Backfilling of drains with selected material compacted to 93 % of MDD prior to construction of concrete lining and/or stone pitched lining","m³",{"$nulls":5},{"$f":"IF(ISNUMBER(H189),L189*H189,IF(ISNUMBER(J189),J189,IF(J189=\"RATE ONLY\",LOWER(\"RATE ONLY\"),\" \")))","v":" "}]
[]
["IHDR1","C3.1.19",{"$nulls":3},"Exposing of existing subsoil drains","m³",{"$nulls":5},{"$f":"IF(ISNUMBER(H191),L191*H191,IF(ISNUMBER(J191),J191,IF(J191=\"RATE ONLY\",LOWER(\"RATE ONLY\"),\" \")))","v":" "}]
[]
["IHDR1","C3.1.20",{"$nulls":3},"Breaking into existing drainage structures and install subsoil drain pipe","No.",{"$nulls":4},{"v":350,"d":"350.00"},{"$f":"IF(ISNUMBER(H193),L193*H193,IF(ISNUMBER(J193),J193,IF(J193=\"RATE ONLY\",LOWER(\"RATE ONLY\"),\" \")))","v":" "}]
[]
["IHDR1","C3.1.21",{"$nulls":3},"Clearing of existing subsoil drains:",{"$nulls":6},{"$f":"IF(ISNUMBER(H195),L195*H195,IF(ISNUMBER(J195),J195,IF(J195=\"RATE ONLY\",LOWER(\"RATE ONLY\"),\" \")))","v":" "}]
[]
["item",null,"C3.1.21.1",null,null,"Cleaning rod, brush and flushing","m",{"$nulls":5},{"$f":"IF(ISNUMBER(H197),L197*H197,IF(ISNUMBER(J197),J197,IF(J197=\"RATE ONLY\",LOWER(\"RATE ONLY\"),\" \")))","v":" "}]
["Item",null,"C3.1.21.2",null,null,"Hydro jetting","m",{"$nulls":5},{"$f":"IF(ISNUMBER(H198),L198*H198,IF(ISNUMBER(J198),J198,IF(J198=\"RATE ONLY\",LOWER(\"RATE ONLY\"),\" \")))","v":" "}]
["IHDR1","C3.1.22",{"$nulls":3},"Test flushing of subsoil drain pipe systems","No.",{"$nulls":4},{"v":1220,"d":"1,220.00"},{"$f":"IF(ISNUMBER(H199),L199*H199,IF(ISNUMBER(J199),J199,IF(J199=\"RATE ONLY\",LOWER(\"RATE ONLY\"),\" \")))","v":" "}]
[]
["IHDR1","C3.1.23",{"$nulls":3},"Subsoil drain outlet marker (see DWG No 113142-0-DRG-RR-04-0019)","No.",{"$nulls":4},{"v":230,"d":"230.00"},{"$f":"IF(ISNUMBER(H201),L201*H201,IF(ISNUMBER(J201),J201,IF(J201=\"RATE ONLY\",LOWER(\"RATE ONLY\"),\" \")))","v":" "}]
[]
["IHDR1","C3.1.24",{"$nulls":3},"Submission of as built drawings by the Contractor","prov sum",null,null,{"$f":"H203*I203","v":0},null,{"v":60000,"d":"60,000.00"},{"$f":"IF(ISNUMBER(H203),L203*H203,IF(ISNUMBER(J203),J203,IF(J203=\"RATE ONLY\",LOWER(\"RATE ONLY\"),\" \")))","v":0}]
[]
["IHDR1","PC3.1.25",{"$nulls":3},"Class C16/20-20 cast in situ concrete for the encasing of subsoil drainage systems, including formwork","m³",{"$nulls":4},{"v":1950,"d":"1,950.00"},{"$f":"IF(ISNUMBER(H205),L205*H205,IF(ISNUMBER(J205),J205,IF(J205=\"RATE ONLY\",LOWER(\"RATE ONLY\"),\" \")))","v":" "}]
[]
["IHDR1","PC3.1.26",{"$nulls":3},"Removing subsoil drains in the following depths:",{"$nulls":6},{"$f":"IF(ISNUMBER(H207),L207*H207,IF(ISNUMBER(J207),J207,IF(J207=\"RATE ONLY\",LOWER(\"RATE ONLY\"),\" \")))","v":" "}]
[]
["item",null,"PC3.1.26.1",null,null,"0 m up to 0,5 m","m",{"$nulls":4},{"v":40,"d":"40.00"},{"$f":"IF(ISNUMBER(H209),L209*H209,IF(ISNUMBER(J209),J209,IF(J209=\"RATE ONLY\",LOWER(\"RATE ONLY\"),\" \")))","v":" "}]
[]
["Item",null,"PC3.1.26.2",null,null,"Exceeding 0,5 m up to 1,0 m","m",{"$nulls":4},{"v":40,"d":"40.00"},{"$f":"IF(ISNUMBER(H211),L211*H211,IF(ISNUMBER(J211),J211,IF(J211=\"RATE ONLY\",LOWER(\"RATE ONLY\"),\" \")))","v":" "}]
[]
["Item",null,"PC3.1.26.3",null,null,"Deeper than 1,0 m","m",{"$nulls":4},{"v":45,"d":"45.00"},{"$f":"IF(ISNUMBER(H213),L213*H213,IF(ISNUMBER(J213),J213,IF(J213=\"RATE ONLY\",LOWER(\"RATE ONLY\"),\" \")))","v":" "}]
[]
["IHDR1","PC3.1.27",{"$nulls":3},"Galvanized wire mesh at outlets of subsoil drainage systems","No.",{"$nulls":4},{"v":120,"d":"120.00"},{"$f":"IF(ISNUMBER(H215),L215*H215,IF(ISNUMBER(J215),J215,IF(J215=\"RATE ONLY\",LOWER(\"RATE ONLY\"),\" \")))","v":" "}]
[]
["IHDR","C3.1/ C1.7",{"$nulls":3},"LOADING AND HAULING",{"$nulls":6},{"$f":"IF(ISNUMBER(H217),L217*H217,IF(ISNUMBER(J217),J217,IF(J217=\"RATE ONLY\",LOWER(\"RATE ONLY\"),\" \")))","v":" "}]
[]
["IHDR1",null,"C1.7.1",null,null,"Loading",{"$nulls":6},{"$f":"IF(ISNUMBER(H219),L219*H219,IF(ISNUMBER(J219),J219,IF(J219=\"RATE ONLY\",LOWER(\"RATE ONLY\"),\" \")))","v":" "}]
[]
["item",null,"C1.7.1.1",null,null,"Loading from stockpile using machines and some hand labour where necessary","m³",{"$nulls":4},{"v":2.5,"d":"2.50"},{"$f":"IF(ISNUMBER(H221),L221*H221,IF(ISNUMBER(J221),J221,IF(J221=\"RATE ONLY\",LOWER(\"RATE ONLY\"),\" \")))","v":" "}]
[]
["IHDR1",null,"C1.7.2",null,null,"Hauling",{"$nulls":6},{"$f":"IF(ISNUMBER(H223),L223*H223,IF(ISNUMBER(J223),J223,IF(J223=\"RATE ONLY\",LOWER(\"RATE ONLY\"),\" \")))","v":" "}]
[]
["IHDR2",null,"C1.7.2.1",null,null,"Hauling material for use in the Works and off-loading it on the site of the Works:",{"$nulls":6},{"$f":"IF(ISNUMBER(H225),L225*H225,IF(ISNUMBER(J225),J225,IF(J225=\"RATE ONLY\",LOWER(\"RATE ONLY\"),\" \")))","v":" "}]
[]
["item",null,null,"(a)",null,"Soil, gravel, crushed stone and pavement layer material","m³-km",{"$nulls":4},{"v":4.5,"d":"4.50"},{"$f":"IF(ISNUMBER(H227),L227*H227,IF(ISNUMBER(J227),J227,IF(J227=\"RATE ONLY\",LOWER(\"RATE ONLY\"),\" \")))","v":" "}]
[]
["IHDR","C3.1/ C4.1",{"$nulls":3},"BORROW MATERIALS",{"$nulls":6},{"$f":"IF(ISNUMBER(H229),L229*H229,IF(ISNUMBER(J229),J229,IF(J229=\"RATE ONLY\",LOWER(\"RATE ONLY\"),\" \")))","v":" "}]
["PB"]
["PB","CARRIED FORWARD",{"$nulls":10},{"$f":"SUBTOTAL(9,M$7:M229)","v":0}]
["PB"]
["PB"]
["PB","BROUGHT FORWARD",{"$nulls":10},{"$f":"SUBTOTAL(9,M$7:M232)","v":0}]
["PB"]
[]
["IHDR1",null,"C4.1.5",null,null,"Excavating of materials in the borrow pits and quarries, material obtained from",{"$nulls":6},{"$f":"IF(ISNUMBER(H237),L237*H237,IF(ISNUMBER(J237),J237,IF(J237=\"RATE ONLY\",LOWER(\"RATE ONLY\"),\" \")))","v":" "}]
[]
["item",null,"C4.1.5.5",null,null,"Hard excavation (by blasting)","m³",{"$nulls":4},{"v":102,"d":"102.00"},{"$f":"IF(ISNUMBER(H239),L239*H239,IF(ISNUMBER(J239),J239,IF(J239=\"RATE ONLY\",LOWER(\"RATE ONLY\"),\" \")))","v":" "}]
[]
["IHDR1",null,"C4.1.7",null,null,"Producing the material by:",{"$nulls":6},{"$f":"IF(ISNUMBER(H241),L241*H241,IF(ISNUMBER(J241),J241,IF(J241=\"RATE ONLY\",LOWER(\"RATE ONLY\"),\" \")))","v":" "}]
[]
["item",null,"C4.1.7.3",null,null,"Multiple-stage crushing including screening","m³",{"$nulls":4},{"v":82,"d":"82.00"},{"$f":"IF(ISNUMBER(H243),L243*H243,IF(ISNUMBER(J243),J243,IF(J243=\"RATE ONLY\",LOWER(\"RATE ONLY\"),\" \")))","v":" "}]
[]
["IHDR1",null,"C4.1.12",null,null,"Stockpiling the material:",{"$nulls":6},{"$f":"IF(ISNUMBER(H245),L245*H245,IF(ISNUMBER(J245),J245,IF(J245=\"RATE ONLY\",LOWER(\"RATE ONLY\"),\" \")))","v":" "}]
[]
["item",null,"C4.1.12.1",null,null,"Material from a producing plant","m³",{"$nulls":4},{"v":28,"d":"28.00"},{"$f":"IF(ISNUMBER(H247),L247*H247,IF(ISNUMBER(J247),J247,IF(J247=\"RATE ONLY\",LOWER(\"RATE ONLY\"),\" \")))","v":" "}]
[]
["IHDR","C3.1/ C5.2",{"$nulls":3},"FILL ",{"$nulls":6},{"$f":"IF(ISNUMBER(H249),L249*H249,IF(ISNUMBER(J249),J249,IF(J249=\"RATE ONLY\",LOWER(\"RATE ONLY\"),\" \")))","v":" "}]
[]
["IHDR1",null,"C5.2.2",null,null,"Fill construction: ",{"$nulls":6},{"$f":"IF(ISNUMBER(H251),L251*H251,IF(ISNUMBER(J251),J251,IF(J251=\"RATE ONLY\",LOWER(\"RATE ONLY\"),\" \")))","v":" "}]
[]
["item",null,"C5.2.2.7",null,null,"Drainage blanket layer","m³",{"$nulls":4},{"v":45,"d":"45.00"},{"$f":"IF(ISNUMBER(H253),L253*H253,IF(ISNUMBER(J253),J253,IF(J253=\"RATE ONLY\",LOWER(\"RATE ONLY\"),\" \")))","v":" "}]
[]
["IHDR","C3.1/ C5.3",{"$nulls":3},"ROAD PAVEMENT LAYERS",{"$nulls":6},{"$f":"IF(ISNUMBER(H255),L255*H255,IF(ISNUMBER(J255),J255,IF(J255=\"RATE ONLY\",LOWER(\"RATE ONLY\"),\" \")))","v":" "}]
[]
["IHDR1",null,"C5.3.2",null,null,"Construction of pavement layers:",{"$nulls":6},{"$f":"IF(ISNUMBER(H257),L257*H257,IF(ISNUMBER(J257),J257,IF(J257=\"RATE ONLY\",LOWER(\"RATE ONLY\"),\" \")))","v":" "}]
[]
["IHDR2",null,"C5.3.2.1",null,null,"Construction of layers using conventional construction methods:",{"$nulls":6},{"$f":"IF(ISNUMBER(H259),L259*H259,IF(ISNUMBER(J259),J259,IF(J259=\"RATE ONLY\",LOWER(\"RATE ONLY\"),\" \")))","v":" "}]
[]
["IHDR3",null,null,"(j)",null,"Lower subbase gravel layer (chemically stabilised) compacted to 95% of MDD:",{"$nulls":6},{"$f":"IF(ISNUMBER(H261),L261*H261,IF(ISNUMBER(J261),J261,IF(J261=\"RATE ONLY\",LOWER(\"RATE ONLY\"),\" \")))","v":" "}]
[]
["item1",{"$nulls":3},"(i)","150 mm thick","m³",{"$nulls":4},{"v":91,"d":"91.00"},{"$f":"IF(ISNUMBER(H263),L263*H263,IF(ISNUMBER(J263),J263,IF(J263=\"RATE ONLY\",LOWER(\"RATE ONLY\"),\" \")))","v":" "}]
[]
["IHDR","C3.1/ C5.4",{"$nulls":3},"STABILISATION",{"$nulls":6},{"$f":"IF(ISNUMBER(H265),L265*H265,IF(ISNUMBER(J265),J265,IF(J265=\"RATE ONLY\",LOWER(\"RATE ONLY\"),\" \")))","v":" "}]
[]
["IHDR1",null,"C5.4.2",null,null,"Chemical stabilisation:",{"$nulls":6},{"$f":"IF(ISNUMBER(H267),L267*H267,IF(ISNUMBER(J267),J267,IF(J267=\"RATE ONLY\",LOWER(\"RATE ONLY\"),\" \")))","v":" "}]
[]
["IHDR2",null,"C5.4.2.1",null,null,"Chemical stabilisation of pavement layers: ",{"$nulls":6},{"$f":"IF(ISNUMBER(H269),L269*H269,IF(ISNUMBER(J269),J269,IF(J269=\"RATE ONLY\",LOWER(\"RATE ONLY\"),\" \")))","v":" "}]
[]
["IHDR3",null,null,"(a)",null,"Gravel subbase",{"$nulls":6},{"$f":"IF(ISNUMBER(H271),L271*H271,IF(ISNUMBER(J271),J271,IF(J271=\"RATE ONLY\",LOWER(\"RATE ONLY\"),\" \")))","v":" "}]
[]
["item1",{"$nulls":3},"(ii)","150 mm thick","m³",{"$nulls":4},{"v":13,"d":"13.00"},{"$f":"IF(ISNUMBER(H273),L273*H273,IF(ISNUMBER(J273),J273,IF(J273=\"RATE ONLY\",LOWER(\"RATE ONLY\"),\" \")))","v":" "}]
[]
["IHDR1",null,"C5.4.5",null,null,"Cementitious stabilisation agents for pavement layers:",{"$nulls":6},{"$f":"IF(ISNUMBER(H275),L275*H275,IF(ISNUMBER(J275),J275,IF(J275=\"RATE ONLY\",LOWER(\"RATE ONLY\"),\" \")))","v":" "}]
["PB"]
["PB","CARRIED FORWARD",{"$nulls":10},{"$f":"SUBTOTAL(9,M$7:M275)","v":0}]
["PB"]
["PB"]
["PB","BROUGHT FORWARD",{"$nulls":10},{"$f":"SUBTOTAL(9,M$7:M278)","v":0}]
["PB"]
[]
["IHDR2",null,"C5.4.5.1",null,null,"Addition of cementitious stabilisation agents for pavement layers:",{"$nulls":6},{"$f":"IF(ISNUMBER(H283),L283*H283,IF(ISNUMBER(J283),J283,IF(J283=\"RATE ONLY\",LOWER(\"RATE ONLY\"),\" \")))","v":" "}]
[]
["item",null,null,"(a)",null,"Cement (for pavement layer) - CEM II 32.5","t",{"$nulls":4},{"v":1650,"d":"1,650.00"},{"$f":"IF(ISNUMBER(H285),L285*H285,IF(ISNUMBER(J285),J285,IF(J285=\"RATE ONLY\",LOWER(\"RATE ONLY\"),\" \")))","v":" "}]
[]
["IHDR1",null,"C5.4.10",null,null,"Provision and application of water for curing","kilolitre",{"$nulls":4},{"v":105,"d":"105.00"},{"$f":"IF(ISNUMBER(H287),L287*H287,IF(ISNUMBER(J287),J287,IF(J287=\"RATE ONLY\",LOWER(\"RATE ONLY\"),\" \")))","v":" "}]
[]
["IHDR1",null,"C5.4.11",null,null,"Curing by covering with the subsequent layer","m²",{"$nulls":4},{"v":10,"d":"10.00"},{"$f":"IF(ISNUMBER(H289),L289*H289,IF(ISNUMBER(J289),J289,IF(J289=\"RATE ONLY\",LOWER(\"RATE ONLY\"),\" \")))","v":" "}]
{"$rows_empty":37}
["#BillEnd#"]
["#BillEnd#","TOTAL CARRIED FORWARD TO SUMMARY",{"$nulls":10},{"$f":"SUBTOTAL(9,M$7:M290)","v":0}]
["#BillEnd#"]

{"sheet":"3.2","index":11,"n_rows":356,"n_cols":13,"rows_kept":356,"hidden":true}
["#BillSheet#"]
["#BillSheet#","C3.2","CULVERTS",{"$nulls":3},"\n",null,null,"SCHEDULE A",{"$f":"SUBTOTAL(9,M$7:M1031)","v":0},null,{"$f":"J2","v":"SCHEDULE A"}]
["#BillSheet#"]
["ColHDR"]
["ColHDR","ITEM",{"$nulls":3},"DESCRIPTION","UNIT","QTY","RATE","AMT",null,"RATE","AMOUNT"]
["ColHDR"]
[{"$nulls":5},"CULVERTS"]
["IHDR1","C3.2.1",{"$nulls":3},"Excavation for culvert structures:",{"$nulls":6},{"$f":"IF(ISNUMBER(H8),L8*H8,IF(ISNUMBER(J8),J8,IF(J8=\"RATE ONLY\",LOWER(\"RATE ONLY\"),\" \")))","v":" "}]
[]
["IHDR2",null,"C3.2.1.1",null,null,"Excavating in all material situated within the following depth ranges below the surface level:",{"$nulls":6},{"$f":"IF(ISNUMBER(H10),L10*H10,IF(ISNUMBER(J10),J10,IF(J10=\"RATE ONLY\",LOWER(\"RATE ONLY\"),\" \")))","v":" "}]
[]
["Item",null,null,"(a)",null,"0 m to 1,5 m","m³",{"$nulls":4},{"v":50,"d":"50.00"},{"$f":"IF(ISNUMBER(H12),L12*H12,IF(ISNUMBER(J12),J12,IF(J12=\"RATE ONLY\",LOWER(\"RATE ONLY\"),\" \")))","v":" "}]
[]
["Item",null,null,"(b)",null,"Exceeding 1,5 m and up to 3,0 m","m³",{"$nulls":4},{"v":65,"d":"65.00"},{"$f":"IF(ISNUMBER(H14),L14*H14,IF(ISNUMBER(J14),J14,IF(J14=\"RATE ONLY\",LOWER(\"RATE ONLY\"),\" \")))","v":" "}]
[]
["Item",null,null,"(c)",null,"Exceeding 3,0 m and up to 4,5 m","m³",{"$nulls":4},{"v":80,"d":"80.00"},{"$f":"IF(ISNUMBER(H16),L16*H16,IF(ISNUMBER(J16),J16,IF(J16=\"RATE ONLY\",LOWER(\"RATE ONLY\"),\" \")))","v":" "}]
[]
["Item",null,null,"(d)",null,"Exceeding 4,5 m and up to 6,0 m","m³",{"$nulls":4},{"v":110,"d":"110.00"},{"$f":"IF(ISNUMBER(H18),L18*H18,IF(ISNUMBER(J18),J18,IF(J18=\"RATE ONLY\",LOWER(\"RATE ONLY\"),\" \")))","v":" "}]
[]
["IHDR2",null,"C3.2.1.2",null,null,"Excavating soft material 0 m to 1,5 m below the surface level using labour enhanced construction methods, or instructed by hand under Clause A3.2.7.2d):","m³",{"$nulls":5},{"$f":"IF(ISNUMBER(H20),L20*H20,IF(ISNUMBER(J20),J20,IF(J20=\"RATE ONLY\",LOWER(\"RATE ONLY\"),\" \")))","v":" "}]
[]
["IHDR2",null,"C3.2.1.3",null,null,"Excavating intermediate material 0 m to 1,5 m below the surface level using labour enhanced construction methods, or instructed by hand under Clause A3.2.7.2d):","m³",{"$nulls":5},{"$f":"IF(ISNUMBER(H22),L22*H22,IF(ISNUMBER(J22),J22,IF(J22=\"RATE ONLY\",LOWER(\"RATE ONLY\"),\" \")))","v":" "}]
[]
["IHDR2",null,"C3.2.1.4",null,null,"Extra over sub-item C3.2.1.1 for excavation in hard or boulder material, irrespective of depth","m³",{"$nulls":4},{"v":310,"d":"310.00"},{"$f":"IF(ISNUMBER(H24),L24*H24,IF(ISNUMBER(J24),J24,IF(J24=\"RATE ONLY\",LOWER(\"RATE ONLY\"),\" \")))","v":" "}]
[]
["IHDR2",null,"C3.2.1.5",null,null,"Extra over sub-item C3.2.1.1 for excavation in stabilised existing road layers, irrespective of depth","m³",{"$nulls":5},{"$f":"IF(ISNUMBER(H26),L26*H26,IF(ISNUMBER(J26),J26,IF(J26=\"RATE ONLY\",LOWER(\"RATE ONLY\"),\" \")))","v":" "}]
[]
["IHDR1","C3.2.2",{"$nulls":3},"Backfilling:",{"$nulls":6},{"$f":"IF(ISNUMBER(H28),L28*H28,IF(ISNUMBER(J28),J28,IF(J28=\"RATE ONLY\",LOWER(\"RATE ONLY\"),\" \")))","v":" "}]
[]
["IHDR2",null,"C3.2.2.1",null,null,"Using the excavated material","m³",{"$nulls":4},{"v":96,"d":"96.00"},{"$f":"IF(ISNUMBER(H30),L30*H30,IF(ISNUMBER(J30),J30,IF(J30=\"RATE ONLY\",LOWER(\"RATE ONLY\"),\" \")))","v":" "}]
[]
["IHDR2",null,"C3.2.2.2",null,null,"Using imported selected material:",{"$nulls":6},{"$f":"IF(ISNUMBER(H32),L32*H32,IF(ISNUMBER(J32),J32,IF(J32=\"RATE ONLY\",LOWER(\"RATE ONLY\"),\" \")))","v":" "}]
[]
["Item",null,null,"(a)",null,"From commercial sources (State type)","m³",{"$nulls":5},{"$f":"IF(ISNUMBER(H34),L34*H34,IF(ISNUMBER(J34),J34,IF(J34=\"RATE ONLY\",LOWER(\"RATE ONLY\"),\" \")))","v":" "}]
["Item",null,null,"(b)",null,"From sources on site (G7 quality material)","m³",{"$nulls":4},{"v":125,"d":"125.00"},{"$f":"IF(ISNUMBER(H35),L35*H35,IF(ISNUMBER(J35),J35,IF(J35=\"RATE ONLY\",LOWER(\"RATE ONLY\"),\" \")))","v":" "}]
[]
["IHDR2",null,"C3.2.2.3",null,null,"Extra over sub-items C3.2.2.1 and C3.2.2.2 for soil cement backfilling:",{"$nulls":6},{"$f":"IF(ISNUMBER(H37),L37*H37,IF(ISNUMBER(J37),J37,IF(J37=\"RATE ONLY\",LOWER(\"RATE ONLY\"),\" \")))","v":" "}]
[]
["Item",null,null,"(a)",null,"With wet mixture (5% of CEM II class 32.5 cement)","m³",{"$nulls":4},{"v":185,"d":"185.00"},{"$f":"IF(ISNUMBER(H39),L39*H39,IF(ISNUMBER(J39),J39,IF(J39=\"RATE ONLY\",LOWER(\"RATE ONLY\"),\" \")))","v":" "}]
[]
["Item",null,null,"(b)",null,"With dry mixture (specify cement content) of 3 % cement","m³",{"$nulls":5},{"$f":"IF(ISNUMBER(H41),L41*H41,IF(ISNUMBER(J41),J41,IF(J41=\"RATE ONLY\",LOWER(\"RATE ONLY\"),\" \")))","v":" "}]
["Item",null,null,"(c)",null,"Variation in cement","kg",{"$nulls":4},1.65,{"$f":"IF(ISNUMBER(H42),L42*H42,IF(ISNUMBER(J42),J42,IF(J42=\"RATE ONLY\",LOWER(\"RATE ONLY\"),\" \")))","v":" "}]
[]
["IHDR2",null,"C3.2.2.4",null,null,"Extra over sub-items C3.2.2.1 and C3.2.2.2 for screed layers (class C12/15-20 concrete)","m³",{"$nulls":4},{"v":1800,"d":"1,800.00"},{"$f":"IF(ISNUMBER(H44),L44*H44,IF(ISNUMBER(J44),J44,IF(J44=\"RATE ONLY\",LOWER(\"RATE ONLY\"),\" \")))","v":" "}]
[]
["IHDR1","C3.2.3",{"$nulls":3},"Concrete pipe culverts:",{"$nulls":6},{"$f":"IF(ISNUMBER(H46),L46*H46,IF(ISNUMBER(J46),J46,IF(J46=\"RATE ONLY\",LOWER(\"RATE ONLY\"),\" \")))","v":" "}]
[]
["IHDR2",null,"C3.2.3.1",null,null,"On Class A bedding (type and diameter indicated)","m",{"$nulls":5},{"$f":"IF(ISNUMBER(H48),L48*H48,IF(ISNUMBER(J48),J48,IF(J48=\"RATE ONLY\",LOWER(\"RATE ONLY\"),\" \")))","v":" "}]
[]
["IHDR2",null,"C3.2.3.2",null,null,"On Class B bedding:",{"$nulls":6},{"$f":"IF(ISNUMBER(H50),L50*H50,IF(ISNUMBER(J50),J50,IF(J50=\"RATE ONLY\",LOWER(\"RATE ONLY\"),\" \")))","v":" "}]
[]
["IHDR3",null,null,"(a)",null,"Type SC 50 D-load pipes with ogee joints:",{"$nulls":6},{"$f":"IF(ISNUMBER(H52),L52*H52,IF(ISNUMBER(J52),J52,IF(J52=\"RATE ONLY\",LOWER(\"RATE ONLY\"),\" \")))","v":" "}]
[]
["item1",{"$nulls":3},"(i)","600 mm dia","m",{"$nulls":4},{"v":1190,"d":"1,190.00"},{"$f":"IF(ISNUMBER(H54),L54*H54,IF(ISNUMBER(J54),J54,IF(J54=\"RATE ONLY\",LOWER(\"RATE ONLY\"),\" \")))","v":" "}]
[]
["item1",{"$nulls":3},"(ii)","750 mm dia","m",{"$nulls":4},{"v":1220,"d":"1,220.00"},{"$f":"IF(ISNUMBER(H56),L56*H56,IF(ISNUMBER(J56),J56,IF(J56=\"RATE ONLY\",LOWER(\"RATE ONLY\"),\" \")))","v":" "}]
["item1",{"$nulls":3},"(iii)","900 mm dia","m",{"$nulls":4},{"v":1250,"d":"1,250.00"},{"$f":"IF(ISNUMBER(H57),L57*H57,IF(ISNUMBER(J57),J57,IF(J57=\"RATE ONLY\",LOWER(\"RATE ONLY\"),\" \")))","v":" "}]
[]
["item1",{"$nulls":3},"(iv)","1050 mm dia","m",{"$nulls":4},{"v":1450,"d":"1,450.00"},{"$f":"IF(ISNUMBER(H59),L59*H59,IF(ISNUMBER(J59),J59,IF(J59=\"RATE ONLY\",LOWER(\"RATE ONLY\"),\" \")))","v":" "}]
[]
[{"$nulls":4},"(v)","1200 mm dia","m"]
["IHDR3",null,null,"(b)",null,"Type SC 75 D-load pipes with ogee joints:",{"$nulls":6},{"$f":"IF(ISNUMBER(H62),L62*H62,IF(ISNUMBER(J62),J62,IF(J62=\"RATE ONLY\",LOWER(\"RATE ONLY\"),\" \")))","v":" "}]
[]
["item1",{"$nulls":3},"(i)","600 mm dia","m",{"$nulls":4},{"v":1220,"d":"1,220.00"},{"$f":"IF(ISNUMBER(H64),L64*H64,IF(ISNUMBER(J64),J64,IF(J64=\"RATE ONLY\",LOWER(\"RATE ONLY\"),\" \")))","v":" "}]
[]
["item1",{"$nulls":3},"(ii)","750 mm dia","m",{"$nulls":5}," "]
["PB"]
["PB","CARRIED FORWARD",{"$nulls":10},{"$f":"SUBTOTAL(9,M$7:M66)","v":0}]
["PB"]
["PB"]
["PB","BROUGHT FORWARD",{"$nulls":10},{"$f":"SUBTOTAL(9,M$7:M69)","v":0}]
["PB"]
["item1",{"$nulls":3},"(ii)","900 mm dia","m",{"$nulls":4},{"v":1280,"d":"1,280.00"},{"$f":"IF(ISNUMBER(H73),L73*H73,IF(ISNUMBER(J73),J73,IF(J73=\"RATE ONLY\",LOWER(\"RATE ONLY\"),\" \")))","v":" "}]
[]
["item1",{"$nulls":3},"(iv)","1050 mm dia","m",{"$nulls":5}," "]
["IHDR3",null,null,"(c)",null,"Type SC 100 D-load pipes with ogee joints:",{"$nulls":6},{"$f":"IF(ISNUMBER(H76),L76*H76,IF(ISNUMBER(J76),J76,IF(J76=\"RATE ONLY\",LOWER(\"RATE ONLY\"),\" \")))","v":" "}]
[]
["item1",{"$nulls":3},"(i)","600 mm dia","m",{"$nulls":4},{"v":1150,"d":"1,150.00"}," "]
["item1",{"$nulls":3},"(i)","900 mm dia","m",{"$nulls":4},{"v":1300,"d":"1,300.00"},{"$f":"IF(ISNUMBER(H79),L79*H79,IF(ISNUMBER(J79),J79,IF(J79=\"RATE ONLY\",LOWER(\"RATE ONLY\"),\" \")))","v":" "}]
[]
["IHDR2",null,"C3.2.3.3",null,null,"On Class C bedding (type and diameter indicated)","m",{"$nulls":5},{"$f":"IF(ISNUMBER(H81),L81*H81,IF(ISNUMBER(J81),J81,IF(J81=\"RATE ONLY\",LOWER(\"RATE ONLY\"),\" \")))","v":" "}]
[]
["IHDR2",null,"C3.2.3.4",null,null,"On Class D bedding (type and diameter indicated)","m",{"$nulls":5},{"$f":"IF(ISNUMBER(H83),L83*H83,IF(ISNUMBER(J83),J83,IF(J83=\"RATE ONLY\",LOWER(\"RATE ONLY\"),\" \")))","v":" "}]
[]
["IHDR2",null,"C3.2.3.5",null,null,"Provision of skew ends of pipe culvert (type and diameter indicated)","No.",{"$nulls":5},{"$f":"IF(ISNUMBER(H85),L85*H85,IF(ISNUMBER(J85),J85,IF(J85=\"RATE ONLY\",LOWER(\"RATE ONLY\"),\" \")))","v":" "}]
[]
["IHDR1","C3.2.4",{"$nulls":3},"Metal and U-PVC culverts:",{"$nulls":6},{"$f":"IF(ISNUMBER(H87),L87*H87,IF(ISNUMBER(J87),J87,IF(J87=\"RATE ONLY\",LOWER(\"RATE ONLY\"),\" \")))","v":" "}]
[]
["item",null,"C3.2.4.1",null,null,"Size, wall thickness and type indicated","m",{"$nulls":5}," "]
["item",null,"C3.2.4.2",null,null,"Provision of skew or bevelled ends for metal culverts","No.",{"$nulls":5}," "]
["item",null,"C3.2.4.3",null,null,"Anchor bolts (size and type indicated)","No.",{"$nulls":5}," "]
["item",null,"C3.2.4.4",null,null,"Protective coating to metal culverts (culvert size; inside/outside/ both sides; coating type & thickness indicated)","m",{"$nulls":5}," "]
["IHDR1","C3.2.5",{"$nulls":3},"Rectangular culverts with prefabricated elements:",{"$nulls":6},{"$f":"IF(ISNUMBER(H93),L93*H93,IF(ISNUMBER(J93),J93,IF(J93=\"RATE ONLY\",LOWER(\"RATE ONLY\"),\" \")))","v":" "}]
[]
["IHDR2",null,"C3.2.5.1",null,null,"Prefabricated portal culverts; wall and roof combination:",{"$nulls":6},{"$f":"IF(ISNUMBER(H95),L95*H95,IF(ISNUMBER(J95),J95,IF(J95=\"RATE ONLY\",LOWER(\"RATE ONLY\"),\" \")))","v":" "}]
[]
["IHDR3",null,null,"(a)",null,"Class 175 S:",{"$nulls":6},{"$f":"IF(ISNUMBER(H97),L97*H97,IF(ISNUMBER(J97),J97,IF(J97=\"RATE ONLY\",LOWER(\"RATE ONLY\"),\" \")))","v":" "}]
[]
["item1",{"$nulls":3},"(i)","750 mm x 450 mm","m",{"$nulls":5}," "]
["item1",{"$nulls":3},"(i)","900 mm x 450 mm","m",{"$nulls":5}," "]
["item1",{"$nulls":3},"(ii)","900 mm x 600 mm","m",{"$nulls":4},{"v":1560,"d":"1,560.00"},{"$f":"IF(ISNUMBER(H101),L101*H101,IF(ISNUMBER(J101),J101,IF(J101=\"RATE ONLY\",LOWER(\"RATE ONLY\"),\" \")))","v":" "}]
[]
["item1",{"$nulls":3},"(iii)","900 mm x 750 mm","m",{"$nulls":5},{"$f":"IF(ISNUMBER(H103),L103*H103,IF(ISNUMBER(J103),J103,IF(J103=\"RATE ONLY\",LOWER(\"RATE ONLY\"),\" \")))","v":" "}]
["IHDR3",null,null,"(b)",null,"Class 150 S:",{"$nulls":6},{"$f":"IF(ISNUMBER(H104),L104*H104,IF(ISNUMBER(J104),J104,IF(J104=\"RATE ONLY\",LOWER(\"RATE ONLY\"),\" \")))","v":" "}]
[]
["item1",{"$nulls":3},"(i)","1200 mm x 600 mm","m",{"$nulls":5}," "]
["item1",{"$nulls":3},"(i)","1200 mm x 900 mm","m",{"$nulls":4},{"v":2550,"d":"2,550.00"},{"$f":"IF(ISNUMBER(H107),L107*H107,IF(ISNUMBER(J107),J107,IF(J107=\"RATE ONLY\",LOWER(\"RATE ONLY\"),\" \")))","v":" "}]
[]
["item1",{"$nulls":3},"(ii)","1200 mm x 1200 mm","m",{"$nulls":4},{"v":2650,"d":"2,650.00"},{"$f":"IF(ISNUMBER(H109),L109*H109,IF(ISNUMBER(J109),J109,IF(J109=\"RATE ONLY\",LOWER(\"RATE ONLY\"),\" \")))","v":" "}]
[]
["IHDR3",null,null,"(c)",null,"Class 100 S",{"$nulls":6},{"$f":"IF(ISNUMBER(H111),L111*H111,IF(ISNUMBER(J111),J111,IF(J111=\"RATE ONLY\",LOWER(\"RATE ONLY\"),\" \")))","v":" "}]
[]
["item1",{"$nulls":3},"(i)","1500 mm x 1200 mm","m",{"$nulls":4},{"v":3150,"d":"3,150.00"},{"$f":"IF(ISNUMBER(H113),L113*H113,IF(ISNUMBER(J113),J113,IF(J113=\"RATE ONLY\",LOWER(\"RATE ONLY\"),\" \")))","v":" "}]
[]
["item1",{"$nulls":3},"(ii)","1500 mm x 1500 mm","m",{"$nulls":4},{"v":3650,"d":"3,650.00"},{"$f":"IF(ISNUMBER(H115),L115*H115,IF(ISNUMBER(J115),J115,IF(J115=\"RATE ONLY\",LOWER(\"RATE ONLY\"),\" \")))","v":" "}]
[]
["IHDR3",null,null,"(d)",null,"Class 75 S",{"$nulls":6},{"$f":"IF(ISNUMBER(H117),L117*H117,IF(ISNUMBER(J117),J117,IF(J117=\"RATE ONLY\",LOWER(\"RATE ONLY\"),\" \")))","v":" "}]
[]
["item1",{"$nulls":3},"(i)","1800 mm x 1200 mm","m",{"$nulls":4},{"v":5450,"d":"5,450.00"},{"$f":"IF(ISNUMBER(H119),L119*H119,IF(ISNUMBER(J119),J119,IF(J119=\"RATE ONLY\",LOWER(\"RATE ONLY\"),\" \")))","v":" "}]
[]
["item1",{"$nulls":3},"(ii)","1800 mm x 1500 mm","m",{"$nulls":4},{"v":5950,"d":"5,950.00"},{"$f":"IF(ISNUMBER(H121),L121*H121,IF(ISNUMBER(J121),J121,IF(J121=\"RATE ONLY\",LOWER(\"RATE ONLY\"),\" \")))","v":" "}]
[]
["IHDR2",null,"C3.2.5.2",null,null,"Prefabricated floor slabs (size and type indicated)","m",{"$nulls":5},{"$f":"IF(ISNUMBER(H123),L123*H123,IF(ISNUMBER(J123),J123,IF(J123=\"RATE ONLY\",LOWER(\"RATE ONLY\"),\" \")))","v":" "}]
[]
["IHDR2",null,"C3.2.5.3",null,null,"Prefabricated roof slabs (size and type indicated)","m",{"$nulls":5},{"$f":"IF(ISNUMBER(H125),L125*H125,IF(ISNUMBER(J125),J125,IF(J125=\"RATE ONLY\",LOWER(\"RATE ONLY\"),\" \")))","v":" "}]
[]
["IHDR1","C3.2.6",{"$nulls":3},"Extra over items C3.2.3, C3.2.4 and C3.2.5 for constructing inclined culverts","m",{"$nulls":5},{"$f":"IF(ISNUMBER(H127),L127*H127,IF(ISNUMBER(J127),J127,IF(J127=\"RATE ONLY\",LOWER(\"RATE ONLY\"),\" \")))","v":" "}]
[]
["IHDR1","C3.2.7",{"$nulls":3},"Cast in situ concrete and formwork:",{"$nulls":6},{"$f":"IF(ISNUMBER(H129),L129*H129,IF(ISNUMBER(J129),J129,IF(J129=\"RATE ONLY\",LOWER(\"RATE ONLY\"),\" \")))","v":" "}]
[]
["IHDR2",null,"C3.2.7.1",null,null,"In Class A bedding, screeds, concrete backfill and the encasing for pipes, including formwork:",{"$nulls":6},{"$f":"IF(ISNUMBER(H131),L131*H131,IF(ISNUMBER(J131),J131,IF(J131=\"RATE ONLY\",LOWER(\"RATE ONLY\"),\" \")))","v":" "}]
[]
["item",null,null,"(a)",null,"Class C12/15-20 concrete (concrete working floor at in-situ floor slabs)","m³",{"$nulls":4},{"v":1800,"d":"1,800.00"},{"$f":"IF(ISNUMBER(H133),L133*H133,IF(ISNUMBER(J133),J133,IF(J133=\"RATE ONLY\",LOWER(\"RATE ONLY\"),\" \")))","v":" "}]
[]
["item",null,null,"(b)",null,"Class C16/20-20 concrete (concrete collars at joints between new and existing culverts)","m³",{"$nulls":4},{"v":1950,"d":"1,950.00"},{"$f":"IF(ISNUMBER(H135),L135*H135,IF(ISNUMBER(J135),J135,IF(J135=\"RATE ONLY\",LOWER(\"RATE ONLY\"),\" \")))","v":" "}]
[]
["PB"]
["PB","CARRIED FORWARD",{"$nulls":10},{"$f":"SUBTOTAL(9,M$7:M136)","v":0}]
["PB"]
["PB"]
["PB","BROUGHT FORWARD",{"$nulls":10},{"$f":"SUBTOTAL(9,M$7:M139)","v":0}]
["PB"]
["item",null,null,"(c)",null,"Class C20/25-20 concrete (Class A bedding)","m³",{"$nulls":5}," "]
["IHDR2",null,"C3.2.7.2",null,null,"In complete in situ floor slabs for rectangular culverts, manholes and catchpits including formwork, joints and Class U2 surface finish (class of concrete indicated) (installed at a standard depth of 1,0 m):",{"$nulls":6},{"$f":"IF(ISNUMBER(H144),L144*H144,IF(ISNUMBER(J144),J144,IF(J144=\"RATE ONLY\",LOWER(\"RATE ONLY\"),\" \")))","v":" "}]
[]
["item",null,null,"(a)",null,"Class C25/30-20 concrete (in situ floor slab)","m³",{"$nulls":4},{"v":1900,"d":"1,900.00"},{"$f":"IF(ISNUMBER(H146),L146*H146,IF(ISNUMBER(J146),J146,IF(J146=\"RATE ONLY\",LOWER(\"RATE ONLY\"),\" \")))","v":" "}]
[]
["IHDR2",null,"C3.2.7.3",null,null,"In walls, excluding formwork but including Class U2 surface finish (class of concrete indicated)","m³",{"$nulls":5},{"$f":"IF(ISNUMBER(H148),L148*H148,IF(ISNUMBER(J148),J148,IF(J148=\"RATE ONLY\",LOWER(\"RATE ONLY\"),\" \")))","v":" "}]
[]
["IHDR2",null,"C3.2.7.4",null,null,"In roof slabs for rectangular culverts, excluding formwork but including Class U2 surfacing finish and joints (class of concrete indicated)","m³",{"$nulls":5},{"$f":"IF(ISNUMBER(H150),L150*H150,IF(ISNUMBER(J150),J150,IF(J150=\"RATE ONLY\",LOWER(\"RATE ONLY\"),\" \")))","v":" "}]
[]
["IHDR2",null,"C3.2.7.5",null,null,"In inlet and outlet structures including kerbs, chutes and downpipes, skewed ends, catchpits, manholes, thrust and anchor blocks, excluding formwork but including Class U2 surfacing finish:",{"$nulls":6},{"$f":"IF(ISNUMBER(H152),L152*H152,IF(ISNUMBER(J152),J152,IF(J152=\"RATE ONLY\",LOWER(\"RATE ONLY\"),\" \")))","v":" "}]
[]
["item",null,null,"(a)",null,"Class C16/20-20 concrete (Type 4 and 5 inlets)","m³",{"$nulls":4},{"v":1950,"d":"1,950.00"},{"$f":"IF(ISNUMBER(H154),L154*H154,IF(ISNUMBER(J154),J154,IF(J154=\"RATE ONLY\",LOWER(\"RATE ONLY\"),\" \")))","v":" "}]
[]
["item",null,null,"(b)",null,"Class C25/30-20 concrete (Type 1 inlet and outlet, Type 2 and 3 inlets)","m³",{"$nulls":4},{"v":2095,"d":"2,095.00"},{"$f":"IF(ISNUMBER(H156),L156*H156,IF(ISNUMBER(J156),J156,IF(J156=\"RATE ONLY\",LOWER(\"RATE ONLY\"),\" \")))","v":" "}]
[]
["IHDR2",null,"C3.2.7.6",null,null,"Formwork of concrete under items C3.2.7.3 to 5 above:",{"$nulls":6},{"$f":"IF(ISNUMBER(H158),L158*H158,IF(ISNUMBER(J158),J158,IF(J158=\"RATE ONLY\",LOWER(\"RATE ONLY\"),\" \")))","v":" "}]
[]
["item",null,null,"(a)",null,"Class F1 surface finish","m²",{"$nulls":4},{"v":420,"d":"420.00"},{"$f":"IF(ISNUMBER(H160),L160*H160,IF(ISNUMBER(J160),J160,IF(J160=\"RATE ONLY\",LOWER(\"RATE ONLY\"),\" \")))","v":" "}]
[]
["item",null,null,"(b)",null,"Class F2 surface finish","m²",{"$nulls":4},{"v":490,"d":"490.00"},{"$f":"IF(ISNUMBER(H162),L162*H162,IF(ISNUMBER(J162),J162,IF(J162=\"RATE ONLY\",LOWER(\"RATE ONLY\"),\" \")))","v":" "}]
[]
["IHDR2",null,"C3.2.7.7",null,null,"Concrete linings for the inverts of metal culverts, including formwork and Class U2 surface finish (class of concrete indicated)","m³",{"$nulls":5},{"$f":"IF(ISNUMBER(H164),L164*H164,IF(ISNUMBER(J164),J164,IF(J164=\"RATE ONLY\",LOWER(\"RATE ONLY\"),\" \")))","v":" "}]
[]
["IHDR1","C3.2.8",{"$nulls":3},"Concrete backfill or encasement for culverts:",{"$nulls":6},{"$f":"IF(ISNUMBER(H166),L166*H166,IF(ISNUMBER(J166),J166,IF(J166=\"RATE ONLY\",LOWER(\"RATE ONLY\"),\" \")))","v":" "}]
[]
["item",null,null,"(a)",null,"Class 1:4:8/37,5 concrete (between prefabricated portal culverts)","m³",{"$nulls":4},{"v":1775,"d":"1,775.00"},{"$f":"IF(ISNUMBER(H168),L168*H168,IF(ISNUMBER(J168),J168,IF(J168=\"RATE ONLY\",LOWER(\"RATE ONLY\"),\" \")))","v":" "}]
[]
["IHDR1","C3.2.9",{"$nulls":3},"Prefabricated concrete inlets and outlets to culverts (size and type indicated)","No.",{"$nulls":5},{"$f":"IF(ISNUMBER(H170),L170*H170,IF(ISNUMBER(J170),J170,IF(J170=\"RATE ONLY\",LOWER(\"RATE ONLY\"),\" \")))","v":" "}]
[]
["IHDR1","C3.2.10",{"$nulls":3},"Reinforcement:",{"$nulls":6},{"$f":"IF(ISNUMBER(H172),L172*H172,IF(ISNUMBER(J172),J172,IF(J172=\"RATE ONLY\",LOWER(\"RATE ONLY\"),\" \")))","v":" "}]
[]
["IHDR2",null,"C3.2.10.1",null,null,"Mild steel bars","t",{"$nulls":4},{"v":20000,"d":"20,000.00"},{"$f":"IF(ISNUMBER(H174),L174*H174,IF(ISNUMBER(J174),J174,IF(J174=\"RATE ONLY\",LOWER(\"RATE ONLY\"),\" \")))","v":" "}]
[]
["IHDR2",null,"C3.2.10.2",null,null,"High-tensile steel bars","t",{"$nulls":4},{"v":20000,"d":"20,000.00"},{"$f":"IF(ISNUMBER(H176),L176*H176,IF(ISNUMBER(J176),J176,IF(J176=\"RATE ONLY\",LOWER(\"RATE ONLY\"),\" \")))","v":" "}]
[]
["IHDR2",null,"C3.2.10.3",null,null,"Welded steel fabric","kg",{"$nulls":4},{"v":20,"d":"20.00"},{"$f":"IF(ISNUMBER(H178),L178*H178,IF(ISNUMBER(J178),J178,IF(J178=\"RATE ONLY\",LOWER(\"RATE ONLY\"),\" \")))","v":" "}]
[]
["IHDR2",null,"C3.2.10.4",null,null,"Other material:",{"$nulls":6},{"$f":"IF(ISNUMBER(H180),L180*H180,IF(ISNUMBER(J180),J180,IF(J180=\"RATE ONLY\",LOWER(\"RATE ONLY\"),\" \")))","v":" "}]
[]
["item",null,null,"(a)",null,"Dowels for joining old and new concrete","kg",{"$nulls":4},{"v":170,"d":"170.00"},{"$f":"IF(ISNUMBER(H182),L182*H182,IF(ISNUMBER(J182),J182,IF(J182=\"RATE ONLY\",LOWER(\"RATE ONLY\"),\" \")))","v":" "}]
[]
["IHDR1","C3.2.11",{"$nulls":3},"Anchoring of reinforcing steel: Reinforcing (type, bar diameter) into formed holes (hole diameter and depth stated) in (description of member)","No.",{"$nulls":5},{"$f":"IF(ISNUMBER(H184),L184*H184,IF(ISNUMBER(J184),J184,IF(J184=\"RATE ONLY\",LOWER(\"RATE ONLY\"),\" \")))","v":" "}]
[]
["IHDR1","C3.2.12",{"$nulls":3},"Demolition of concrete members or elements:",{"$nulls":6},{"$f":"IF(ISNUMBER(H186),L186*H186,IF(ISNUMBER(J186),J186,IF(J186=\"RATE ONLY\",LOWER(\"RATE ONLY\"),\" \")))","v":" "}]
[]
["IHDR2",null,"C3.2.12.1",null,null,"Full member or element (location and description)","m³",{"$nulls":5},{"$f":"IF(ISNUMBER(H188),L188*H188,IF(ISNUMBER(J188),J188,IF(J188=\"RATE ONLY\",LOWER(\"RATE ONLY\"),\" \")))","v":" "}]
[]
["PB"]
["PB","CARRIED FORWARD",{"$nulls":10},{"$f":"SUBTOTAL(9,M$7:M189)","v":0}]
["PB"]
["PB"]
["PB","BROUGHT FORWARD",{"$nulls":10},{"$f":"SUBTOTAL(9,M$7:M192)","v":0}]
["PB"]
["IHDR2",null,"C3.2.12.2",null,null,"Partial member or element (inlets- or outlets at existing culverts):",{"$nulls":6},{"$f":"IF(ISNUMBER(H196),L196*H196,IF(ISNUMBER(J196),J196,IF(J196=\"RATE ONLY\",LOWER(\"RATE ONLY\"),\" \")))","v":" "}]
[]
["item",null,null,"(a)",null,"Plain concrete","m³",{"$nulls":4},{"v":330,"d":"330.00"},{"$f":"IF(ISNUMBER(H198),L198*H198,IF(ISNUMBER(J198),J198,IF(J198=\"RATE ONLY\",LOWER(\"RATE ONLY\"),\" \")))","v":" "}]
[]
["item",null,null,"(b)",null,"Reinforced concrete","m³",{"$nulls":4},{"v":550,"d":"550.00"},{"$f":"IF(ISNUMBER(H200),L200*H200,IF(ISNUMBER(J200),J200,IF(J200=\"RATE ONLY\",LOWER(\"RATE ONLY\"),\" \")))","v":" "}]
[]
["IHDR1","C3.2.13",{"$nulls":3},"Removing and re-laying existing culverts:",{"$nulls":6},{"$f":"IF(ISNUMBER(H202),L202*H202,IF(ISNUMBER(J202),J202,IF(J202=\"RATE ONLY\",LOWER(\"RATE ONLY\"),\" \")))","v":" "}]
[]
["IHDR2",null,"C3.2.13.1",null,null,"Removing and stacking existing culverts for re-use:",{"$nulls":6},{"$f":"IF(ISNUMBER(H204),L204*H204,IF(ISNUMBER(J204),J204,IF(J204=\"RATE ONLY\",LOWER(\"RATE ONLY\"),\" \")))","v":" "}]
[]
["IHDR3",null,null,"(b)",null,"Type SC 75 D-load pipes with ogee joints",{"$nulls":6},{"$f":"IF(ISNUMBER(H206),L206*H206,IF(ISNUMBER(J206),J206,IF(J206=\"RATE ONLY\",LOWER(\"RATE ONLY\"),\" \")))","v":" "}]
[]
["item1",{"$nulls":3},"(i)","600 mm dia","m",{"$nulls":5},{"$f":"IF(ISNUMBER(H208),L208*H208,IF(ISNUMBER(J208),J208,IF(J208=\"RATE ONLY\",LOWER(\"RATE ONLY\"),\" \")))","v":" "}]
["item1",{"$nulls":3},"(ii)","750 mm dia","m",{"$nulls":5}," "]
["IHDR2",null,"C3.2.13.2",null,null,"Removing and re-laying existing culverts without stacking:",{"$nulls":6},{"$f":"IF(ISNUMBER(H210),L210*H210,IF(ISNUMBER(J210),J210,IF(J210=\"RATE ONLY\",LOWER(\"RATE ONLY\"),\" \")))","v":" "}]
[]
["IHDR3",null,null,"(b)",null,"Type SC 75 D-load pipes with ogee joints on Class B bedding:",{"$nulls":6},{"$f":"IF(ISNUMBER(H212),L212*H212,IF(ISNUMBER(J212),J212,IF(J212=\"RATE ONLY\",LOWER(\"RATE ONLY\"),\" \")))","v":" "}]
[]
["item1",{"$nulls":3},"(i)","600 mm dia","m",{"$nulls":5}," "]
["item1",{"$nulls":3},"(ii)","750 mm dia","m",{"$nulls":5}," "]
["IHDR2",null,"C3.2.13.3",null,null,"Re-laying existing culverts from stacking:",{"$nulls":6},{"$f":"IF(ISNUMBER(H216),L216*H216,IF(ISNUMBER(J216),J216,IF(J216=\"RATE ONLY\",LOWER(\"RATE ONLY\"),\" \")))","v":" "}]
[]
["IHDR3",null,null,"(b)",null,"Type SC 75 D-load pipes with ogee joints on Class B bedding:",{"$nulls":6},{"$f":"IF(ISNUMBER(H218),L218*H218,IF(ISNUMBER(J218),J218,IF(J218=\"RATE ONLY\",LOWER(\"RATE ONLY\"),\" \")))","v":" "}]
[]
["item1",{"$nulls":3},"(i)","600 mm dia","m",{"$nulls":5}," "]
["item1",{"$nulls":3},"(ii)","750 mm dia","m",{"$nulls":5}," "]
["IHDR1","C3.2.14",{"$nulls":3},"Protective mastic asphalt coating for corrugated metal culvert units (state whether to be applied by brush or by spray gun)","m²",{"$nulls":5},{"$f":"IF(ISNUMBER(H222),L222*H222,IF(ISNUMBER(J222),J222,IF(J222=\"RATE ONLY\",LOWER(\"RATE ONLY\"),\" \")))","v":" "}]
[]
["IHDR1","C3.2.15",{"$nulls":3},"Manholes and catch pits, with prefabricated elements:",{"$nulls":6},{"$f":"IF(ISNUMBER(H224),L224*H224,IF(ISNUMBER(J224),J224,IF(J224=\"RATE ONLY\",LOWER(\"RATE ONLY\"),\" \")))","v":" "}]
[]
["IHDR2",null,"C3.2.15.1",null,null,"Prefabricated floors (installed at a standard depth of 1,0 m):",{"$nulls":6},{"$f":"IF(ISNUMBER(H226),L226*H226,IF(ISNUMBER(J226),J226,IF(J226=\"RATE ONLY\",LOWER(\"RATE ONLY\"),\" \")))","v":" "}]
[]
["Item",null,null,"(a)",null,"Size and type indicated","No.",{"$nulls":5},{"$f":"IF(ISNUMBER(H228),L228*H228,IF(ISNUMBER(J228),J228,IF(J228=\"RATE ONLY\",LOWER(\"RATE ONLY\"),\" \")))","v":" "}]
["Item",null,null,"(b)",null,"Size and type indicated(etc)","No.",{"$nulls":5}," "]
["IHDR2",null,"C3.2.15.2",null,null,"Prefabricated roofs:",{"$nulls":6},{"$f":"IF(ISNUMBER(H230),L230*H230,IF(ISNUMBER(J230),J230,IF(J230=\"RATE ONLY\",LOWER(\"RATE ONLY\"),\" \")))","v":" "}]
[]
["Item",null,null,"(a)",null,"Size and type indicated","No.",{"$nulls":5}," "]
["Item",null,null,"(b)",null,"Size and type indicated(etc)","No.",{"$nulls":5}," "]
["IHDR2",null,"C3.2.15.3",null,null,"Prefabricated walls:",{"$nulls":6},{"$f":"IF(ISNUMBER(H234),L234*H234,IF(ISNUMBER(J234),J234,IF(J234=\"RATE ONLY\",LOWER(\"RATE ONLY\"),\" \")))","v":" "}]
[]
["Item",null,null,"(a)",null,"Size and type indicated","m",{"$nulls":5}," "]
["Item",null,null,"(b)",null,"Size and type indicated(etc)","m",{"$nulls":5}," "]
["IHDR2",null,"C3.2.15.4",null,null,"Extra over item C3.2.15.1 and C3.2.7.2 for variations in the depths of all types of concrete manholes with prefabricated, or in situ concrete or brickwork wall combinations deeper than 1,0 m designated for tendering purposes","m",{"$nulls":5},{"$f":"IF(ISNUMBER(H238),L238*H238,IF(ISNUMBER(J238),J238,IF(J238=\"RATE ONLY\",LOWER(\"RATE ONLY\"),\" \")))","v":" "}]
[]
["IHDR1","C3.2.16",{"$nulls":3},"Brickwork (Engineering bricks):",{"$nulls":6},{"$f":"IF(ISNUMBER(H240),L240*H240,IF(ISNUMBER(J240),J240,IF(J240=\"RATE ONLY\",LOWER(\"RATE ONLY\"),\" \")))","v":" "}]
[]
["IHDR2",null,"C3.2.16.1",null,null,"115 mm thick","m²",{"$nulls":5},{"$f":"IF(ISNUMBER(H242),L242*H242,IF(ISNUMBER(J242),J242,IF(J242=\"RATE ONLY\",LOWER(\"RATE ONLY\"),\" \")))","v":" "}]
[]
["IHDR2",null,"C3.2.16.2",null,null,"230 mm thick","m²",{"$nulls":5},{"$f":"IF(ISNUMBER(H244),L244*H244,IF(ISNUMBER(J244),J244,IF(J244=\"RATE ONLY\",LOWER(\"RATE ONLY\"),\" \")))","v":" "}]
[]
["IHDR2",null,"C3.2.16.3",null,null,"345 mm thick","m²",{"$nulls":5},{"$f":"IF(ISNUMBER(H246),L246*H246,IF(ISNUMBER(J246),J246,IF(J246=\"RATE ONLY\",LOWER(\"RATE ONLY\"),\" \")))","v":" "}]
[]
["IHDR2",null,"C3.2.16.4",null,null,"Specify thickness","m²",{"$nulls":5},{"$f":"IF(ISNUMBER(H248),L248*H248,IF(ISNUMBER(J248),J248,IF(J248=\"RATE ONLY\",LOWER(\"RATE ONLY\"),\" \")))","v":" "}]
[]
["IHDR1","C3.2.17",{"$nulls":3},"Plaster","m²",{"$nulls":5},{"$f":"IF(ISNUMBER(H250),L250*H250,IF(ISNUMBER(J250),J250,IF(J250=\"RATE ONLY\",LOWER(\"RATE ONLY\"),\" \")))","v":" "}]
[]
["IHDR1","C3.2.18",{"$nulls":3},"Benching","m³",{"$nulls":4},{"v":1800,"d":"1,800.00"},{"$f":"IF(ISNUMBER(H252),L252*H252,IF(ISNUMBER(J252),J252,IF(J252=\"RATE ONLY\",LOWER(\"RATE ONLY\"),\" \")))","v":" "}]
[]
["IHDR1","C3.2.19",{"$nulls":3},"Accessories:",{"$nulls":6},{"$f":"IF(ISNUMBER(H254),L254*H254,IF(ISNUMBER(J254),J254,IF(J254=\"RATE ONLY\",LOWER(\"RATE ONLY\"),\" \")))","v":" "}]
[]
["IHDR2",null,"C3.2.19.1",null,null,"Manhole frames:",{"$nulls":6},{"$f":"IF(ISNUMBER(H256),L256*H256,IF(ISNUMBER(J256),J256,IF(J256=\"RATE ONLY\",LOWER(\"RATE ONLY\"),\" \")))","v":" "}]
[]
["Item",null,null,"(a)",null,"1045 mm x 1045 mm at Type 5 inlets (median inlet) - see DWG No 113142-0-DRG-RR-04-0032","No.",{"$nulls":4},{"v":2900,"d":"2,900.00"},{"$f":"IF(ISNUMBER(H258),L258*H258,IF(ISNUMBER(J258),J258,IF(J258=\"RATE ONLY\",LOWER(\"RATE ONLY\"),\" \")))","v":" "}]
[]
["Item",null,null,"(b)",null,"1060 mm x 1045 mm at Type 4 inlets (concrete drain - Type 1) - see DWG No 113142-0-DRG-RR-04-0031","No.",{"$nulls":4},{"v":2850,"d":"2,850.00"},{"$f":"IF(ISNUMBER(H260),L260*H260,IF(ISNUMBER(J260),J260,IF(J260=\"RATE ONLY\",LOWER(\"RATE ONLY\"),\" \")))","v":" "}]
[]
["IHDR2",null,"C3.2.19.2",null,null,"Inlet grids or covers:",{"$nulls":6},{"$f":"IF(ISNUMBER(H262),L262*H262,IF(ISNUMBER(J262),J262,IF(J262=\"RATE ONLY\",LOWER(\"RATE ONLY\"),\" \")))","v":" "}]
[]
["Item",null,null,"(a)",null,"1015 mm x 1015 mm at Type 5 inlets (median inlet) - see DWG No 113142-0-DRG-RR-04-0032","No.",{"$nulls":4},{"v":6600,"d":"6,600.00"},{"$f":"IF(ISNUMBER(H264),L264*H264,IF(ISNUMBER(J264),J264,IF(J264=\"RATE ONLY\",LOWER(\"RATE ONLY\"),\" \")))","v":" "}]
[]
["Item",null,null,"(b)",null,"1015 mm x 1015 mm at Type 4 inlets (concrete drain - Type 1) - see DWG No 113142-0-DRG-RR-04-0031","No.",{"$nulls":4},{"v":6800,"d":"6,800.00"},{"$f":"IF(ISNUMBER(H266),L266*H266,IF(ISNUMBER(J266),J266,IF(J266=\"RATE ONLY\",LOWER(\"RATE ONLY\"),\" \")))","v":" "}]
[]
["IHDR2",null,"C3.2.19.3",null,null,"Manhole frames (type, load bearing and SANS specification indicated)","No.",{"$nulls":5},{"$f":"IF(ISNUMBER(H268),L268*H268,IF(ISNUMBER(J268),J268,IF(J268=\"RATE ONLY\",LOWER(\"RATE ONLY\"),\" \")))","v":" "}]
[]
["IHDR2",null,"C3.2.19.4",null,null,"Manhole covers or gratings (type, load bearing and SANS specification indicated)","No.",{"$nulls":5},{"$f":"IF(ISNUMBER(H270),L270*H270,IF(ISNUMBER(J270),J270,IF(J270=\"RATE ONLY\",LOWER(\"RATE ONLY\"),\" \")))","v":" "}]
[]
["IHDR2",null,"C3.2.19.5",null,null,"Inlet channel frames (type, load bearing and SANS specification indicated)","No.",{"$nulls":5},{"$f":"IF(ISNUMBER(H272),L272*H272,IF(ISNUMBER(J272),J272,IF(J272=\"RATE ONLY\",LOWER(\"RATE ONLY\"),\" \")))","v":" "}]
[]
["IHDR2",null,"C3.2.19.6",null,null,"Inlet channel gratings (type, load bearing and SANS specification indicated)","No.",{"$nulls":5},{"$f":"IF(ISNUMBER(H274),L274*H274,IF(ISNUMBER(J274),J274,IF(J274=\"RATE ONLY\",LOWER(\"RATE ONLY\"),\" \")))","v":" "}]
[]
["IHDR2",null,"C3.2.19.7",null,null,"Step irons (BS 1247 Fig. 1)","No.",{"$nulls":4},{"v":1350,"d":"1,350.00"},{"$f":"IF(ISNUMBER(H276),L276*H276,IF(ISNUMBER(J276),J276,IF(J276=\"RATE ONLY\",LOWER(\"RATE ONLY\"),\" \")))","v":" "}]
[]
["IHDR2",null,"C3.2.19.8",null,null,"(Etc for other accessories)","No.",{"$nulls":5},{"$f":"IF(ISNUMBER(H278),L278*H278,IF(ISNUMBER(J278),J278,IF(J278=\"RATE ONLY\",LOWER(\"RATE ONLY\"),\" \")))","v":" "}]
[]
["IHDR1","C3.2.20",{"$nulls":3},"Anchors for pipes (description)","No.",{"$nulls":5},{"$f":"IF(ISNUMBER(H280),L280*H280,IF(ISNUMBER(J280),J280,IF(J280=\"RATE ONLY\",LOWER(\"RATE ONLY\"),\" \")))","v":" "}]
[]
["IHDR1","C3.2.21",{"$nulls":3},"Prefabricated reinforced-concrete skew end units for concrete culverts constructed at a skew angle:",{"$nulls":6},{"$f":"IF(ISNUMBER(H282),L282*H282,IF(ISNUMBER(J282),J282,IF(J282=\"RATE ONLY\",LOWER(\"RATE ONLY\"),\" \")))","v":" "}]
[]
["IHDR2",null,"C3.2.21.1",null,null,"Type SC 50 D-load pipes on Class B bedding:",{"$nulls":6},{"$f":"IF(ISNUMBER(H284),L284*H284,IF(ISNUMBER(J284),J284,IF(J284=\"RATE ONLY\",LOWER(\"RATE ONLY\"),\" \")))","v":" "}]
[]
["item",null,null,"(a)",null,"600 mm dia","No.",{"$nulls":4},{"v":1190,"d":"1,190.00"},{"$f":"IF(ISNUMBER(H286),L286*H286,IF(ISNUMBER(J286),J286,IF(J286=\"RATE ONLY\",LOWER(\"RATE ONLY\"),\" \")))","v":" "}]
[]
["item",null,null,"(b)",null,"900 mm dia","No.",{"$nulls":4},{"v":1250,"d":"1,250.00"},{"$f":"IF(ISNUMBER(H288),L288*H288,IF(ISNUMBER(J288),J288,IF(J288=\"RATE ONLY\",LOWER(\"RATE ONLY\"),\" \")))","v":" "}]
[]
["IHDR2",null,"C3.2.21.2",null,null,"Type SC 75 D-load pipes on Class B bedding:",{"$nulls":6},{"$f":"IF(ISNUMBER(H290),L290*H290,IF(ISNUMBER(J290),J290,IF(J290=\"RATE ONLY\",LOWER(\"RATE ONLY\"),\" \")))","v":" "}]
[]
["item",null,null,"(a)",null,"600 mm dia","No.",{"$nulls":5},{"$f":"IF(ISNUMBER(H292),L292*H292,IF(ISNUMBER(J292),J292,IF(J292=\"RATE ONLY\",LOWER(\"RATE ONLY\"),\" \")))","v":" "}]
["item",null,null,"(a)",null,"900 mm dia","No.",{"$nulls":4},{"v":1280,"d":"1,280.00"},{"$f":"IF(ISNUMBER(H293),L293*H293,IF(ISNUMBER(J293),J293,IF(J293=\"RATE ONLY\",LOWER(\"RATE ONLY\"),\" \")))","v":" "}]
[]
["IHDR1","PC3.2.22",{"$nulls":3},"Cutting of concrete pipes and rectangular culverts:",{"$nulls":6},{"$f":"IF(ISNUMBER(H295),L295*H295,IF(ISNUMBER(J295),J295,IF(J295=\"RATE ONLY\",LOWER(\"RATE ONLY\"),\" \")))","v":" "}]
["PB"]
["PB","CARRIED FORWARD",{"$nulls":10},{"$f":"SUBTOTAL(9,M$7:M295)","v":0}]
["PB"]
["PB"]
["PB","BROUGHT FORWARD",{"$nulls":10},{"$f":"SUBTOTAL(9,M$7:M298)","v":0}]
["PB"]
[]
["IHDR2",null,"PC3.2.22.1",null,null,"Pipe culverts:",{"$nulls":6},{"$f":"IF(ISNUMBER(H303),L303*H303,IF(ISNUMBER(J303),J303,IF(J303=\"RATE ONLY\",LOWER(\"RATE ONLY\"),\" \")))","v":" "}]
[]
["item",null,null,"(a)",null,"600 mm dia","No.",{"$nulls":4},{"v":850,"d":"850.00"},{"$f":"IF(ISNUMBER(H305),L305*H305,IF(ISNUMBER(J305),J305,IF(J305=\"RATE ONLY\",LOWER(\"RATE ONLY\"),\" \")))","v":" "}]
[]
["item",null,null,"(b)",null,"750 mm dia","No.",{"$nulls":4},{"v":1300,"d":"1,300.00"},{"$f":"IF(ISNUMBER(H307),L307*H307,IF(ISNUMBER(J307),J307,IF(J307=\"RATE ONLY\",LOWER(\"RATE ONLY\"),\" \")))","v":" "}]
[]
["item",null,null,"(c)",null,"900 mm dia","No.",{"$nulls":4},{"v":1900,"d":"1,900.00"},{"$f":"IF(ISNUMBER(H309),L309*H309,IF(ISNUMBER(J309),J309,IF(J309=\"RATE ONLY\",LOWER(\"RATE ONLY\"),\" \")))","v":" "}]
[]
["item",null,null,"(d)",null,"1200 mm dia","No.",{"$nulls":5},{"$f":"IF(ISNUMBER(H311),L311*H311,IF(ISNUMBER(J311),J311,IF(J311=\"RATE ONLY\",LOWER(\"RATE ONLY\"),\" \")))","v":" "}]
["IHDR2",null,"PC3.2.22.2",null,null,"Rectangular culverts:",{"$nulls":6},{"$f":"IF(ISNUMBER(H312),L312*H312,IF(ISNUMBER(J312),J312,IF(J312=\"RATE ONLY\",LOWER(\"RATE ONLY\"),\" \")))","v":" "}]
[]
["item",null,null,"(a)",null,"600 mm x 450 mm","No.",{"$nulls":4},{"v":850,"d":"850.00"},{"$f":"IF(ISNUMBER(H314),L314*H314,IF(ISNUMBER(J314),J314,IF(J314=\"RATE ONLY\",LOWER(\"RATE ONLY\"),\" \")))","v":" "}]
[]
["item",null,null,"(b)",null,"750 mm x 450 mm","No.",{"$nulls":4},{"v":1050,"d":"1,050.00"},{"$f":"IF(ISNUMBER(H316),L316*H316,IF(ISNUMBER(J316),J316,IF(J316=\"RATE ONLY\",LOWER(\"RATE ONLY\"),\" \")))","v":" "}]
[]
["item",null,null,"(c)",null,"900 mm x 450 mm","No.",{"$nulls":4},{"v":1250,"d":"1,250.00"},{"$f":"IF(ISNUMBER(H318),L318*H318,IF(ISNUMBER(J318),J318,IF(J318=\"RATE ONLY\",LOWER(\"RATE ONLY\"),\" \")))","v":" "}]
[]
["item",null,null,"(d)",null,"1200 mm x 1200 mm","No.",{"$nulls":4},{"v":4300,"d":"4,300.00"},{"$f":"IF(ISNUMBER(H320),L320*H320,IF(ISNUMBER(J320),J320,IF(J320=\"RATE ONLY\",LOWER(\"RATE ONLY\"),\" \")))","v":" "}]
[]
["item",null,null,"(e)",null,"1500 mm x 1200 mm","No.",{"$nulls":4},{"v":5400,"d":"5,400.00"},{"$f":"IF(ISNUMBER(H322),L322*H322,IF(ISNUMBER(J322),J322,IF(J322=\"RATE ONLY\",LOWER(\"RATE ONLY\"),\" \")))","v":" "}]
[]
["item",null,null,"(f)",null,"1500 mm x 1500 mm","No.",{"$nulls":4},{"v":6750,"d":"6,750.00"},{"$f":"IF(ISNUMBER(H324),L324*H324,IF(ISNUMBER(J324),J324,IF(J324=\"RATE ONLY\",LOWER(\"RATE ONLY\"),\" \")))","v":" "}]
[]
["item",null,null,"(g)",null,"1800 mm x 1200 mm","No.",{"$nulls":4},{"v":6500,"d":"6,500.00"},{"$f":"IF(ISNUMBER(H326),L326*H326,IF(ISNUMBER(J326),J326,IF(J326=\"RATE ONLY\",LOWER(\"RATE ONLY\"),\" \")))","v":" "}]
[]
["item",null,null,"(h)",null,"1800 mm x 1500 mm","No.",{"$nulls":4},{"v":8100,"d":"8,100.00"},{"$f":"IF(ISNUMBER(H328),L328*H328,IF(ISNUMBER(J328),J328,IF(J328=\"RATE ONLY\",LOWER(\"RATE ONLY\"),\" \")))","v":" "}]
[]
["IHDR1","C3.2.23",{"$nulls":3},"Breaking into existing drainage structures and building in pipes or culverts of the following size (pipe diameter and/or culvert size to be stated)","No.",{"$nulls":5},{"$f":"IF(ISNUMBER(H330),L330*H330,IF(ISNUMBER(J330),J330,IF(J330=\"RATE ONLY\",LOWER(\"RATE ONLY\"),\" \")))","v":" "}]
[]
["IHDR1","C3.2.24",{"$nulls":3},"Compaction of bedding for inlets, outlets, manholes and catchpits:",{"$nulls":6},{"$f":"IF(ISNUMBER(H332),L332*H332,IF(ISNUMBER(J332),J332,IF(J332=\"RATE ONLY\",LOWER(\"RATE ONLY\"),\" \")))","v":" "}]
[]
["IHDR2",null,"C3.2.24.1",null,null,"Preparation and compaction of in situ bedding material to 90 % of MDD (150 mm)","m³",{"$nulls":4},{"v":45,"d":"45.00"},{"$f":"IF(ISNUMBER(H334),L334*H334,IF(ISNUMBER(J334),J334,IF(J334=\"RATE ONLY\",LOWER(\"RATE ONLY\"),\" \")))","v":" "}]
[]
["IHDR2",null,"C3.2.24.2",null,null,"Extra-over sub-item C3.2.24.1 for compaction to 93 % of MDD (150 mm)","m³",{"$nulls":4},{"v":60,"d":"60.00"},{"$f":"IF(ISNUMBER(H336),L336*H336,IF(ISNUMBER(J336),J336,IF(J336=\"RATE ONLY\",LOWER(\"RATE ONLY\"),\" \")))","v":" "}]
[]
["IHDR1","C3.2.25",{"$nulls":3},"Painting of exposed steel bars with two coats of zinc rich primer (Type specified)","litre",{"$nulls":5},{"$f":"IF(ISNUMBER(H338),L338*H338,IF(ISNUMBER(J338),J338,IF(J338=\"RATE ONLY\",LOWER(\"RATE ONLY\"),\" \")))","v":" "}]
[]
["IHDR1","C3.2.26",{"$nulls":3},"Repair with cementitious mortar or concrete (Class) to (description)","litre",{"$nulls":5},{"$f":"IF(ISNUMBER(H340),L340*H340,IF(ISNUMBER(J340),J340,IF(J340=\"RATE ONLY\",LOWER(\"RATE ONLY\"),\" \")))","v":" "}]
[]
["IHDR1","C3.2.27",{"$nulls":3},"Repair with epoxy mortar","litre",{"$nulls":5},{"$f":"IF(ISNUMBER(H342),L342*H342,IF(ISNUMBER(J342),J342,IF(J342=\"RATE ONLY\",LOWER(\"RATE ONLY\"),\" \")))","v":" "}]
[]
["IHDR1","PC3.2.28",{"$nulls":3},"Waterproofing of prefabricated culvert joints with two 500 mm wide layers of filter fabric strips, impregnated with bitumen emulsion","m",{"$nulls":4},{"v":120,"d":"120.00"},{"$f":"IF(ISNUMBER(H344),L344*H344,IF(ISNUMBER(J344),J344,IF(J344=\"RATE ONLY\",LOWER(\"RATE ONLY\"),\" \")))","v":" "}]
{"$rows_empty":9}
["#BillEnd#"]
["#BillEnd#","TOTAL CARRIED FORWARD TO SUMMARY",{"$nulls":10},{"$f":"SUBTOTAL(9,M$7:M345)","v":0}]
["#BillEnd#"]

{"sheet":"3.3","index":12,"n_rows":180,"n_cols":10,"rows_kept":180}
["#BillSheet#"]
["#BillSheet#","C3.3","CONCRETE KERBING AND CHANNELLING, ASPHALT BERMS, CHUTES, DOWNPIPES",{"$nulls":6},"SCHEDULE A"]
["#BillSheet#",null,"AS WELL AS CONCRETE, STONE PITCHED AND GABION LININGS FOR OPEN DRAINS"]
["ColHDR"]
["ColHDR","ITEM",{"$nulls":3},"DESCRIPTION","UNIT","QTY","RATE","AMT"]
["ColHDR"]
[{"$nulls":5},"CONCRETE KERBING AND CHANNELLING, ASPHALT BERMS, CHUTES, DOWNPIPES, AS WELL AS CONCRETE, STONE PITCHED AND GABION LININGS FOR OPEN DRAINS"]
["IHDR1","C3.3.1",{"$nulls":3},"Concrete kerbing:"]
[]
["IHDR2",null,"C3.3.1.1",null,null,"Prefabricated kerbing:"]
[]
["Item",null,null,"(a)",null,"Prefabricated mountable kerb, SANS 927 Fig. 8 (c) (see DWG No 113142-0-DRG-RR-04-0020)","m"]
["Item",null,null,"(b)",null,"Prefabricated mountable kerb, SANS 927 Fig. 7 (see DWG No 113142-0-DRG-RR-04-0020","m"]
["IHDR2",null,"C3.3.1.2",null,null,"Cast in situ kerbing:"]
[]
["Item",null,null,"(a)",null,"300 mm x 200 mm Class C25/30-20 concrete edge beam at edges of surfacing, where required (see DWG No 113142-0-DRG-RR-04-0020)","m"]
["Item",null,null,"(b)",null,"300 mm x 200 mm Class C25/30-20 concrete edge beam at Type 3A and 3B catchwater banks and at cut - and/or fill benches  (see DWG No 113142-0-DRG-RR-04-0018)","m"]
["IHDR1","C3.3.2",{"$nulls":3},"Concrete kerbing-channelling combination:"]
[]
["IHDR2",null,"C3.3.2.1",null,null,"Prefabricated kerbing-channelling (description of type of channel and bedding with reference to drawing):"]
[]
["Item",null,null,"(a)",null,"State type of kerb and bedding with reference to drawing","m"]
["Item",null,null,"(b)",null,"Etc for other types","m"]
["IHDR2",null,"C3.3.2.2",null,null,"Cast in situ kerbing-channelling (description with reference to drawing and class of concrete and finish indicated):"]
[]
["Item",null,null,"(a)",null,"State type of kerb and bedding with reference to drawing","m"]
["Item",null,null,"(b)",null,"Etc for other types","m"]
["IHDR1","C3.3.3",{"$nulls":3},"Extra over items C3.3.1 and C3.3.2 for concrete kerbing or concrete kerbing and channelling on curves:"]
[]
["Item",null,"C3.3.3.1",null,null,"On curves of radii more than or equal to 5,0 m but less than 20 m (at bellmouths)","m"]
["Item",null,"C3.3.3.2",null,null,"On curves with radii more than or equal to 1,0 m but less than 5,0 m (at islands)","m"]
["Item",null,"C3.3.3.3",null,null,"On curves with radii less than 1,0 m","m"]
["IHDR1","C3.3.4",{"$nulls":3},"Extra over item C3.3.2 for drop kerbs at pedestrian crossings and driveways","m"]
[]
["IHDR1","C3.3.5",{"$nulls":3},"Asphalt berms:"]
[]
["Item",null,"C3.3.5.1",null,null,"Asphalt berms placed where there are no vehicle restraint systems (drawing reference indicated)","m"]
["Item",null,"C3.3.5.2",null,null,"Asphalt berms placed at existing vehicle restraint systems (250 bottom width x 100 top width x 80 high)","m",{"v":5000,"d":"5,000"},null,{"$f":"IF(ISNUMBER(H38),H38*I38,IF(H38=\"-\",\"rate only\",\" \"))","v":0}]
[]
["Item",null,"C3.3.5.3",null,null,"Prime coat (type indicated)","m²"]
["Item",null,"C3.3.5.4",null,null,"Bond coat (stable-grade, 30% net bituminous emulsion)","m²",{"$f":"+H38*0.25","v":1250},null,{"$f":"IF(ISNUMBER(H41),H41*I41,IF(H41=\"-\",\"rate only\",\" \"))","v":0}]
[]
["IHDR1","C3.3.6",{"$nulls":3},"Concrete chutes (typical designs):"]
[]
["Item",null,"C3.3.6.1",null,null,"Prefabricated concrete chutes (description of type with reference to drawing)","m"]
["Item",null,"C3.3.6.2",null,null,"Cast in situ concrete chutes (description, with reference to drawing and class of concrete and finish indicated)","m"]
["Item",null,"C3.3.6.3",null,null,"Stone pitched chutes (description with reference to drawing and class of concrete indicated)","m"]
["IHDR1","C3.3.7",{"$nulls":3},"Cast in situ concrete chutes (measured by components):"]
[]
["IHDR2",null,"C3.3.7.1",null,null,"Concrete (class indicated)","m³"]
[]
["IHDR2",null,"C3.3.7.2",null,null,"Formwork (surface finish indicated)","m²"]
[]
["IHDR2",null,"C3.3.7.3",null,null,"Stone pitched chutes:"]
[]
["Item",null,null,"(a)",null,"Grouted stone pitching (type of chute indicated)","m²"]
["Item",null,null,"(b)",null,"Grouted stone pitching on a concrete bed (class of concrete and type of chute indicated)","m²"]
["IHDR1","C3.3.8",{"$nulls":3},"Linings for open drains:"]
[]
["IHDR2",null,"C3.3.8.1",null,null,"Cast in situ concrete lining (Class C25/30-20 concrete) in:"]
[]
["Item",null,null,"(a)",null,"2.5 m wide side drains","m³"]
["Item",null,null,"(b)",null,"2.0 m wide median channels","m³"]
["Item",null,null,"(c)",null,"0.76 m wide drain at guardrails","m³"]
["IHDR2",null,"C3.3.8.2",null,null,"Class U2 surface finish to cast in situ concrete:"]
[]
["Item",null,null,"(a)",null,"2.5 m wide side drains","m²"]
["Item",null,null,"(b)",null,"2.0 m wide median channels","m²"]
["Item",null,null,"(c)",null,"0.76 m wide drain at guardrails","m²"]
["IHDR2",null,"C3.3.8.3",null,null,"Stone pitched lining (200 mm thickness):"]
[]
["Item",null,null,"(a)",null,"Grouted stone pitching (type of drain indicated)","m²"]
["Item",null,null,"(b)",null,"Grouted stone pitching on a concrete bed (class of concrete and type of open drain indicated)","m²"]
["IHDR1","C3.3.9",{"$nulls":3},"Formwork to cast in situ concrete lining for open drains (Class F2 surface finish):"]
[]
["IHDR2",null,"C3.3.9.1",null,null,"To sides with formwork on the internal face only","m²"]
[]
["IHDR2",null,"C3.3.9.2",null,null,"To sides with formwork on both internal and external faces (each face measured)","m²"]
[]
["IHDR2",null,"C3.3.9.3",null,null,"To ends of slabs","m²"]
[]
["IHDR1","C3.3.10",{"$nulls":3},"Sealed joints in concrete and stone pitched linings of open drains (Dow Corning 888 and polystyrene - see DWG No 113142-0-DRG-RR-04-0020)","m"]
[]
["IHDR1","C3.3.11",{"$nulls":3},"Concrete screed or backfill below chutes (thickness and class of concrete indicated)","m³"]
[]
["IHDR1","C3.3.12",{"$nulls":3},"Reinforcement:"]
[]
["item",null,"C3.3.12.1",null,null,"Mild steel bars","t"]
["item",null,"C3.3.12.2",null,null,"High-tensile steel bars","t"]
["item",null,"C3.3.12.3",null,null,"Welded steel fabric","kg"]
["item",null,"C3.3.12.4",null,null,"Other material (specify)","kg"]
["IHDR1","C3.3.13",{"$nulls":3},"Polymer film sheeting (0.15mm thick) for concrete-lined open drains (at side drains and median channels)","m²"]
[]
["IHDR1","C3.3.14",{"$nulls":3},"Cutting bituminous surfacing and pavement layers for concrete kerbing, channelling or concrete-lined drains","m"]
[]
["IHDR1","C3.3.15",{"$nulls":3},"Energy dissipaters in outlet structures:"]
[]
["item",null,"C3.3.15.1",null,null,"Precast concrete blocks in outlet structures","No."]
["item",null,"C3.3.15.2",null,null,"Stones set in outlet structures","m²"]
["IHDR1","C3.3.16",{"$nulls":3},"Demolition and removal of existing kerbs and/or channel (maximum width of 3.0 m)","m³"]
[]
["IHDR1","PC3.3.17",{"$nulls":3},"Spraying trimmed surfaces of excavations for concrete-lined open drains with invert bituminous emulsion (MSP 1 or approved equivalent) - at guardrail drains","litre"]
[]
["IHDR1","PC3.3.18",{"$nulls":3},"Removal of unsuitable material and replacement with \"selected\" quality material in excavations for concrete-lined open drains and also alongside concrete lined drains","m³"]
[]
["IHDR1","PC3.3.19",{"$nulls":3},"Inlet, outlet, transition and similar structures (typical designs):"]
[]
["IHDR2",null,"PC3.3.19.1",null,null,"Inlet structures, for downpipes down fill side slopes complete as shown on the drawings, class C25/30-20 concrete, single from one side only (L = 2,3 m)","No."]
[]
["IHDR2",null,"PC3.3.19.2",null,null,"Outlet structures for downpipes down fill side slopes complete with prefabricated reinforced-concrete blocks, class 30/20 concrete, complete as shown on the drawings","No."]
[]
["IHDR2",null,"PC3.3.19.3",null,null,"Side drain and outlet structure to median, class C25/30-20 concrete, complete as shown on the drawings"]
[]
["Item",null,null,"(a)",null,"Type 1","No."]
["Item",null,null,"(b)",null,"Type 2","No."]
["Item",null,null,"(c)",null,"At low point","No."]
["IHDR","C3.3/ C3.2",{"$nulls":3},"CULVERTS"]
[]
["IHDR1",null,"C3.2.4",null,null,"Metal and U-PVC culverts:"]
[]
["item",null,"C3.2.4.1",null,null,"Culverts, 300 mm dia galvanized corrugated pipes with 1,6 mm thick walls, including pipe anchors","m"]
["item",null,"C3.2.4.2",null,null,"Provision of skew or bevelled ends for metal culverts","No."]
["item",null,"C3.2.4.3",null,null,"Anchor bolts, 16 mm dia","No."]
["item",null,"C3.2.4.4",null,null,"Protective coating to metal culverts, 300 mm dia, corrugated with hot-dip zinc coating","m"]
["item",null,"PC3.2.4.5",null,null,"Anchor blocks including anchor bolts, complete as shown on DWG No 113142-0-DRG-RR-04-0023","No."]
{"$rows_empty":52}
["#BillEnd#"]
["#BillEnd#","TOTAL CARRIED FORWARD TO SUMMARY",{"$nulls":7},{"$f":"SUM(J35:J177)","v":{"v":0,"d":"0.00"}}]
["#BillEnd#"]

{"sheet":"4.1","index":13,"n_rows":206,"n_cols":14,"rows_kept":206,"hidden":true}
["#BillSheet#"]
["#BillSheet#","C4.1","BORROW MATERIALS",{"$nulls":3},"\n",null,null,"SCHEDULE A",{"$f":"SUBTOTAL(9,M$7:M1189)","v":0},null,{"$f":"J2","v":"SCHEDULE A"}]
["#BillSheet#"]
["ColHDR"]
["ColHDR","ITEM",{"$nulls":3},"DESCRIPTION","UNIT","QTY","RATE","AMT",null,"RATE","AMOUNT"]
["ColHDR"]
[{"$nulls":5},"BORROW MATERIALS"]
["IHDR1","C4.1.1",{"$nulls":3},"Compiling and implementing M&U plans:",{"$nulls":6},{"$f":"IF(ISNUMBER(H8),L8*H8,IF(ISNUMBER(J8),J8,IF(J8=\"RATE ONLY\",LOWER(\"RATE ONLY\"),\" \")))","v":" "}]
[]
["IHDR2",null,"C4.1.1.1",null,null,"For borrow pits "," ",{"$nulls":5},{"$f":"IF(ISNUMBER(H10),L10*H10,IF(ISNUMBER(J10),J10,IF(J10=\"RATE ONLY\",LOWER(\"RATE ONLY\"),\" \")))","v":" "}]
[]
["Item",null,null,"(a)",null,"BP1- Crusher","No.",{"$nulls":4},{"v":160000,"d":"160,000.00"},{"$f":"IF(ISNUMBER(H12),L12*H12,IF(ISNUMBER(J12),J12,IF(J12=\"RATE ONLY\",LOWER(\"RATE ONLY\"),\" \")))","v":" "}]
[]
["Item",null,null,"(b)",null,"BP2","No.",{"$nulls":4},{"v":80000,"d":"80,000.00"},{"$f":"IF(ISNUMBER(H14),L14*H14,IF(ISNUMBER(J14),J14,IF(J14=\"RATE ONLY\",LOWER(\"RATE ONLY\"),\" \")))","v":" "}]
[]
["Item",null,null,"(c)",null,"BP4","No.",{"$nulls":4},{"v":80000,"d":"80,000.00"},{"$f":"IF(ISNUMBER(H16),L16*H16,IF(ISNUMBER(J16),J16,IF(J16=\"RATE ONLY\",LOWER(\"RATE ONLY\"),\" \")))","v":" "}]
[]
["Item",null,null,"(d)",null,"BP5","No.",{"$nulls":4},{"v":80000,"d":"80,000.00"},{"$f":"IF(ISNUMBER(H18),L18*H18,IF(ISNUMBER(J18),J18,IF(J18=\"RATE ONLY\",LOWER(\"RATE ONLY\"),\" \")))","v":" "}]
[]
["Item",null,null,"(e)",null,"BP6 - Crusher","No.",{"$nulls":4},{"v":160000,"d":"160,000.00"},{"$f":"IF(ISNUMBER(H20),L20*H20,IF(ISNUMBER(J20),J20,IF(J20=\"RATE ONLY\",LOWER(\"RATE ONLY\"),\" \")))","v":" "}]
[]
["Item",null,null,"(f)",null,"BP14","No.",{"$nulls":4},{"v":80000,"d":"80,000.00"},{"$f":"IF(ISNUMBER(H22),L22*H22,IF(ISNUMBER(J22),J22,IF(J22=\"RATE ONLY\",LOWER(\"RATE ONLY\"),\" \")))","v":" "}]
[]
["Item",null,null,"(g)",null,"BP15","No.",{"$nulls":4},{"v":80000,"d":"80,000.00"},{"$f":"IF(ISNUMBER(H24),L24*H24,IF(ISNUMBER(J24),J24,IF(J24=\"RATE ONLY\",LOWER(\"RATE ONLY\"),\" \")))","v":" "}]
[]
["Item",null,null,"(h)",null,"BP16 - Crusher","No.",{"$nulls":4},{"v":160000,"d":"160,000.00"},{"$f":"IF(ISNUMBER(H26),L26*H26,IF(ISNUMBER(J26),J26,IF(J26=\"RATE ONLY\",LOWER(\"RATE ONLY\"),\" \")))","v":" "}]
[]
["Item",null,"C4.1.1.2",null,null,"For quarries (list all quarries separately)","No.",{"$nulls":5},{"$f":"IF(ISNUMBER(H28),L28*H28,IF(ISNUMBER(J28),J28,IF(J28=\"RATE ONLY\",LOWER(\"RATE ONLY\"),\" \")))","v":" "}]
["IHDR1","C4.1.2",{"$nulls":3},"Additional material investigations during the supplementary exploration:",{"$nulls":6},{"$f":"IF(ISNUMBER(H29),L29*H29,IF(ISNUMBER(J29),J29,IF(J29=\"RATE ONLY\",LOWER(\"RATE ONLY\"),\" \")))","v":" "}]
[]
["Item",null,"C4.1.2.1",null,null,"Cost of additional trial pits and/or drilling and laboratory testing","prov sum",null,null,{"$f":"+I31","v":0},null,{"v":900000,"d":"900,000.00"},{"$f":"IF(ISNUMBER(H31),L31*H31,IF(ISNUMBER(J31),J31,IF(J31=\"RATE ONLY\",LOWER(\"RATE ONLY\"),\" \")))","v":0}]
[]
["Item3",null,"C4.1.2.2",null,null,"Handling costs and profit in respect of item C4.1.2.1","%",null,". . . . . . .%",null,null,{"v":0.1,"d":"10%"},{"$f":"IF(ISNUMBER(H33),L33*H33,IF(ISNUMBER(J33),J33,IF(J33=\"RATE ONLY\",LOWER(\"RATE ONLY\"),\" \")))","v":" "}]
[]
["IHDR1","C4.1.3",{"$nulls":3},"Construction and maintenance of temporary haul and access roads:",{"$nulls":6},{"$f":"IF(ISNUMBER(H35),L35*H35,IF(ISNUMBER(J35),J35,IF(J35=\"RATE ONLY\",LOWER(\"RATE ONLY\"),\" \")))","v":" "}]
[]
["IHDR2",null,"C4.1.3.1",null,null,"Temporary unsealed roads","km",{"$nulls":5},{"$f":"IF(ISNUMBER(H37),L37*H37,IF(ISNUMBER(J37),J37,IF(J37=\"RATE ONLY\",LOWER(\"RATE ONLY\"),\" \")))","v":" "}]
[]
["Item",null,"C4.1.3.2",null,null,"Cost to repair existing public roads or streets","prov sum",{"$nulls":5}," "]
["Item",null,"C4.1.3.3",null,null,"Handling costs and profit in respect of item C4.1.3.2","%",{"$nulls":5}," "]
["IHDR1","C4.1.4",{"$nulls":3},"Removing of the overburden:",{"$nulls":6},{"$f":"IF(ISNUMBER(H41),L41*H41,IF(ISNUMBER(J41),J41,IF(J41=\"RATE ONLY\",LOWER(\"RATE ONLY\"),\" \")))","v":" "}]
[]
["IHDR2",null,"C4.1.4.1",null,null,"In borrow pits","m³",{"$nulls":4},{"v":14,"d":"14.00"},{"$f":"IF(ISNUMBER(H43),L43*H43,IF(ISNUMBER(J43),J43,IF(J43=\"RATE ONLY\",LOWER(\"RATE ONLY\"),\" \")))","v":" "}]
[]
["IHDR2",null,"C4.1.4.2",null,null,"In quarries:",{"$nulls":6},{"$f":"IF(ISNUMBER(H45),L45*H45,IF(ISNUMBER(J45),J45,IF(J45=\"RATE ONLY\",LOWER(\"RATE ONLY\"),\" \")))","v":" "}]
[]
["Item",null,null,"(a)",null,"Soft material","m³",{"$nulls":5}," "]
["Item",null,null,"(b)",null,"Hard material (by blasting)","m³",{"$nulls":5}," "]
["IHDR1","C4.1.5",{"$nulls":3},"Excavating of materials in the borrow pits and quarries, material obtained from:",{"$nulls":6},{"$f":"IF(ISNUMBER(H49),L49*H49,IF(ISNUMBER(J49),J49,IF(J49=\"RATE ONLY\",LOWER(\"RATE ONLY\"),\" \")))","v":" "}]
[]
["Item",null,"C4.1.5.1",null,null,"Soft excavation","m³",{"$nulls":4},{"v":20,"d":"20.00"},{"$f":"IF(ISNUMBER(H51),L51*H51,IF(ISNUMBER(J51),J51,IF(J51=\"RATE ONLY\",LOWER(\"RATE ONLY\"),\" \")))","v":" "}]
[]
["Item",null,"C4.1.5.2",null,null,"Boulder excavation class A","m³",{"$nulls":5}," "]
["Item",null,"C4.1.5.3",null,null,"Boulder excavation class B","m³",{"$nulls":4},{"v":35,"d":"35.00"},{"$f":"IF(ISNUMBER(H54),L54*H54,IF(ISNUMBER(J54),J54,IF(J54=\"RATE ONLY\",LOWER(\"RATE ONLY\"),\" \")))","v":" "},"small quantity just in case"]
[]
["Item",null,"C4.1.5.4",null,null,"Hard excavation (other than by blasting)","m³",{"$nulls":4},{"v":35,"d":"35.00"},{"$f":"IF(ISNUMBER(H56),L56*H56,IF(ISNUMBER(J56),J56,IF(J56=\"RATE ONLY\",LOWER(\"RATE ONLY\"),\" \")))","v":" "}]
[]
["Item",null,"C4.1.5.5",null,null,"Hard excavation (by blasting)","m³",{"$nulls":4},{"v":40,"d":"40.00"},{"$f":"IF(ISNUMBER(H58),L58*H58,IF(ISNUMBER(J58),J58,IF(J58=\"RATE ONLY\",LOWER(\"RATE ONLY\"),\" \")))","v":" "}]
[]
["IHDR1","C4.1.6",{"$nulls":3},"Providing crushing, screening and related plants:",{"$nulls":6},{"$f":"IF(ISNUMBER(H60),L60*H60,IF(ISNUMBER(J60),J60,IF(J60=\"RATE ONLY\",LOWER(\"RATE ONLY\"),\" \")))","v":" "}]
[]
["Item",null,"C4.1.6.1",null,null,"Single-stage crushing plant","No.",{"$nulls":5}," "]
["Item",null,"C4.1.6.2",null,null,"Two-stage crushing plant","No.",{"$nulls":5}," "]
["Item",null,"C4.1.6.3",null,null,"Multiple-stage crushing and screening plant","No.",{"$nulls":4},{"v":1200000,"d":"1,200,000.00"},{"$f":"IF(ISNUMBER(H64),L64*H64,IF(ISNUMBER(J64),J64,IF(J64=\"RATE ONLY\",LOWER(\"RATE ONLY\"),\" \")))","v":" "}]
[]
["Item",null,"C4.1.6.4",null,null,"Screening plant","No.",{"$nulls":5}," "]
["Item",null,"C4.1.6.5",null,null,"Etc, for other plants (as stated by the Engineer and/or the Contractor)","No.",{"$nulls":5}," "]
["IHDR1","C4.1.7",{"$nulls":3},"Producing the material by:",{"$nulls":6},{"$f":"IF(ISNUMBER(H68),L68*H68,IF(ISNUMBER(J68),J68,IF(J68=\"RATE ONLY\",LOWER(\"RATE ONLY\"),\" \")))","v":" "}]
[]
["Item",null,"C4.1.7.1",null,null,"Single-stage crushing","m³",{"$nulls":5}," "]
["Item",null,"C4.1.7.2",null,null,"Two-stage crushing","m³",{"$nulls":5}," "]
["PB"]
["PB","CARRIED FORWARD",{"$nulls":10},{"$f":"SUBTOTAL(9,M$7:M71)","v":0}]
["PB"]
["PB"]
["PB","BROUGHT FORWARD",{"$nulls":10},{"$f":"SUBTOTAL(9,M$7:M74)","v":0}]
["PB"]
["Item",null,"C4.1.7.3",null,null,"Multiple-stage crushing including screening","m³",{"$nulls":4},{"v":82,"d":"82.00"},{"$f":"IF(ISNUMBER(H78),L78*H78,IF(ISNUMBER(J78),J78,IF(J78=\"RATE ONLY\",LOWER(\"RATE ONLY\"),\" \")))","v":" "},"see haul calcs"]
[]
["Item",null,"C4.1.7.4",null,null,"Screening only","m³",{"$nulls":5}," "]
["Item",null,"C4.1.7.5",null,null,"Etc, for other plants (as stated by the Engineer and/or the Contractor)","m³",{"$nulls":5},{"$f":"IF(ISNUMBER(H81),L81*H81,IF(ISNUMBER(J81),J81,IF(J81=\"RATE ONLY\",LOWER(\"RATE ONLY\"),\" \")))","v":" "}]
["IHDR1","C4.1.8",{"$nulls":3},"Moving and re-erecting the crushing, screening and related plants on the site:",{"$nulls":6},{"$f":"IF(ISNUMBER(H82),L82*H82,IF(ISNUMBER(J82),J82,IF(J82=\"RATE ONLY\",LOWER(\"RATE ONLY\"),\" \")))","v":" "}]
[]
["Item",null,"C4.1.8.1",null,null,"Single-stage crushing plant","No.",{"$nulls":5}," "]
["Item",null,"C4.1.8.2",null,null,"Two-stage crushing plant","No.",{"$nulls":5}," "]
["Item",null,"C4.1.8.3",null,null,"Multiple-stage crushing and screening plant","No.",{"$nulls":4},{"v":385000,"d":"385,000.00"},{"$f":"IF(ISNUMBER(H86),L86*H86,IF(ISNUMBER(J86),J86,IF(J86=\"RATE ONLY\",LOWER(\"RATE ONLY\"),\" \")))","v":" "}]
[]
["Item",null,"C4.1.8.4",null,null,"Screening plant","No.",{"$nulls":5}," "]
["Item",null,"C4.1.8.5",null,null,"Etc, for other plants (as stated by the Engineer and/or the Contractor)","No.",{"$nulls":5}," "]
["IHDR1","C4.1.9",{"$nulls":3},"Breaking down oversize material","m³",{"$nulls":4},{"v":60,"d":"60.00"},{"$f":"IF(ISNUMBER(H90),L90*H90,IF(ISNUMBER(J90),J90,IF(J90=\"RATE ONLY\",LOWER(\"RATE ONLY\"),\" \")))","v":" "}]
[]
["IHDR1","C4.1.10",{"$nulls":3},"Compacting the floor of the stockpile sites","m³",{"$nulls":4},{"v":30,"d":"30.00"},{"$f":"IF(ISNUMBER(H92),L92*H92,IF(ISNUMBER(J92),J92,IF(J92=\"RATE ONLY\",LOWER(\"RATE ONLY\"),\" \")))","v":" "}]
[]
["IHDR1","C4.1.11",{"$nulls":3},"Constructing a platform for the stockpile site","m³",{"$nulls":4},{"v":150,"d":"150.00"},{"$f":"IF(ISNUMBER(H94),L94*H94,IF(ISNUMBER(J94),J94,IF(J94=\"RATE ONLY\",LOWER(\"RATE ONLY\"),\" \")))","v":" "}]
[]
["IHDR1","C4.1.12",{"$nulls":3},"Stockpiling the material:",{"$nulls":6},{"$f":"IF(ISNUMBER(H96),L96*H96,IF(ISNUMBER(J96),J96,IF(J96=\"RATE ONLY\",LOWER(\"RATE ONLY\"),\" \")))","v":" "}]
[]
["Item",null,"C4.1.12.1",null,null,"Material from a producing plant","m³",{"$nulls":5}," "]
["Item",null,"C4.1.12.2",null,null,"Material directly from the excavation","m³",{"$nulls":4},{"v":20,"d":"20.00"},{"$f":"IF(ISNUMBER(H99),L99*H99,IF(ISNUMBER(J99),J99,IF(J99=\"RATE ONLY\",LOWER(\"RATE ONLY\"),\" \")))","v":" "},"All Hard  blast material, check"]
[]
["IHDR1","C4.1.13",{"$nulls":3},"Removing surplus material from the stockpile","m³",{"$nulls":5},{"$f":"IF(ISNUMBER(H101),L101*H101,IF(ISNUMBER(J101),J101,IF(J101=\"RATE ONLY\",LOWER(\"RATE ONLY\"),\" \")))","v":" "}]
[]
["IHDR1","C4.1.14",{"$nulls":3},"Removing the fill platform and temporary banks at the stockpile sites upon completion:",{"$nulls":6},{"$f":"IF(ISNUMBER(H103),L103*H103,IF(ISNUMBER(J103),J103,IF(J103=\"RATE ONLY\",LOWER(\"RATE ONLY\"),\" \")))","v":" "}]
[]
["Item",null,"C4.1.14.1",null,null,"Fill platform","m³",{"$nulls":4},{"v":100,"d":"100.00"},{"$f":"IF(ISNUMBER(H105),L105*H105,IF(ISNUMBER(J105),J105,IF(J105=\"RATE ONLY\",LOWER(\"RATE ONLY\"),\" \")))","v":" "},"nominal quantity"]
[]
["Item",null,"C4.1.14.2",null,null,"Temporary banks","m³",{"$nulls":5}," "]
["IHDR1","C4.1.15",{"$nulls":3},"Shaping and finishing the borrow pit and quarry areas, and the stockpile sites:",{"$nulls":6},{"$f":"IF(ISNUMBER(H108),L108*H108,IF(ISNUMBER(J108),J108,IF(J108=\"RATE ONLY\",LOWER(\"RATE ONLY\"),\" \")))","v":" "}]
[]
["IHDR2",null,"C4.1.15.1",null,null,"Shaping and finishing the borrow pit and quarry areas, and the stockpile sites:",{"$nulls":6},{"$f":"IF(ISNUMBER(H110),L110*H110,IF(ISNUMBER(J110),J110,IF(J110=\"RATE ONLY\",LOWER(\"RATE ONLY\"),\" \")))","v":" "}]
[]
["IHDR3",null,null,"(a)",null,"Borrow pits "," ",{"$nulls":5},{"$f":"IF(ISNUMBER(H112),L112*H112,IF(ISNUMBER(J112),J112,IF(J112=\"RATE ONLY\",LOWER(\"RATE ONLY\"),\" \")))","v":" "}]
[]
["Item",{"$nulls":3},"(i)","BP1- Crusher","ha",{"$nulls":4},{"v":40000,"d":"40,000.00"},{"$f":"IF(ISNUMBER(H114),L114*H114,IF(ISNUMBER(J114),J114,IF(J114=\"RATE ONLY\",LOWER(\"RATE ONLY\"),\" \")))","v":" "},"Willem Mail"]
[]
["Item",{"$nulls":3},"(ii)","BP2","ha",{"$nulls":4},{"v":40000,"d":"40,000.00"},{"$f":"IF(ISNUMBER(H116),L116*H116,IF(ISNUMBER(J116),J116,IF(J116=\"RATE ONLY\",LOWER(\"RATE ONLY\"),\" \")))","v":" "}]
[]
["Item",{"$nulls":3},"(iii)","BP4","ha",{"$nulls":4},{"v":40000,"d":"40,000.00"},{"$f":"IF(ISNUMBER(H118),L118*H118,IF(ISNUMBER(J118),J118,IF(J118=\"RATE ONLY\",LOWER(\"RATE ONLY\"),\" \")))","v":" "}]
[]
["Item",{"$nulls":3},"(iv)","BP5","ha",{"$nulls":4},{"v":40000,"d":"40,000.00"},{"$f":"IF(ISNUMBER(H120),L120*H120,IF(ISNUMBER(J120),J120,IF(J120=\"RATE ONLY\",LOWER(\"RATE ONLY\"),\" \")))","v":" "}]
[]
["Item",{"$nulls":3},"(v)","BP6 - Crusher","ha",{"$nulls":4},{"v":40000,"d":"40,000.00"},{"$f":"IF(ISNUMBER(H122),L122*H122,IF(ISNUMBER(J122),J122,IF(J122=\"RATE ONLY\",LOWER(\"RATE ONLY\"),\" \")))","v":" "}]
[]
["Item",{"$nulls":3},"(vi)","BP14","ha",{"$nulls":4},{"v":40000,"d":"40,000.00"},{"$f":"IF(ISNUMBER(H124),L124*H124,IF(ISNUMBER(J124),J124,IF(J124=\"RATE ONLY\",LOWER(\"RATE ONLY\"),\" \")))","v":" "}]
[]
["Item",{"$nulls":3},"(vii)","BP15","ha",{"$nulls":4},{"v":40000,"d":"40,000.00"},{"$f":"IF(ISNUMBER(H126),L126*H126,IF(ISNUMBER(J126),J126,IF(J126=\"RATE ONLY\",LOWER(\"RATE ONLY\"),\" \")))","v":" "}]
[]
["Item",{"$nulls":3},"(viii)","BP16 - Crusher","ha",{"$nulls":4},{"v":40000,"d":"40,000.00"},{"$f":"IF(ISNUMBER(H128),L128*H128,IF(ISNUMBER(J128),J128,IF(J128=\"RATE ONLY\",LOWER(\"RATE ONLY\"),\" \")))","v":" "}]
[]
["Item",null,null,"(b)",null,"Quarries (list all quarries separately)","ha",{"$nulls":5}," "]
["PB"]
["PB","CARRIED FORWARD",{"$nulls":10},{"$f":"SUBTOTAL(9,M$7:M130)","v":0}]
["PB"]
["PB"]
["PB","BROUGHT FORWARD",{"$nulls":10},{"$f":"SUBTOTAL(9,M$7:M133)","v":0}]
["PB"]
["Item",null,null,"(c)",null,"Stockpile sites","ha",{"$nulls":4},{"v":40000,"d":"40,000.00"},{"$f":"IF(ISNUMBER(H137),L137*H137,IF(ISNUMBER(J137),J137,IF(J137=\"RATE ONLY\",LOWER(\"RATE ONLY\"),\" \")))","v":" "}]
[]
["IHDR2",null,"C4.1.15.2",null,null,"Finishing of the borrow pit and quarry areas, and the stockpile sites using labour enhanced methods of construction:",{"$nulls":6},{"$f":"IF(ISNUMBER(H139),L139*H139,IF(ISNUMBER(J139),J139,IF(J139=\"RATE ONLY\",LOWER(\"RATE ONLY\"),\" \")))","v":" "}]
[]
["Item",null,null,"(a)",null,"Borrow pits (list all borrow pits separately)","ha",{"$nulls":5}," "]
["Item",null,null,"(b)",null,"Quarries (list all quarries separately)","ha",{"$nulls":5}," "]
["Item",null,null,"(c)",null,"Stockpile sites","ha",{"$nulls":5}," "]
["IHDR1","C4.1.16",{"$nulls":3},"Personnel:",{"$nulls":6},{"$f":"IF(ISNUMBER(H144),L144*H144,IF(ISNUMBER(J144),J144,IF(J144=\"RATE ONLY\",LOWER(\"RATE ONLY\"),\" \")))","v":" "}]
[]
["Item",null,"C4.1.16.1",null,null,"Materials manager","month",{"$nulls":4},{"v":20000,"d":"20,000.00"},{"$f":"IF(ISNUMBER(H146),L146*H146,IF(ISNUMBER(J146),J146,IF(J146=\"RATE ONLY\",LOWER(\"RATE ONLY\"),\" \")))","v":" "}]
[]
["Item",null,"C4.1.16.2",null,null,"Excavation controller","month",{"$nulls":5}," "]
["Item",null,"C4.1.16.3",null,null,"Stockpile controller","month",{"$nulls":5}," "]
["IHDR1","C4.1.17",{"$nulls":3},"Weighbridge facility:",{"$nulls":6},{"$f":"IF(ISNUMBER(H150),L150*H150,IF(ISNUMBER(J150),J150,IF(J150=\"RATE ONLY\",LOWER(\"RATE ONLY\"),\" \")))","v":" "}]
[]
["Item",null,"C4.1.17.1",null,null,"Providing, erecting and removal of a weighbridge facility","lump sum",null," ",null,null,{"v":200000,"d":"200,000.00"},{"$f":"IF(ISNUMBER(H152),L152*H152,IF(ISNUMBER(J152),J152,IF(J152=\"RATE ONLY\",LOWER(\"RATE ONLY\"),\" \")))","v":" "}]
[]
["Item",null,"C4.1.17.2",null,null,"Operating the weighbridge","month",{"$nulls":4},{"v":50000,"d":"50,000.00"},{"$f":"IF(ISNUMBER(H154),L154*H154,IF(ISNUMBER(J154),J154,IF(J154=\"RATE ONLY\",LOWER(\"RATE ONLY\"),\" \")))","v":" "}]
[]
["IHDR1","C4.1.18",{"$nulls":3},"Compensation to landowners or legal occupants in respect of land acquisition, royalties and/or loss of crops:",{"$nulls":6},{"$f":"IF(ISNUMBER(H156),L156*H156,IF(ISNUMBER(J156),J156,IF(J156=\"RATE ONLY\",LOWER(\"RATE ONLY\"),\" \")))","v":" "}]
[]
["Item",null,"C4.1.18.1",null,null,"Amount allowed, expenditure to be approved or instructed by the Employer","prov sum",{"$nulls":5},{"$f":"IF(ISNUMBER(H158),L158*H158,IF(ISNUMBER(J158),J158,IF(J158=\"RATE ONLY\",LOWER(\"RATE ONLY\"),\" \")))","v":" "}]
["Item",null,"C4.1.18.2",null,null,"Handling costs and profit in respect of item C4.1.18.1","%",{"$nulls":5},{"$f":"IF(ISNUMBER(H159),L159*H159,IF(ISNUMBER(J159),J159,IF(J159=\"RATE ONLY\",LOWER(\"RATE ONLY\"),\" \")))","v":" "}]
[{"$nulls":5},"WHERE CRUSHED STONE MATERIAL IS EXCAVATED, PRODUCED AND STOCKPILED FOR USE ON OTHER PROJECTS, THE ITEMS HEREUNDER SHALL APPLY."]
["IHDR1","C4.1.19",{"$nulls":3},"Excavating hard material","m³ or t",{"$nulls":5},{"$f":"IF(ISNUMBER(H161),L161*H161,IF(ISNUMBER(J161),J161,IF(J161=\"RATE ONLY\",LOWER(\"RATE ONLY\"),\" \")))","v":" "}]
[]
["IHDR1","C4.1.20",{"$nulls":3},"Producing the material by:",{"$nulls":6},{"$f":"IF(ISNUMBER(H163),L163*H163,IF(ISNUMBER(J163),J163,IF(J163=\"RATE ONLY\",LOWER(\"RATE ONLY\"),\" \")))","v":" "}]
[]
["Item",null,"C4.1.20.1",null,null,"Single stage crushing","m³ or t",{"$nulls":5},{"$f":"IF(ISNUMBER(H165),L165*H165,IF(ISNUMBER(J165),J165,IF(J165=\"RATE ONLY\",LOWER(\"RATE ONLY\"),\" \")))","v":" "}]
["Item",null,"C4.1.20.2",null,null,"Multi-stage crushing and screening","m³ or t",{"$nulls":5},{"$f":"IF(ISNUMBER(H166),L166*H166,IF(ISNUMBER(J166),J166,IF(J166=\"RATE ONLY\",LOWER(\"RATE ONLY\"),\" \")))","v":" "}]
["IHDR1","C4.1.21",{"$nulls":3},"Stockpiling the crushed material","m³ or t",{"$nulls":5},{"$f":"IF(ISNUMBER(H167),L167*H167,IF(ISNUMBER(J167),J167,IF(J167=\"RATE ONLY\",LOWER(\"RATE ONLY\"),\" \")))","v":" "}]
{"$rows_empty":36}
["#BillEnd#"]
["#BillEnd#","TOTAL CARRIED FORWARD TO SUMMARY",{"$nulls":10},{"$f":"SUBTOTAL(9,M$7:M168)","v":0}]
["#BillEnd#"]

{"sheet":"4.2","index":14,"n_rows":104,"n_cols":13,"rows_kept":104,"hidden":true}
["#BillSheet#"]
["#BillSheet#","C4.2","CUT MATERIALS",{"$nulls":3},"\n",null,null,"SCHEDULE A",{"$f":"SUBTOTAL(9,M$7:M877)","v":0},null,{"$f":"J2","v":"SCHEDULE A"}]
["#BillSheet#"]
["ColHDR"]
["ColHDR","ITEM",{"$nulls":3},"DESCRIPTION","UNIT","QTY","RATE","AMT",null,"RATE","AMOUNT"]
["ColHDR"]
[{"$nulls":5},"CUT MATERIALS"]
["IHDR1","C4.2.1",{"$nulls":3},"Compiling and implementing M&U plans for the cuttings:",{"$nulls":6},{"$f":"IF(ISNUMBER(H8),L8*H8,IF(ISNUMBER(J8),J8,IF(J8=\"RATE ONLY\",LOWER(\"RATE ONLY\"),\" \")))","v":" "}]
[]
["Item",null,"C4.2.1.1",null,null,"Cuttings exceeding 5 000 m³ up to 10 000 m³","No.",{"$nulls":4},{"v":160000,"d":"160,000.00"},{"$f":"IF(ISNUMBER(H10),L10*H10,IF(ISNUMBER(J10),J10,IF(J10=\"RATE ONLY\",LOWER(\"RATE ONLY\"),\" \")))","v":" "}]
[]
["Item",null,"C4.2.1.2",null,null,"Cuttings exceeding 10 000 m³ up to 20 000 m³","No.",{"$nulls":4},{"v":180000,"d":"180,000.00"},{"$f":"IF(ISNUMBER(H12),L12*H12,IF(ISNUMBER(J12),J12,IF(J12=\"RATE ONLY\",LOWER(\"RATE ONLY\"),\" \")))","v":" "}]
[]
["Item",null,"C4.2.1.3",null,null,"Cuttings exceeding 20 000 m³ up to 50 000 m³","No.",{"$nulls":4},{"v":200000,"d":"200,000.00"},{"$f":"IF(ISNUMBER(H14),L14*H14,IF(ISNUMBER(J14),J14,IF(J14=\"RATE ONLY\",LOWER(\"RATE ONLY\"),\" \")))","v":" "}]
[]
["Item",null,"C4.2.1.4",null,null,"Cuttings exceeding 50 000 m³ up to 100 000 m³","No.",{"$nulls":4},{"v":220000,"d":"220,000.00"},{"$f":"IF(ISNUMBER(H16),L16*H16,IF(ISNUMBER(J16),J16,IF(J16=\"RATE ONLY\",LOWER(\"RATE ONLY\"),\" \")))","v":" "}]
[]
["Item",null,"C4.2.1.5",null,null,"Cuttings larger than 100 000 m³","No.",{"$nulls":5},{"$f":"IF(ISNUMBER(H18),L18*H18,IF(ISNUMBER(J18),J18,IF(J18=\"RATE ONLY\",LOWER(\"RATE ONLY\"),\" \")))","v":" "}]
["IHDR1","C4.2.2",{"$nulls":3},"Additional material investigations during the supplementary exploration:",{"$nulls":6},{"$f":"IF(ISNUMBER(H19),L19*H19,IF(ISNUMBER(J19),J19,IF(J19=\"RATE ONLY\",LOWER(\"RATE ONLY\"),\" \")))","v":" "}]
[]
["Item",null,"C4.2.2.1",null,null,"Cost of additional trial pits and/or drilling and laboratory testing","prov sum",null,null,{"$f":"+I21","v":0},null,{"v":100000,"d":"100,000.00"},{"$f":"IF(ISNUMBER(H21),L21*H21,IF(ISNUMBER(J21),J21,IF(J21=\"RATE ONLY\",LOWER(\"RATE ONLY\"),\" \")))","v":0}]
[]
["Item3",null,"C4.2.2.2",null,null,"Handling costs and profit in respect of item C4.2.2.1","%",null,". . . . . . .%",null,null,{"v":0.1,"d":"10%"},{"$f":"IF(ISNUMBER(H23),L23*H23,IF(ISNUMBER(J23),J23,IF(J23=\"RATE ONLY\",LOWER(\"RATE ONLY\"),\" \")))","v":" "}]
[]
["IHDR1","C4.2.3",{"$nulls":3},"Excavating of materials in cuttings, material obtained from:",{"$nulls":6},{"$f":"IF(ISNUMBER(H25),L25*H25,IF(ISNUMBER(J25),J25,IF(J25=\"RATE ONLY\",LOWER(\"RATE ONLY\"),\" \")))","v":" "}]
[]
["Item",null,"C4.2.3.1",null,null,"Soft excavation","m³",{"$nulls":4},{"v":35,"d":"35.00"},{"$f":"IF(ISNUMBER(H27),L27*H27,IF(ISNUMBER(J27),J27,IF(J27=\"RATE ONLY\",LOWER(\"RATE ONLY\"),\" \")))","v":" "}]
[]
["Item",null,"C4.2.3.2",null,null,"Boulder excavation class A","m³",{"$nulls":4},{"v":50,"d":"50.00"}," "]
["Item",null,"C4.2.3.3",null,null,"Boulder excavation class B","m³",{"$nulls":4},{"v":50,"d":"50.00"}," "]
["Item",null,"C4.2.3.4",null,null,"Hard excavation (other than by blasting)","m³",{"$nulls":4},{"v":50,"d":"50.00"},{"$f":"IF(ISNUMBER(H31),L31*H31,IF(ISNUMBER(J31),J31,IF(J31=\"RATE ONLY\",LOWER(\"RATE ONLY\"),\" \")))","v":" "}]
[]
["Item",null,"C4.2.3.5",null,null,"Hard excavation (by blasting)","m³",{"$nulls":5}," "]
["IHDR1","C4.2.4",{"$nulls":3},"Excavating of materials in box cuts, material obtained from:",{"$nulls":6},{"$f":"IF(ISNUMBER(H34),L34*H34,IF(ISNUMBER(J34),J34,IF(J34=\"RATE ONLY\",LOWER(\"RATE ONLY\"),\" \")))","v":" "}]
[]
["Item",null,"C4.2.4.1",null,null,"Soft excavation","m³",{"$nulls":5}," "]
["Item",null,"C4.2.4.2",null,null,"Boulder excavation class A","m³",{"$nulls":5}," "]
["Item",null,"C4.2.4.3",null,null,"Boulder excavation class B","m³",{"$nulls":5}," "]
["Item",null,"C4.2.4.4",null,null,"Hard excavation (other than by blasting)","m³",{"$nulls":5}," "]
["Item",null,"C4.2.4.5",null,null,"Hard excavation (by blasting)","m³",{"$nulls":5}," "]
["IHDR1","C4.2.5",{"$nulls":3},"Excavating of materials in designated excavations, material obtained from:",{"$nulls":6},{"$f":"IF(ISNUMBER(H41),L41*H41,IF(ISNUMBER(J41),J41,IF(J41=\"RATE ONLY\",LOWER(\"RATE ONLY\"),\" \")))","v":" "}]
[]
["Item",null,"C4.2.5.1",null,null,"Soft excavation","m³",{"$nulls":5}," "]
["Item",null,"C4.2.5.2",null,null,"Boulder excavation class A","m³",{"$nulls":5}," "]
["Item",null,"C4.2.5.3",null,null,"Boulder excavation class B","m³",{"$nulls":5}," "]
["Item",null,"C4.2.5.4",null,null,"Hard excavation (other than by blasting)","m³",{"$nulls":5}," "]
["Item",null,"C4.2.5.5",null,null,"Hard excavation (by blasting)","m³",{"$nulls":5}," "]
["IHDR1","C4.2.6",{"$nulls":3},"Widening of existing cuttings:",{"$nulls":6},{"$f":"IF(ISNUMBER(H48),L48*H48,IF(ISNUMBER(J48),J48,IF(J48=\"RATE ONLY\",LOWER(\"RATE ONLY\"),\" \")))","v":" "}]
[]
["Item",null,"C4.2.6.1",null,null,"Soft excavation","m³",{"$nulls":5}," "]
["Item",null,"C4.2.6.2",null,null,"Boulder excavation class A","m³",{"$nulls":5}," "]
["Item",null,"C4.2.6.3",null,null,"Boulder excavation class B","m³",{"$nulls":5}," "]
["Item",null,"C4.2.6.4",null,null,"Hard excavation (other than by blasting)","m³",{"$nulls":5}," "]
["Item",null,"C4.2.6.5",null,null,"Hard excavation (by blasting)","m³",{"$nulls":5},{"$f":"IF(ISNUMBER(H54),L54*H54,IF(ISNUMBER(J54),J54,IF(J54=\"RATE ONLY\",LOWER(\"RATE ONLY\"),\" \")))","v":" "}]
["IHDR1","C4.2.7",{"$nulls":3},"Removal of unsuitable stable cut material to spoil:",{"$nulls":6},{"$f":"IF(ISNUMBER(H55),L55*H55,IF(ISNUMBER(J55),J55,IF(J55=\"RATE ONLY\",LOWER(\"RATE ONLY\"),\" \")))","v":" "}]
[]
["Item",null,"C4.2.7.1",null,null,"In layer thicknesses of 200 mm and less","m³",{"$nulls":4},{"v":32,"d":"32.00"},{"$f":"IF(ISNUMBER(H57),L57*H57,IF(ISNUMBER(J57),J57,IF(J57=\"RATE ONLY\",LOWER(\"RATE ONLY\"),\" \")))","v":" "}]
[]
["Item",null,"C4.2.7.2",null,null,"In layer thicknesses exceeding 200 mm","m³",{"$nulls":4},{"v":30,"d":"30.00"},{"$f":"IF(ISNUMBER(H59),L59*H59,IF(ISNUMBER(J59),J59,IF(J59=\"RATE ONLY\",LOWER(\"RATE ONLY\"),\" \")))","v":" "}]
[]
["IHDR1","C4.2.8",{"$nulls":3},"Excavate material to spoil in sites designated by the Employer, material obtained from:",{"$nulls":6},{"$f":"IF(ISNUMBER(H61),L61*H61,IF(ISNUMBER(J61),J61,IF(J61=\"RATE ONLY\",LOWER(\"RATE ONLY\"),\" \")))","v":" "}]
[]
["Item",null,"C4.2.8.1",null,null,"Soft excavation, overburden and unsuitable material","m³",{"$nulls":5}," "]
["Item",null,"C4.2.8.2",null,null,"Boulder excavation class A","m³",{"$nulls":5}," "]
["Item",null,"C4.2.8.3",null,null,"Boulder excavation class B","m³",{"$nulls":5}," "]
["Item",null,"C4.2.8.4",null,null,"Hard excavation (other than by blasting)","m³",{"$nulls":5}," "]
["Item",null,"C4.2.8.5",null,null,"Hard excavation (by blasting)","m³",{"$nulls":5}," "]
["IHDR1","C4.2.9",{"$nulls":3},"Excavate material to spoil in sites designated by the Contractor, material obtained from:",{"$nulls":6},{"$f":"IF(ISNUMBER(H68),L68*H68,IF(ISNUMBER(J68),J68,IF(J68=\"RATE ONLY\",LOWER(\"RATE ONLY\"),\" \")))","v":" "}]
[]
["Item",null,"C4.2.9.1",null,null,"Soft excavation","m³",{"$nulls":5}," "]
["Item",null,"C4.2.9.2",null,null,"Boulder excavation class A","m³",{"$nulls":5}," "]
["Item",null,"C4.2.9.3",null,null,"Boulder excavation class B","m³",{"$nulls":5}," "]
["Item",null,"C4.2.9.4",null,null,"Hard excavation (other than by blasting)","m³",{"$nulls":5}," "]
["Item",null,"C4.2.9.5",null,null,"Hard excavation (by blasting)","m³",{"$nulls":5}," "]
["IHDR1","C4.2.10",{"$nulls":3},"Backfilling of the unavoidable overbreak in hard and boulder excavation:",{"$nulls":6},{"$f":"IF(ISNUMBER(H75),L75*H75,IF(ISNUMBER(J75),J75,IF(J75=\"RATE ONLY\",LOWER(\"RATE ONLY\"),\" \")))","v":" "}]
[]
["Item",null,"C4.2.10.1",null,null,"Compliant gravel material","m³",{"$nulls":5}," "]
["Item",null,"C4.2.10.2",null,null,"Soil cement (stiff mix with 3 % cement)","m³",{"$nulls":5}," "]
["Item",null,"C4.2.10.3",null,null,"Concrete class 15 MPa","m³",{"$nulls":5}," "]
["IHDR1","C4.2.11",{"$nulls":3},"Breaking down oversize material","m³",{"$nulls":5},{"$f":"IF(ISNUMBER(H80),L80*H80,IF(ISNUMBER(J80),J80,IF(J80=\"RATE ONLY\",LOWER(\"RATE ONLY\"),\" \")))","v":" "}]
[]
["IHDR1","C4.2.12",{"$nulls":3},"Finishing the side slopes:",{"$nulls":6},{"$f":"IF(ISNUMBER(H82),L82*H82,IF(ISNUMBER(J82),J82,IF(J82=\"RATE ONLY\",LOWER(\"RATE ONLY\"),\" \")))","v":" "}]
[]
["IHDR2",null,"C4.2.12.1",null,null,"Cuttings:",{"$nulls":6},{"$f":"IF(ISNUMBER(H84),L84*H84,IF(ISNUMBER(J84),J84,IF(J84=\"RATE ONLY\",LOWER(\"RATE ONLY\"),\" \")))","v":" "}]
[]
["Item",null,null,"(a)",null,"In soft material","m²",null," ",null,null,{"v":3.5,"d":"3.50"},{"$f":"IF(ISNUMBER(H86),L86*H86,IF(ISNUMBER(J86),J86,IF(J86=\"RATE ONLY\",LOWER(\"RATE ONLY\"),\" \")))","v":" "}]
[]
["Item",null,null,"(b)",null,"In boulder material class A and B","m²",null," ",null,null,{"v":6.5,"d":"6.50"},{"$f":"IF(ISNUMBER(H88),L88*H88,IF(ISNUMBER(J88),J88,IF(J88=\"RATE ONLY\",LOWER(\"RATE ONLY\"),\" \")))","v":" "}]
[]
["Item",null,null,"(c)",null,"In hard material","m²",{"$nulls":4},{"v":6.5,"d":"6.50"},{"$f":"IF(ISNUMBER(H90),L90*H90,IF(ISNUMBER(J90),J90,IF(J90=\"RATE ONLY\",LOWER(\"RATE ONLY\"),\" \")))","v":" "}]
[]
["Item",null,null,"(d)",null,"In soft material using labour enhanced methods of construction","m²",{"$nulls":5}," "]
["IHDR2",null,"C4.2.12.2",null,null,"Designated excavations","m²",{"$nulls":5},{"$f":"IF(ISNUMBER(H93),L93*H93,IF(ISNUMBER(J93),J93,IF(J93=\"RATE ONLY\",LOWER(\"RATE ONLY\"),\" \")))","v":" "}]
[]
["IHDR2",null,"C4.2.12.3",null,null,"Designated excavations using labour enhanced methods of construction","m²",{"$nulls":5},{"$f":"IF(ISNUMBER(H95),L95*H95,IF(ISNUMBER(J95),J95,IF(J95=\"RATE ONLY\",LOWER(\"RATE ONLY\"),\" \")))","v":" "}]
[]
[]
[]
[]
[]
[]
["#BillEnd#"]
["#BillEnd#","TOTAL CARRIED FORWARD TO SUMMARY",{"$nulls":10},{"$f":"SUBTOTAL(9,M$7:M96)","v":0}]
["#BillEnd#"]

{"sheet":"4.3","index":15,"n_rows":228,"n_cols":10,"rows_kept":228}
["#BillSheet#"]
["#BillSheet#","C4.3","EXISTING ROAD MATERIALS",{"$nulls":3},"\n",null,null,"SCHEDULE A"]
["#BillSheet#"]
["ColHDR"]
["ColHDR","ITEM",{"$nulls":3},"DESCRIPTION","UNIT","QTY","RATE","AMT"]
["ColHDR"]
[{"$nulls":5},"EXISTING ROAD MATERIALS"]
["IHDR1","C4.3.1",{"$nulls":3},"Additional material investigations:"]
[]
["Item",null,"C4.3.1.1",null,null,"Cost of additional trial pits and/or drilling and laboratory testing","prov sum"]
["Item3",null,"C4.3.1.2",null,null,"Handling costs and profit in respect of item C4.3.1.1","%"]
["IHDR1","C4.3.2",{"$nulls":3},"Cleaning the existing road surface:"]
[]
["Item",null,"C4.3.2.1",null,null,"Cost to clean the road surface","prov sum"]
["Item",null,"C4.3.2.2",null,null,"Handling costs and profit in respect of item C4.3.2.1","%"]
["IHDR1","C4.3.3",{"$nulls":3},"Removal of bituminous seal surfacing (thickness not exceeding 30 mm)","m²"]
[]
["IHDR1","C4.3.4",{"$nulls":3},"Saw-cutting existing materials within the following average depth ranges:"]
[]
["IHDR2",null,"C4.3.4.1",null,null,"Asphalt:"]
[]
["Item",null,null,"(a)",null,"Up to 50 mm","m"]
["Item",null,null,"(b)",null,"Exceeding 50 mm and up to 100 mm","m",200,null,{"$f":"IF(ISNUMBER(H23),H23*I23,IF(H23=\"-\",\"rate only\",\" \"))","v":0}]
[]
["Item",null,null,"(c)",null,"Etc, in 50 mm increments","m",200,null,{"$f":"IF(ISNUMBER(H25),H25*I25,IF(H25=\"-\",\"rate only\",\" \"))","v":0}]
[]
["IHDR2",null,"C4.3.4.2",null,null,"Crushed stone and gravel material:"]
[]
["Item",null,null,"(a)",null,"Up to 100 mm","m"]
["Item",null,null,"(b)",null,"Exceeding 100 mm and up to 200 mm","m"]
["Item",null,null,"(c)",null,"Etc, in 100 mm increments"]
["IHDR2",null,"C4.3.4.3",null,null,"Cemented material:"]
[]
["Item",null,null,"(a)",null,"Up to 100 mm","m"]
["Item",null,null,"(b)",null,"Exceeding 100 mm and up to 200 mm","m"]
["Item",null,null,"(c)",null,"Etc, in 100 mm increments"]
["IHDR2",null,"C4.3.4.4",null,null,"Concrete material:"]
[]
["Item",null,null,"(a)",null,"Up to 50 mm","m"]
["Item",null,null,"(b)",null,"Exceeding 50 mm and up to 100 mm","m"]
["Item",null,null,"(c)",null,"Etc, in 50 mm increments"]
["IHDR1","C4.3.5",{"$nulls":3},"Providing the milling machine on the site:"]
[]
["Item",null,"C4.3.5.1",null,null,"Small milling machine with a cutting width of 1,2 m or smaller","No."]
["Item",null,"C4.3.5.2",null,null,"Large milling machine with a cutting width exceeding 1,2 m","No.",2,null,{"$f":"IF(ISNUMBER(H45),H45*I45,IF(H45=\"-\",\"rate only\",\" \"))","v":0}]
[]
["IHDR1","C4.3.6",{"$nulls":3},"Milling and removal of existing asphalt layers with an average milling depth (Contractor takes ownership):"]
[]
["Item",null,"C4.3.6.1",null,null,"Not exceeding 50 mm","m³"]
["Item",null,"C4.3.6.2",null,null,"Exceeding 50 mm but not exceeding 100 mm","m³",45000,null,{"$f":"IF(ISNUMBER(H50),H50*I50,IF(H50=\"-\",\"rate only\",\" \"))","v":0}]
[]
["IHDR2",null,"C4.3.6.3",null,null,"Exceeding 100 mm","m³",8000,null,{"$f":"IF(ISNUMBER(H52),H52*I52,IF(H52=\"-\",\"rate only\",\" \"))","v":0}]
[]
["IHDR1","C4.3.7",{"$nulls":3},"Milling and removal of existing asphalt layers with an average milling depth (Employer takes ownership):"]
[]
[]
["Item",null,"C4.3.7.1",null,null,"Not exceeding 50 mm","m³","-",null,{"$f":"IF(ISNUMBER(H57),H57*I57,IF(H57=\"-\",\"rate only\",\" \"))","v":"rate only"}]
[]
["Item",null,"C4.3.7.2",null,null,"Exceeding 50 mm but not exceeding 100 mm","m³"]
["Item",null,"C4.3.7.3",null,null,"Exceeding 100 mm","m³"]
["IHDR1","C4.3.10",{"$nulls":3},"Excavating material by using labour enhanced methods of construction:"]
[]
["Item",null,"C4.3.10.1",null,null,"Asphalt material","m³"]
["Item",null,"C4.3.10.2",null,null,"Crushed stone and macadam materials","m³"]
["Item",null,"C4.3.10.3",null,null,"Cemented material","m³"]
["Item",null,"C4.3.10.4",null,null,"Natural gravel and sand materials","m³"]
["IHDR1","C4.3.11",{"$nulls":3},"Breaking down a stabilised layer by using conventional road construction equipment","m³"]
[]
["IHDR1","C4.3.12",{"$nulls":3},"Removing of existing concrete material within the following average depth ranges:"]
[]
["IHDR2",null,"C4.3.12.1",null,null,"The break-up method:"]
[]
["Item",null,null,"(a)",null,"Not exceeding 150 mm","m³"]
["Item",null,null,"(b)",null,"Exceeding 150 mm but not exceeding 250 mm","m³"]
["IHDR2",null,"C4.3.12.2",null,null,"The break-up method using labour enhanced methods of construction:"]
[]
["Item",null,null,"(a)",null,"Not exceeding 75 mm","m³"]
["Item",null,null,"(b)",null,"Exceeding 75 mm but not exceeding 200 mm","m³"]
["IHDR2",null,"C4.3.12.3",null,null,"The lift-out method:"]
[]
["Item",null,null,"(a)",null,"Not exceeding 150 mm","m³"]
["Item",null,null,"(b)",null,"Exceeding 150 mm but not exceeding 250 mm","m³"]
["IHDR1","C4.3.13",{"$nulls":3},"Lifting of existing paving blocks (specify the type or size and thickness):"]
[]
["Item",null,"C4.3.13.1",null,null,"Using construction equipment","m²"]
["Item",null,"C4.3.13.2",null,null,"Using labour enhanced methods of construction","m²"]
["IHDR1","C4.3.14",{"$nulls":3},"Removing of existing road edging and services structures:"]
[]
["IHDR2",null,"C4.3.14.1",null,null,"Removing of existing road edging using construction equipment:"]
[]
["IHDR3",null,null,"(a)",null,"Kerbing and edge beams:"]
[]
["Item1",{"$nulls":3},"(i)","In situ concrete kerbing and edge beams","m³"]
["Item1",{"$nulls":3},"(ii)","Precast concrete kerbing (specify type or figure)","m"]
["Item1",{"$nulls":3},"(iii)","Precast concrete kerbing (specify type or figure) and situ concrete channel (specify dimensions)","m"]
["IHDR3",null,null,"(b)",null,"Kerb inlets","No."]
[]
["IHDR3",null,null,"(c)",null,"Grid inlets","No."]
[]
["IHDR3",null,null,"(d)",null,"Etc., for other services structures","No."]
[]
["IHDR2","C4.3.14.2","C4.3.14.2",null,null,"Removing of existing road edging using labour enhanced methods of construction:"]
[]
["IHDR3",null,null,"(a)",null,"Kerbing and edge beams:"]
[]
["Item1",{"$nulls":3},"(i)","In situ concrete kerbing and edge beams","m³"]
["Item1",{"$nulls":3},"(ii)","Precast concrete kerbing (specify type or figure)","m"]
["Item1",{"$nulls":3},"(iii)","Precast concrete kerbing (specify type or figure) and situ concrete channel (specify dimensions)","m"]
["IHDR3",null,null,"(b)",null,"Kerb inlets","No."]
[]
["IHDR3",null,null,"(c)",null,"Grid inlets","No."]
[]
["IHDR3",null,null,"(d)",null,"Etc., for other services structures","No."]
[]
["IHDR1","C4.3.15",{"$nulls":3},"Stockpiling of road layer materials:"]
[]
["Item",null,"C4.3.15.1",null,null,"Asphalt material","m³",53000,null,{"$f":"IF(ISNUMBER(H117),H117*I117,IF(H117=\"-\",\"rate only\",\" \"))","v":0}]
[]
["Item",null,"C4.3.15.2",null,null,"Crushed stone material","m³"]
["Item",null,"C4.3.15.3",null,null,"Cemented material","m³"]
["Item",null,"C4.3.15.4",null,null,"Natural gravel material","m³"]
["Item",null,"C4.3.15.5",null,null,"Concrete pavements","m³"]
["IHDR1","C4.3/ C4.4.4",{"$nulls":3},"Cementitious stabilising agents"]
[]
["Item",null,"C4.4.4.1",null,null,"Cement","ton",5,null,{"$f":"IF(ISNUMBER(H125),H125*I125,IF(H125=\"-\",\"rate only\",\" \"))","v":0}]
[]
["Item",null,"C4.3.16.2",null,null,"Precast concrete kerbing (specify type or figure and length)","No."]
["Item",null,"C4.3.16.3",null,null,"Precast kerb inlets","No."]
["Item",null,"C4.3.16.4",null,null,"Precast manholes","No."]
["IHDR1","C4.3/ C5.4.2",{"$nulls":3},"Chemical stabilisation"]
[]
["Item",null,"C5.4.2.1",null,null,"Chemical stabilisation (150mm layer thickness) of pavement layers ","m³",100,null,{"$f":"IF(ISNUMBER(H132),H132*I132,IF(H132=\"-\",\"rate only\",\" \"))","v":0}]
[]
["Item",null,"C4.3.17.2",null,null,"Crushed stone, macadam, gravel and sand material","m³"]
["Item",null,"C4.3.17.3",null,null,"Cemented material","m³"]
["Item",null,"C4.3.17.4",null,null,"Concrete material","m³"]
["IHDR1","C4.3/ C5.4.5",{"$nulls":3},"Cementitious stabilisation agents for pavement layers"]
[]
["Item",null,"C5.4.5.1",null,null,"Addition of cementitious stabilisation agents (specify agent separately) for pavement layers"]
["Item",null,null,"(a)",null,"Cement (for pavement layer)","ton",5,null,{"$f":"IF(ISNUMBER(H140),H140*I140,IF(H140=\"-\",\"rate only\",\" \"))","v":0}]
[]
["Item",null,"C4.3.18.3",null,null,"Cemented material","m³"]
["Item",null,"C4.3.18.4",null,null,"Concrete material","m³"]
["IHDR1","C4.3.17",{"$nulls":3},"Excavate non-compliant or excess pavement layer material to spoil in sites designated by the Employer, material consisting of:"]
[]
["Item",null,"C4.3.17.1",null,null,"Asphalt material","m³",100,null,{"$f":"IF(ISNUMBER(H146),H146*I146,IF(H146=\"-\",\"rate only\",\" \"))","v":0}]
[]
["Item",null,"C4.3.19.2",null,null,"Precast and in situ concrete kerbing, edge beams and channels at precast kerbing","m³"]
["Item",null,"C4.3.19.3",null,null,"Kerb and grid inlets, and other services structures","No."]
["IHDR1","C4.3.20","C4.3.20",null,null,"Spoiling of paving blocks and road edging in spoil sites designated by the Contractor:"]
[]
["Item",null,"C4.3.20.1",null,null,"Paving blocks","m³"]
["Item",null,"C4.3.20.2",null,null,"Precast and in situ concrete kerbing, edge beams and channels at precast kerbing","m³"]
["Item",null,"C4.3.20.3",null,null,"Kerb and grid inlets, and other services structures","No."]
["IHDR1","C4.3/C1.6",{"$nulls":3},"Clearing and Grubbing"]
[]
["IHDR1"]
["PB"]
["PB","CARRIED FORWARD",{"$nulls":7},{"$f":"SUM(J18:J157)","v":{"v":0,"d":"0.00"}}]
["PB"]
["PB"]
["PB","BROUGHT FORWARD",{"$nulls":7},{"$f":"J159","v":{"v":0,"d":"0.00"}}]
["PB"]
[]
[null,"C1.6.1",{"$nulls":3},"Clearing:"]
[]
["Item",null,"C1.6.1.1",null,null,"Clearing with machines and some hand labour where necessary","ha",5.2,null,{"$f":"IF(ISNUMBER(H167),H167*I167,IF(H167=\"-\",\"rate only\",\" \"))","v":0}]
[]
["IHDR1","C1.6.2",{"$nulls":3},"Grubbing:"]
[]
["Item",null,"C1.6.2.1",null,null,"Grubbing with machines and some hand labour where necessary","ha",5.2,null,{"$f":"IF(ISNUMBER(H171),H171*I171,IF(H171=\"-\",\"rate only\",\" \"))","v":0}]
{"$rows_empty":54}
["#BillEnd#"]
["#BillEnd#","TOTAL CARRIED FORWARD TO SUMMARY",{"$nulls":7},{"$f":"SUM(J161:J225)","v":{"v":0,"d":"0.00"}}]
["#BillEnd#"]

{"sheet":"4.4","index":16,"n_rows":135,"n_cols":13,"rows_kept":135,"hidden":true}
["#BillSheet#"]
["#BillSheet#","C4.4","COMMERCIAL MATERIALS",{"$nulls":3},"\n",null,null,"SCHEDULE A",{"$f":"SUBTOTAL(9,M$7:M1008)","v":0},null,{"$f":"J2","v":"SCHEDULE A"}]
["#BillSheet#"]
["ColHDR"]
["ColHDR","ITEM",{"$nulls":3},"DESCRIPTION","UNIT","QTY","RATE","AMT",null,"RATE","AMOUNT"]
["ColHDR"]
[{"$nulls":5},"COMMERCIAL MATERIALS"]
["IHDR1","C4.4.1",{"$nulls":3},"Commercial materials identified by the Employer from commercial, private or other non-commercial suppliers (specify the source/s):",{"$nulls":6},{"$f":"IF(ISNUMBER(H8),L8*H8,IF(ISNUMBER(J8),J8,IF(J8=\"RATE ONLY\",LOWER(\"RATE ONLY\"),\" \")))","v":" "}]
[]
["IHDR2",null,"C4.4.1.1",null,null,"Pavement layer material:",{"$nulls":6},{"$f":"IF(ISNUMBER(H10),L10*H10,IF(ISNUMBER(J10),J10,IF(J10=\"RATE ONLY\",LOWER(\"RATE ONLY\"),\" \")))","v":" "}]
[]
["Item",null,null,"(a)",null,"Type G1 material","m³",{"$nulls":5},{"$f":"IF(ISNUMBER(H12),L12*H12,IF(ISNUMBER(J12),J12,IF(J12=\"RATE ONLY\",LOWER(\"RATE ONLY\"),\" \")))","v":" "}]
["Item",null,null,"(b)",null,"Type G2 material","m³",{"$nulls":5}," "]
["Item",null,null,"(c)",null,"Type G3 material","m³",{"$nulls":5}," "]
["Item",null,null,"(d)",null,"Type G4A material","m³",{"$nulls":5}," "]
["Item",null,null,"(e)",null,"Type G4B material","m³",{"$nulls":5}," "]
["Item",null,null,"(f)",null,"Type G5A material","m³",{"$nulls":5}," "]
["Item",null,null,"(g)",null,"Type G5B material","m³",{"$nulls":5}," "]
["Item",null,null,"(h)",null,"Type G6 material","m³",{"$nulls":5}," "]
["Item",null,null,"(i)",null,"Type G7 material","m³",{"$nulls":5}," "]
["Item",null,null,"(j)",null,"Type G8 material","m³",{"$nulls":5}," "]
["Item",null,null,"(k)",null,"Type G9 material","m³",{"$nulls":5}," "]
["Item",null,null,"(l)",null,"Etc, for other Type G3 to G9 materials","m³",{"$nulls":5}," "]
["Item",null,null,"(m)",null,"Sand for the base and shoulder layers","m³",{"$nulls":5}," "]
["Item",null,null,"(n)",null,"Sand for a subbase layer","m³",{"$nulls":5}," "]
["Item",null,null,"(o)",null,"Sand for a selected layer","m³",{"$nulls":5}," "]
["Item",null,null,"(p)",null,"Natural or crushed gravel material for an unsealed shoulder layer","m³",{"$nulls":5}," "]
["Item",null,null,"(q)",null,"Natural or crushed gravel material for the wearing course of an unsealed road","m³",{"$nulls":5}," "]
["IHDR2",null,"C4.4.1.2",null,null,"Macadam material:",{"$nulls":6},{"$f":"IF(ISNUMBER(H29),L29*H29,IF(ISNUMBER(J29),J29,IF(J29=\"RATE ONLY\",LOWER(\"RATE ONLY\"),\" \")))","v":" "}]
[]
["Item",null,null,"(a)",null,"Coarse aggregate","m³",{"$nulls":5}," "]
["Item",null,null,"(b)",null,"Fine aggregate","m³",{"$nulls":5}," "]
["IHDR2",null,"C4.4.1.3",null,null,"Drainage blanket layer material","m³",{"$nulls":5},{"$f":"IF(ISNUMBER(H33),L33*H33,IF(ISNUMBER(J33),J33,IF(J33=\"RATE ONLY\",LOWER(\"RATE ONLY\"),\" \")))","v":" "}]
[]
["IHDR2",null,"C4.4.1.4",null,null,"Soil cement material (pre-blended by the supplier)","m³",{"$nulls":5},{"$f":"IF(ISNUMBER(H35),L35*H35,IF(ISNUMBER(J35),J35,IF(J35=\"RATE ONLY\",LOWER(\"RATE ONLY\"),\" \")))","v":" "}]
[]
["IHDR2",null,"C4.4.1.5",null,null,"Fill material in the earthworks:",{"$nulls":6},{"$f":"IF(ISNUMBER(H37),L37*H37,IF(ISNUMBER(J37),J37,IF(J37=\"RATE ONLY\",LOWER(\"RATE ONLY\"),\" \")))","v":" "}]
[]
["Item",null,null,"(a)",null,"Normal or coarse fill","m³",{"$nulls":5}," "]
["Item",null,null,"(b)",null,"Rock fill","m³",{"$nulls":5}," "]
["Item",null,null,"(c)",null,"Sand","m³",{"$nulls":5}," "]
["IHDR2",null,"C4.4.1.6",null,null,"Pioneer material","m³",{"$nulls":5},{"$f":"IF(ISNUMBER(H42),L42*H42,IF(ISNUMBER(J42),J42,IF(J42=\"RATE ONLY\",LOWER(\"RATE ONLY\"),\" \")))","v":" "}]
[]
["IHDR1","C4.4.2",{"$nulls":3},"Commercial materials identified by the Contractor from commercial, private or other non-commercial suppliers:",{"$nulls":6},{"$f":"IF(ISNUMBER(H44),L44*H44,IF(ISNUMBER(J44),J44,IF(J44=\"RATE ONLY\",LOWER(\"RATE ONLY\"),\" \")))","v":" "}]
[]
["IHDR2",null,"C4.4.2.1",null,null,"Pavement layer material:",{"$nulls":6},{"$f":"IF(ISNUMBER(H46),L46*H46,IF(ISNUMBER(J46),J46,IF(J46=\"RATE ONLY\",LOWER(\"RATE ONLY\"),\" \")))","v":" "}]
[]
["Item",null,null,"(a)",null,"Type G1 material","m³",{"$nulls":4},{"v":750,"d":"750.00"},{"$f":"IF(ISNUMBER(H48),L48*H48,IF(ISNUMBER(J48),J48,IF(J48=\"RATE ONLY\",LOWER(\"RATE ONLY\"),\" \")))","v":" "}]
[]
["Item",null,null,"(b)",null,"Type G2 material","m³",{"$nulls":5},{"$f":"IF(ISNUMBER(H50),L50*H50,IF(ISNUMBER(J50),J50,IF(J50=\"RATE ONLY\",LOWER(\"RATE ONLY\"),\" \")))","v":" "}]
["Item",null,null,"(c)",null,"Type G3 material","m³",{"$nulls":5}," "]
["Item",null,null,"(d)",null,"Type G4A material","m³",{"$nulls":5}," "]
["Item",null,null,"(e)",null,"Type G4B material","m³",{"$nulls":5}," "]
["Item",null,null,"(f)",null,"Type G5A material","m³",{"$nulls":5}," "]
["Item",null,null,"(g)",null,"Type G5B material","m³",{"$nulls":5}," "]
["Item",null,null,"(h)",null,"Type G6 material","m³",{"$nulls":5}," "]
["Item",null,null,"(i)",null,"Type G7 material","m³",{"$nulls":5}," "]
["Item",null,null,"(j)",null,"Type G8 material","m³",{"$nulls":5}," "]
["Item",null,null,"(k)",null,"Type G9 material","m³",{"$nulls":5}," "]
["Item",null,null,"(l)",null,"Etc, for other Type G3 to G9 materials","m³",{"$nulls":5}," "]
["Item",null,null,"(m)",null,"Sand for the base and shoulder layers","m³",{"$nulls":5}," "]
["Item",null,null,"(n)",null,"Sand for a subbase layer","m³",{"$nulls":5}," "]
["Item",null,null,"(o)",null,"Sand for a selected layer","m³",{"$nulls":5}," "]
["Item",null,null,"(p)",null,"Natural or crushed gravel material for an unsealed shoulder layer","m³",{"$nulls":5}," "]
["Item",null,null,"(q)",null,"Natural or crushed gravel material for the wearing course of an unsealed road","m³",{"$nulls":5}," "]
["IHDR2",null,"C4.4.2.2",null,null,"Macadam material:",{"$nulls":6},{"$f":"IF(ISNUMBER(H66),L66*H66,IF(ISNUMBER(J66),J66,IF(J66=\"RATE ONLY\",LOWER(\"RATE ONLY\"),\" \")))","v":" "}]
[]
["Item",null,null,"(a)",null,"Coarse aggregate","m³",{"$nulls":5}," "]
["Item",null,null,"(b)",null,"Fine aggregate","m³",{"$nulls":5}," "]
["IHDR2",null,"C4.4.2.3",null,null,"Drainage blanket layer material","m³",{"$nulls":5},{"$f":"IF(ISNUMBER(H70),L70*H70,IF(ISNUMBER(J70),J70,IF(J70=\"RATE ONLY\",LOWER(\"RATE ONLY\"),\" \")))","v":" "}]
[]
["IHDR2",null,"C4.4.2.4",null,null,"Soil cement material (pre-blended by the supplier)","m³",{"$nulls":5},{"$f":"IF(ISNUMBER(H72),L72*H72,IF(ISNUMBER(J72),J72,IF(J72=\"RATE ONLY\",LOWER(\"RATE ONLY\"),\" \")))","v":" "}]
[]
["IHDR2",null,"C4.4.2.5",null,null,"Fill material in the earthworks:",{"$nulls":6},{"$f":"IF(ISNUMBER(H74),L74*H74,IF(ISNUMBER(J74),J74,IF(J74=\"RATE ONLY\",LOWER(\"RATE ONLY\"),\" \")))","v":" "}]
[]
["Item",null,null,"(a)",null,"Normal or coarse fill","m³",{"$nulls":5}," "]
["Item",null,null,"(b)",null,"Rock fill","m³",{"$nulls":5}," "]
["Item",null,null,"(c)",null,"Sand","m³",{"$nulls":5}," "]
["IHDR2",null,"C4.4.2.6",null,null,"Pioneer material","m³",{"$nulls":5},{"$f":"IF(ISNUMBER(H79),L79*H79,IF(ISNUMBER(J79),J79,IF(J79=\"RATE ONLY\",LOWER(\"RATE ONLY\"),\" \")))","v":" "}]
[]
["IHDR1","C4.4.3",{"$nulls":3},"Cost to procure commercial materials identified by the Employer from private or non-commercial sources:",{"$nulls":6},{"$f":"IF(ISNUMBER(H81),L81*H81,IF(ISNUMBER(J81),J81,IF(J81=\"RATE ONLY\",LOWER(\"RATE ONLY\"),\" \")))","v":" "}]
[]
["Item",null,"C4.4.3.1",null,null,"Cost of procuring","prov sum",{"$nulls":5}," "]
["Item",null,"C4.4.3.2",null,null,"Handling costs and profit in respect of item C4.4.3.1","%",{"$nulls":5}," "]
["IHDR1","C4.4.4",{"$nulls":3},"Cementitious stabilising agents:",{"$nulls":6},{"$f":"IF(ISNUMBER(H85),L85*H85,IF(ISNUMBER(J85),J85,IF(J85=\"RATE ONLY\",LOWER(\"RATE ONLY\"),\" \")))","v":" "}]
[]
["Item",null,"C4.4.4.1",null,null,"Cement","t",{"$nulls":4},{"v":1700,"d":"1,700.00"},{"$f":"IF(ISNUMBER(H87),L87*H87,IF(ISNUMBER(J87),J87,IF(J87=\"RATE ONLY\",LOWER(\"RATE ONLY\"),\" \")))","v":" "}]
[]
["Item",null,"C4.4.4.2",null,null,"Road lime","t",{"$nulls":4},{"v":3000,"d":"3,000.00"},{"$f":"IF(ISNUMBER(H89),L89*H89,IF(ISNUMBER(J89),J89,IF(J89=\"RATE ONLY\",LOWER(\"RATE ONLY\"),\" \")))","v":" "}]
[]
["Item",null,"C4.4.4.3",null,null,"Etc, for other agents","t",{"$nulls":5},{"$f":"IF(ISNUMBER(H91),L91*H91,IF(ISNUMBER(J91),J91,IF(J91=\"RATE ONLY\",LOWER(\"RATE ONLY\"),\" \")))","v":" "}]
["IHDR1","C4.4.5",{"$nulls":3},"Bituminous stabilising agents:",{"$nulls":6},{"$f":"IF(ISNUMBER(H92),L92*H92,IF(ISNUMBER(J92),J92,IF(J92=\"RATE ONLY\",LOWER(\"RATE ONLY\"),\" \")))","v":" "}]
[]
["Item",null,"C4.4.5.1",null,null,"Penetration grade bitumen (specify grade)","t",{"$nulls":5}," "]
["Item",null,"C4.4.5.2",null,null,"Emulsion stable grade (specify type)","t",{"$nulls":5}," "]
["IHDR1","C4.4.6",{"$nulls":3},"Fillers for bituminous stabilisation (specify filler types separately)","t",{"$nulls":5},{"$f":"IF(ISNUMBER(H96),L96*H96,IF(ISNUMBER(J96),J96,IF(J96=\"RATE ONLY\",LOWER(\"RATE ONLY\"),\" \")))","v":" "}]
[]
["IHDR1","C4.4.7",{"$nulls":3},"Sampling and material testing by a commercial laboratory for the stabilisation designs:",{"$nulls":6},{"$f":"IF(ISNUMBER(H98),L98*H98,IF(ISNUMBER(J98),J98,IF(J98=\"RATE ONLY\",LOWER(\"RATE ONLY\"),\" \")))","v":" "}]
[]
["Item",null,"C4.4.7.1",null,null,"Cost of sampling and material testing","prov sum",null,null,{"$f":"+I100","v":0},null,{"v":50000,"d":"50,000.00"},{"$f":"IF(ISNUMBER(H100),L100*H100,IF(ISNUMBER(J100),J100,IF(J100=\"RATE ONLY\",LOWER(\"RATE ONLY\"),\" \")))","v":0}]
[]
["Item3",null,"C4.4.7.2",null,null,"Handling costs and profit in respect of item C4.4.7.1","%",{"$nulls":4},{"v":0.1,"d":"10%"},{"$f":"IF(ISNUMBER(H102),L102*H102,IF(ISNUMBER(J102),J102,IF(J102=\"RATE ONLY\",LOWER(\"RATE ONLY\"),\" \")))","v":" "}]
{"$rows_empty":30}
["#BillEnd#"]
["#BillEnd#","TOTAL CARRIED FORWARD TO SUMMARY",{"$nulls":10},{"$f":"SUBTOTAL(9,M$7:M103)","v":0}]
["#BillEnd#"]

{"sheet":"4.5","index":17,"n_rows":21,"n_cols":13,"rows_kept":21,"hidden":true}
["#BillSheet#"]
["#BillSheet#","C4.5","ALTERNATIVE MATERIALS",{"$nulls":3},"\n",null,null,"SCHEDULE A",{"$f":"SUBTOTAL(9,M$7:M902)","v":0},null,{"$f":"J2","v":"SCHEDULE A"}]
["#BillSheet#"]
["ColHDR"]
["ColHDR","ITEM",{"$nulls":3},"DESCRIPTION","UNIT","QTY","RATE","AMT",null,"RATE","AMOUNT"]
["ColHDR"]
[{"$nulls":5},"ALTERNATIVE MATERIALS"]
["IHDR1","C4.5.1",{"$nulls":3},"Additional material investigations:",{"$nulls":6},{"$f":"IF(ISNUMBER(H8),L8*H8,IF(ISNUMBER(J8),J8,IF(J8=\"RATE ONLY\",LOWER(\"RATE ONLY\"),\" \")))","v":" "}]
["Item",null,"C4.5.1.1",null,null,"Cost of sampling and laboratory testing","prov sum",{"$nulls":5}," "]
["Item",null,"C4.5.1.2",null,null,"Handling costs and profit in respect of item C4.5.1.1","%",{"$nulls":5}," "]
["IHDR1","C4.5.2",{"$nulls":3},"Removing unwanted material from alternative materials identified by the Employer:",{"$nulls":6}," "]
["Item",null,"C4.5.2.1",null,null,"Contaminant material","prov sum",{"$nulls":5}," "]
["Item",null,"C4.5.2.2",null,null,"Handling costs and profit in respect of item C4.5.2.1","%",{"$nulls":5}," "]
["Item",null,"C4.5.2.3",null,null,"Hazardous material","prov sum",{"$nulls":5}," "]
["Item",null,"C4.5.2.4",null,null,"Handling costs and profit in respect of item C4.5.2.3","%",{"$nulls":5}," "]
["IHDR1","C4.5.3",{"$nulls":3},"Cost to procure alternative materials identified by the Employer:",{"$nulls":6}," "]
["Item",null,"C4.5.3.1",null,null,"Cost of procuring","prov sum",{"$nulls":5}," "]
["Item",null,"C4.5.3.2",null,null,"Handling costs and profit in respect of item C4.5.3.1","%",{"$nulls":5}," "]
["#BillEnd#"]
["#BillEnd#","TOTAL CARRIED FORWARD TO SUMMARY",{"$nulls":10},{"$f":"SUBTOTAL(9,M$10:M18)","v":0}]
["#BillEnd#"]

{"sheet":"5.1","index":18,"n_rows":157,"n_cols":14,"rows_kept":157,"hidden":true}
["#BillSheet#"]
["#BillSheet#","C5.1 ","ROADBED",{"$nulls":3},"\n",null,null,"SCHEDULE A ",{"$f":"SUBTOTAL(9,M$7:M1129)","v":{"v":675000,"d":"675,000.00"}},null,{"$f":"J2","v":"SCHEDULE A "}]
["#BillSheet#"]
["ColHDR"]
["ColHDR","ITEM",{"$nulls":3},"DESCRIPTION","UNIT","QTY","RATE","AMT",null,"RATE","AMOUNT"]
["ColHDR"]
[{"$nulls":5},"ROADBED"]
["IHDR1","C5.1.1",{"$nulls":3},"Roadbed construction and compaction:",{"$nulls":6},{"$f":"IF(ISNUMBER(H8),L8*H8,IF(ISNUMBER(J8),J8,IF(J8=\"RATE ONLY\",LOWER(\"RATE ONLY\"),\" \")))","v":" "}]
[]
["Item",null,"C5.1.1.1",null,null,"Compaction of in-situ material to 90 % of MDD","m³",{"$nulls":5},{"$f":"IF(ISNUMBER(H10),L10*H10,IF(ISNUMBER(J10),J10,IF(J10=\"RATE ONLY\",LOWER(\"RATE ONLY\"),\" \")))","v":" "}]
["Item",null,"C5.1.1.2",null,null,"Compaction of in-situ material to 93 % of MDD","m³",22000,{"$nulls":3},{"v":25,"d":"25.00"},{"$f":"IF(ISNUMBER(H11),L11*H11,IF(ISNUMBER(J11),J11,IF(J11=\"RATE ONLY\",LOWER(\"RATE ONLY\"),\" \")))","v":{"v":550000,"d":"550,000.00"}}]
[]
["Item",null,"C5.1.1.3",null,null,"Compaction of imported material to 90 % of MDD","m³",{"$nulls":5}," "]
["Item",null,"C5.1.1.4",null,null,"Compaction of imported material to 93 % of MDD","m³",5000,{"$nulls":3},{"v":25,"d":"25.00"},{"$f":"IF(ISNUMBER(H14),L14*H14,IF(ISNUMBER(J14),J14,IF(J14=\"RATE ONLY\",LOWER(\"RATE ONLY\"),\" \")))","v":{"v":125000,"d":"125,000.00"}}]
[]
["Item",null,"C5.1.1.5",null,null,"Compaction of in-situ sand roadbed to 95 % of MDD","m³",{"$nulls":5}," "]
["Item",null,"C5.1.1.6",null,null,"Compaction of in-situ sand roadbed to 100 % of MDD","m³",{"$nulls":5}," "]
["IHDR1","C5.1.2",{"$nulls":3},"Excavate material to spoil from roadbed construction:",{"$nulls":6},{"$f":"IF(ISNUMBER(H18),L18*H18,IF(ISNUMBER(J18),J18,IF(J18=\"RATE ONLY\",LOWER(\"RATE ONLY\"),\" \")))","v":" "}]
[]
["IHDR2",null,"C5.1.2.1",null,null,"Excavate material to spoil from roadbed construction, material obtained from:",{"$nulls":6},{"$f":"IF(ISNUMBER(H20),L20*H20,IF(ISNUMBER(J20),J20,IF(J20=\"RATE ONLY\",LOWER(\"RATE ONLY\"),\" \")))","v":" "}]
[]
["Item",null,null,"(a)",null,"Soft excavation","m³",{"$nulls":5}," "]
["Item",null,null,"(b)",null,"Boulder excavation Class A","m³",{"$nulls":5}," "]
["Item",null,null,"(c)",null,"Boulder excavation Class B","m³",{"$nulls":5}," "]
["Item",null,null,"(d)",null,"Hard excavation (other than by blasting)","m³",{"$nulls":5}," "]
["Item",null,null,"(e)",null,"Hard excavation (by blasting)","m³",{"$nulls":5}," "]
["IHDR2",null,"C5.1.2.2",null,null,"Excavate material to spoil from roadbed construction, using labour enhancement, material obtained from:",{"$nulls":6},{"$f":"IF(ISNUMBER(H27),L27*H27,IF(ISNUMBER(J27),J27,IF(J27=\"RATE ONLY\",LOWER(\"RATE ONLY\"),\" \")))","v":" "}]
[]
["Item",null,null,"(a)",null,"Soft excavation","m³",{"$nulls":5}," "]
["Item",null,null,"(b)",null,"Intermediate excavation","m³",{"$nulls":5}," "]
["IHDR1","C5.1.3",{"$nulls":3},"Excavate material to spoil sites designated by the Contractor:",{"$nulls":6},{"$f":"IF(ISNUMBER(H31),L31*H31,IF(ISNUMBER(J31),J31,IF(J31=\"RATE ONLY\",LOWER(\"RATE ONLY\"),\" \")))","v":" "}]
[]
["IHDR2",null,"C5.1.3.1",null,null,"Excavate material to spoil from roadbed construction, material obtained from:",{"$nulls":6},{"$f":"IF(ISNUMBER(H33),L33*H33,IF(ISNUMBER(J33),J33,IF(J33=\"RATE ONLY\",LOWER(\"RATE ONLY\"),\" \")))","v":" "}]
[]
["Item",null,null,"(a)",null,"Soft excavation","m³",{"$nulls":5}," "]
["Item",null,null,"(b)",null,"Boulder excavation Class A","m³",{"$nulls":5}," "]
["Item",null,null,"(c)",null,"Boulder excavation Class B","m³",{"$nulls":5}," "]
["Item",null,null,"(d)",null,"Hard excavation (other than by blasting)","m³",{"$nulls":5}," "]
["Item",null,null,"(e)",null,"Hard excavation (by blasting)","m³",{"$nulls":5}," "]
["IHDR2",null,"C5.1.3.2",null,null,"Excavate material to spoil from roadbed construction, using labour enhancement, material obtained from:",{"$nulls":6},{"$f":"IF(ISNUMBER(H40),L40*H40,IF(ISNUMBER(J40),J40,IF(J40=\"RATE ONLY\",LOWER(\"RATE ONLY\"),\" \")))","v":" "}]
[]
["Item",null,null,"(a)",null,"Soft excavation","m³",{"$nulls":5}," "]
["Item",null,null,"(b)",null,"Intermediate excavation","m³",{"$nulls":5}," "]
["IHDR1","C5.1.4",{"$nulls":3},"Removal of unsuitable material to spoil:",{"$nulls":6},{"$f":"IF(ISNUMBER(H44),L44*H44,IF(ISNUMBER(J44),J44,IF(J44=\"RATE ONLY\",LOWER(\"RATE ONLY\"),\" \")))","v":" "}]
[]
["IHDR2",null,"C5.1.4.1",null,null,"In layer thicknesses of 200 mm and less:",{"$nulls":6},{"$f":"IF(ISNUMBER(H46),L46*H46,IF(ISNUMBER(J46),J46,IF(J46=\"RATE ONLY\",LOWER(\"RATE ONLY\"),\" \")))","v":" "}]
[]
["Item",null,null,"(a)",null,"Stable material","m³",{"$nulls":5}," "]
["Item",null,null,"(b)",null,"Unstable material","m³",{"$nulls":5}," "]
["IHDR2",null,"C5.1.4.2",null,null,"In layer thicknesses exceeding 200 mm:",{"$nulls":6},{"$f":"IF(ISNUMBER(H50),L50*H50,IF(ISNUMBER(J50),J50,IF(J50=\"RATE ONLY\",LOWER(\"RATE ONLY\"),\" \")))","v":" "}]
[]
["Item",null,null,"(a)",null,"Stable material","m³",{"$nulls":5},{"$f":"IF(ISNUMBER(H52),L52*H52,IF(ISNUMBER(J52),J52,IF(J52=\"RATE ONLY\",LOWER(\"RATE ONLY\"),\" \")))","v":" "}]
["Item",null,null,"(b)",null,"Unstable material","m³",{"$nulls":5}," "]
["IHDR1","C5.1.5",{"$nulls":3},"In-situ treatment of roadbed in hard material:",{"$nulls":6},{"$f":"IF(ISNUMBER(H54),L54*H54,IF(ISNUMBER(J54),J54,IF(J54=\"RATE ONLY\",LOWER(\"RATE ONLY\"),\" \")))","v":" "}]
[]
["Item",null,"C5.1.5.1",null,null,"In-situ treatment by ripping","m³",{"$nulls":5}," "]
["Item",null,"C5.1.5.2",null,null,"In-situ treatment by drilling and blasting","m³",{"$nulls":5}," "]
["Item",null,"C5.1.5.3",null,null,"In-situ treatment by drilling and splitting the material using non-explosive, rock-breaking products","m³",{"$nulls":5}," "]
["IHDR1","C5.1.6",{"$nulls":3},"Roller-pass compaction:",{"$nulls":6},{"$f":"IF(ISNUMBER(H59),L59*H59,IF(ISNUMBER(J59),J59,IF(J59=\"RATE ONLY\",LOWER(\"RATE ONLY\"),\" \")))","v":" "}]
[]
["Item",null,"C5.1.6.1",null,null,"Grid rollers","m²",{"$nulls":3}," ",{"v":2.8,"d":"2.80"},{"$f":"IF(ISNUMBER(H61),L61*H61,IF(ISNUMBER(J61),J61,IF(J61=\"RATE ONLY\",LOWER(\"RATE ONLY\"),\" \")))","v":" "}]
[]
["Item",null,"C5.1.6.2",null,null,"Pad foot vibratory rollers","m²",{"$nulls":3}," ",{"v":3,"d":"3.00"},{"$f":"IF(ISNUMBER(H63),L63*H63,IF(ISNUMBER(J63),J63,IF(J63=\"RATE ONLY\",LOWER(\"RATE ONLY\"),\" \")))","v":" "}]
[]
["Item",null,"C5.1.6.3",null,null,"Smooth drum vibratory rollers","m²",{"$nulls":5}," "]
["Item",null,"C5.1.6.4",null,null,"Other vibratory rollers. Specify……","m²",{"$nulls":5}," "]
["Item",null,"C5.1.6.5",null,null,"Impact rollers","m²",{"$nulls":5}," "]
["Item",null,"C5.1.6.6",null,null,"Pneumatic rollers","m²",{"$nulls":5}," "]
["Item",null,"C5.1.6.7",null,null,"High energy impact compactor/roller (HEIC)","m²",{"$nulls":5}," "]
["Item",null,"C5.1.6.8",null,null,"Other rollers. Specify…..","m²",{"$nulls":5}," "]
["IHDR1","C5.1.7",{"$nulls":3},"Construction of a roadbed trial section:",{"$nulls":6},{"$f":"IF(ISNUMBER(H71),L71*H71,IF(ISNUMBER(J71),J71,IF(J71=\"RATE ONLY\",LOWER(\"RATE ONLY\"),\" \")))","v":" "}]
[]
["IHDR2",null,"C5.1.7.1",null,null,"Non wetting-up collapsing soil trial section at in-situ moisture content using conventional rollers and/or HEIC","m³",{"$nulls":5},{"$f":"IF(ISNUMBER(H73),L73*H73,IF(ISNUMBER(J73),J73,IF(J73=\"RATE ONLY\",LOWER(\"RATE ONLY\"),\" \")))","v":" "}]
[]
["IHDR2",null,"C5.1.7.2",null,null,"Non wetting-up collapsing soil trial section by excavating the soil to stockpile and then importing the soil from the stockpile to controlled compacted layers","m³",{"$nulls":5},{"$f":"IF(ISNUMBER(H75),L75*H75,IF(ISNUMBER(J75),J75,IF(J75=\"RATE ONLY\",LOWER(\"RATE ONLY\"),\" \")))","v":" "}]
[]
["IHDR2",null,"C5.1.7.3",null,null,"Wetting-up collapsing soil trial section","m³",{"$nulls":5},{"$f":"IF(ISNUMBER(H77),L77*H77,IF(ISNUMBER(J77),J77,IF(J77=\"RATE ONLY\",LOWER(\"RATE ONLY\"),\" \")))","v":" "}]
[]
["IHDR2",null,"C5.1.7.4",null,null,"Inactive and normal clay",{"$nulls":6},{"$f":"IF(ISNUMBER(H79),L79*H79,IF(ISNUMBER(J79),J79,IF(J79=\"RATE ONLY\",LOWER(\"RATE ONLY\"),\" \")))","v":" "}]
[]
["Item",null,null,"(a)",null,"By material modification","m³",{"$nulls":5}," "]
["Item",null,null,"(b)",null,"By lime modification","m³",{"$nulls":5}," "]
["Item",null,null,"(c)",null,"By removal of material","m³",{"$nulls":5}," "]
["IHDR2",null,"C5.1.7.5",null,null,"Active clay",{"$nulls":6},{"$f":"IF(ISNUMBER(H84),L84*H84,IF(ISNUMBER(J84),J84,IF(J84=\"RATE ONLY\",LOWER(\"RATE ONLY\"),\" \")))","v":" "}]
[]
["Item",null,null,"(a)",null,"Roadbed construction using lime","m³",{"$nulls":5}," "]
["Item",null,null,"(b)",null,"Roadbed construction by removal of active clay","m³",{"$nulls":5}," "]
["IHDR2",null,"C5.1.7.6",null,null,"Roller-pass compaction","m³",{"$nulls":4},{"v":3,"d":"3.00"},{"$f":"IF(ISNUMBER(H88),L88*H88,IF(ISNUMBER(J88),J88,IF(J88=\"RATE ONLY\",LOWER(\"RATE ONLY\"),\" \")))","v":" "}]
[]
["IHDR1","C5.1.8",{"$nulls":3},"Construction of the roadbed in collapsing soil:",{"$nulls":6},{"$f":"IF(ISNUMBER(H90),L90*H90,IF(ISNUMBER(J90),J90,IF(J90=\"RATE ONLY\",LOWER(\"RATE ONLY\"),\" \")))","v":" "}]
[]
["Item",null,"C5.1.8.1",null,null,"Non wetting-up collapsing soil roadbed construction at in-situ moisture content using conventional rollers","m³",{"$nulls":5}," "]
["Item",null,"C5.1.8.2",null,null,"Non wetting-up collapsing soil roadbed construction at in-situ moisture content using HEIC","m³",{"$nulls":5}," "]
["Item",null,"C5.1.8.3",null,null,"Non wetting-up collapsing soil roadbed construction by excavating the soil to stockpile and then importing from the stockpile to controlled compacted layers;","m³",{"$nulls":5}," "]
["Item",null,"C5.1.8.4",null,null,"Wetting-up collapsing soil roadbed construction","kilolitre",{"$nulls":5}," "]
["Item",null,"C5.1.8.5",null,null,"Water for wetting-up collapsing soil roadbed construction","kilolitre",{"$nulls":5},{"$f":"IF(ISNUMBER(H96),L96*H96,IF(ISNUMBER(J96),J96,IF(J96=\"RATE ONLY\",LOWER(\"RATE ONLY\"),\" \")))","v":" "}]
["IHDR1","C5.1.9",{"$nulls":3},"Construction of roadbed comprising normal and inactive clay:",{"$nulls":6},{"$f":"IF(ISNUMBER(H97),L97*H97,IF(ISNUMBER(J97),J97,IF(J97=\"RATE ONLY\",LOWER(\"RATE ONLY\"),\" \")))","v":" "}]
[]
["Item",null,"C5.1.9.1",null,null,"By material modification","m³",{"$nulls":5}," "]
["Item",null,"C5.1.9.2",null,null,"By lime modification","m³",{"$nulls":5}," "]
["Item",null,"C5.1.9.3",null,null,"By removal of material","m³",{"$nulls":5}," "]
["IHDR1","C5.1.10",{"$nulls":3},"Construction of roadbed comprising active clay:",{"$nulls":6},{"$f":"IF(ISNUMBER(H102),L102*H102,IF(ISNUMBER(J102),J102,IF(J102=\"RATE ONLY\",LOWER(\"RATE ONLY\"),\" \")))","v":" "}]
[]
["Item",null,"C5.1.10.1",null,null,"Roadbed construction using lime","m³",{"$nulls":5}," "]
["Item",null,"C5.1.10.2",null,null,"Roadbed construction by removal of active clay","m³",{"$nulls":5}," "]
["IHDR1","C5.1.11",{"$nulls":3},"Construction of roadbed comprising a pioneer layer","m³",{"$nulls":4},{"v":15,"d":"15.00"},{"$f":"IF(ISNUMBER(H106),L106*H106,IF(ISNUMBER(J106),J106,IF(J106=\"RATE ONLY\",LOWER(\"RATE ONLY\"),\" \")))","v":" "}]
[]
["IHDR1","C5.1.12",{"$nulls":3},"Excavation for benches:",{"$nulls":6},{"$f":"IF(ISNUMBER(H108),L108*H108,IF(ISNUMBER(J108),J108,IF(J108=\"RATE ONLY\",LOWER(\"RATE ONLY\"),\" \")))","v":" "}]
[]
["IHDR2",null,"C5.1.12.1",null,null,"Excavation for benches:",{"$nulls":6},{"$f":"IF(ISNUMBER(H110),L110*H110,IF(ISNUMBER(J110),J110,IF(J110=\"RATE ONLY\",LOWER(\"RATE ONLY\"),\" \")))","v":" "}]
[]
["Item",null,null,"(a)",null,"Side-cut to fill in soft material","m³",{"$nulls":5}," "]
["Item",null,null,"(b)",null,"Side-cut to spoil in soft material","m³",{"$nulls":5}," "]
["IHDR2",null,"C5.1.12.2",null,null,"Excavation for benches using labour enhancement:",{"$nulls":6},{"$f":"IF(ISNUMBER(H114),L114*H114,IF(ISNUMBER(J114),J114,IF(J114=\"RATE ONLY\",LOWER(\"RATE ONLY\"),\" \")))","v":" "}]
[]
["IHDR3",null,null,"(a)",null,"Side-cut to fill:",{"$nulls":6},{"$f":"IF(ISNUMBER(H116),L116*H116,IF(ISNUMBER(J116),J116,IF(J116=\"RATE ONLY\",LOWER(\"RATE ONLY\"),\" \")))","v":" "}]
[]
["Item1",{"$nulls":3},"(i)","Soft material","m³",{"$nulls":5}," "]
["Item1",{"$nulls":3},"(ii)","Intermediate material","m³",{"$nulls":5}," "]
["IHDR3",null,null,"(b)",null,"Side-cut to spoil:",{"$nulls":6},{"$f":"IF(ISNUMBER(H120),L120*H120,IF(ISNUMBER(J120),J120,IF(J120=\"RATE ONLY\",LOWER(\"RATE ONLY\"),\" \")))","v":" "}]
[]
["Item1",{"$nulls":3},"(i)","Soft material","m³",{"$nulls":5}," "]
["Item1",{"$nulls":3},"(ii)","Intermediate material","m³",{"$nulls":5}," "]
["IHDR1","C5.1.13",{"$nulls":3},"Construction of a levelling layer:",{"$nulls":6},{"$f":"IF(ISNUMBER(H124),L124*H124,IF(ISNUMBER(J124),J124,IF(J124=\"RATE ONLY\",LOWER(\"RATE ONLY\"),\" \")))","v":" "}]
[]
["Item",null,"C5.1.13.1",null,null,"Over roadbed treatment in hard material compacted to 90 % MDD","m³",{"$nulls":5}," "]
["Item",null,"PC5.1.13.3",null,null,"Over a constructed pioneer layer or rock fill compacted to 90 % MDD","m³",{"$nulls":4},{"v":25,"d":"25.00"},{"$f":"IF(ISNUMBER(H127),L127*H127,IF(ISNUMBER(J127),J127,IF(J127=\"RATE ONLY\",LOWER(\"RATE ONLY\"),\" \")))","v":" "},"Add \"or rock fill\""]
{"$rows_empty":27}
["#BillEnd#"]
["#BillEnd#","TOTAL CARRIED FORWARD TO SUMMARY",{"$nulls":10},{"$f":"SUBTOTAL(9,M$7:M128)","v":{"v":675000,"d":"675,000.00"}}]
["#BillEnd#"]

{"sheet":"5.2","index":19,"n_rows":92,"n_cols":13,"rows_kept":92,"hidden":true}
["#BillSheet#"]
["#BillSheet#","C5.2","FILL",{"$nulls":3},"\n",null,null,"SCHEDULE A",{"$f":"SUBTOTAL(9,M$7:M990)","v":0},null,{"$f":"J2","v":"SCHEDULE A"}]
["#BillSheet#"]
["ColHDR"]
["ColHDR","ITEM",{"$nulls":3},"DESCRIPTION","UNIT","QTY","RATE","AMT",null,"RATE","AMOUNT"]
["ColHDR"]
[{"$nulls":5},"FILL"]
["IHDR1","C5.2.1",{"$nulls":3},"Compiling and implementing M&U plans:",{"$nulls":6},{"$f":"IF(ISNUMBER(H8),L8*H8,IF(ISNUMBER(J8),J8,IF(J8=\"RATE ONLY\",LOWER(\"RATE ONLY\"),\" \")))","v":" "}]
[]
["Item",null,"C5.2.1.1",null,null,"For fills more than 10 000 m³","No.",{"$nulls":4},{"v":30000,"d":"30,000.00"},{"$f":"IF(ISNUMBER(H10),L10*H10,IF(ISNUMBER(J10),J10,IF(J10=\"RATE ONLY\",LOWER(\"RATE ONLY\"),\" \")))","v":" "}]
[]
["Item",null,"C5.2.1.2",null,null,"For fills 1,0 km in length when less than 10 000 m³ ","No.",{"$nulls":4},{"v":40000,"d":"40,000.00"},{"$f":"IF(ISNUMBER(H12),L12*H12,IF(ISNUMBER(J12),J12,IF(J12=\"RATE ONLY\",LOWER(\"RATE ONLY\"),\" \")))","v":" "}]
[]
["IHDR1","C5.2.2",{"$nulls":3},"Fill construction:",{"$nulls":6},{"$f":"IF(ISNUMBER(H14),L14*H14,IF(ISNUMBER(J14),J14,IF(J14=\"RATE ONLY\",LOWER(\"RATE ONLY\"),\" \")))","v":" "}]
[]
["IHDR2",null,"C5.2.2.1",null,null,"Normal fill material in compacted layer thicknesses of 200 mm and less:",{"$nulls":6},{"$f":"IF(ISNUMBER(H16),L16*H16,IF(ISNUMBER(J16),J16,IF(J16=\"RATE ONLY\",LOWER(\"RATE ONLY\"),\" \")))","v":" "}]
[]
["Item",null,null,"(a)",null,"Compacted to 90 % of MDD","m³",{"$nulls":5},{"$f":"IF(ISNUMBER(H18),L18*H18,IF(ISNUMBER(J18),J18,IF(J18=\"RATE ONLY\",LOWER(\"RATE ONLY\"),\" \")))","v":" "}]
["Item",null,null,"(b)",null,"Compacted to 93 % of MDD","m³",{"$nulls":4},{"v":25,"d":"25.00"},{"$f":"IF(ISNUMBER(H19),L19*H19,IF(ISNUMBER(J19),J19,IF(J19=\"RATE ONLY\",LOWER(\"RATE ONLY\"),\" \")))","v":" "}]
[]
["Item",null,null,"(c)",null,"Roller-pass compaction","m²",{"$nulls":5}," "]
["IHDR2",null,"C5.2.2.2",null,null,"Coarse fill material in compacted layer thicknesses exceeding 200 mm but less than 500 mm:",{"$nulls":6},{"$f":"IF(ISNUMBER(H22),L22*H22,IF(ISNUMBER(J22),J22,IF(J22=\"RATE ONLY\",LOWER(\"RATE ONLY\"),\" \")))","v":" "}]
[]
["Item",null,null,"(a)",null,"Compacted to 90 % of MDD","m³",{"$nulls":5}," "]
["Item",null,null,"(b)",null,"Compacted to 93 % of MDD","m³",{"$nulls":4},{"v":30,"d":"30.00"},{"$f":"IF(ISNUMBER(H25),L25*H25,IF(ISNUMBER(J25),J25,IF(J25=\"RATE ONLY\",LOWER(\"RATE ONLY\"),\" \")))","v":" "}]
[]
["Item",null,null,"(c)",null,"Roller-pass compaction","m²",{"$nulls":5}," "]
["IHDR2",null,"C5.2.2.3",null,null,"Sand fill material in compacted layer thicknesses of 400 mm and less, compacted to 100 % of MDD","m³",{"$nulls":5},{"$f":"IF(ISNUMBER(H28),L28*H28,IF(ISNUMBER(J28),J28,IF(J28=\"RATE ONLY\",LOWER(\"RATE ONLY\"),\" \")))","v":" "}]
[]
["IHDR2",null,"C5.2.2.4",null,null,"Rock fill material all as per Clause A5.2.7.6","m³",{"$nulls":4},{"v":35,"d":"35.00"},{"$f":"IF(ISNUMBER(H30),L30*H30,IF(ISNUMBER(J30),J30,IF(J30=\"RATE ONLY\",LOWER(\"RATE ONLY\"),\" \")))","v":" "}]
[]
["IHDR2",null,"C5.2.2.5",null,null,"Rock fill embankment toe","m³",{"$nulls":4},{"v":35,"d":"35.00"},{"$f":"IF(ISNUMBER(H32),L32*H32,IF(ISNUMBER(J32),J32,IF(J32=\"RATE ONLY\",LOWER(\"RATE ONLY\"),\" \")))","v":" "}]
[]
["IHDR2",null,"C5.2.2.6",null,null,"Sand filter layer","m³",{"$nulls":5},{"$f":"IF(ISNUMBER(H34),L34*H34,IF(ISNUMBER(J34),J34,IF(J34=\"RATE ONLY\",LOWER(\"RATE ONLY\"),\" \")))","v":" "}]
[]
["IHDR2",null,"C5.2.2.7",null,null,"Drainage blanket layer","m³",{"$nulls":5},{"$f":"IF(ISNUMBER(H36),L36*H36,IF(ISNUMBER(J36),J36,IF(J36=\"RATE ONLY\",LOWER(\"RATE ONLY\"),\" \")))","v":" "}]
[]
["IHDR1","C5.2.3",{"$nulls":3},"Side-cut to fill compacted to 93 % of MDD in compacted layer thicknesses of 200 mm and less","m³",{"$nulls":5},{"$f":"IF(ISNUMBER(H38),L38*H38,IF(ISNUMBER(J38),J38,IF(J38=\"RATE ONLY\",LOWER(\"RATE ONLY\"),\" \")))","v":" "}]
[]
["IHDR1","C5.2.4",{"$nulls":3},"Correcting rock fills that are deficient in fine material, extra over C5.2.2.4","m³",{"$nulls":5},{"$f":"IF(ISNUMBER(H40),L40*H40,IF(ISNUMBER(J40),J40,IF(J40=\"RATE ONLY\",LOWER(\"RATE ONLY\"),\" \")))","v":" "}]
[]
["IHDR1","C5.2.5",{"$nulls":3},"Fill in sidewalk:",{"$nulls":6},{"$f":"IF(ISNUMBER(H42),L42*H42,IF(ISNUMBER(J42),J42,IF(J42=\"RATE ONLY\",LOWER(\"RATE ONLY\"),\" \")))","v":" "}]
[]
["IHDR2",null,"C5.2.5.1",null,null,"Fill material in sidewalk compacted to 93 % of MDD","m³",{"$nulls":5},{"$f":"IF(ISNUMBER(H44),L44*H44,IF(ISNUMBER(J44),J44,IF(J44=\"RATE ONLY\",LOWER(\"RATE ONLY\"),\" \")))","v":" "}]
[]
["IHDR2",null,"C5.2.5.2",null,null,"Fill material in sidewalk compacted to 93 % of MDD using labour enhanced methods of construction and light hand equipment.","m³",{"$nulls":5},{"$f":"IF(ISNUMBER(H46),L46*H46,IF(ISNUMBER(J46),J46,IF(J46=\"RATE ONLY\",LOWER(\"RATE ONLY\"),\" \")))","v":" "}]
[]
["IHDR1","C5.2.6",{"$nulls":3},"Fill material in shoulder widening:",{"$nulls":6},{"$f":"IF(ISNUMBER(H48),L48*H48,IF(ISNUMBER(J48),J48,IF(J48=\"RATE ONLY\",LOWER(\"RATE ONLY\"),\" \")))","v":" "}]
[]
["IHDR2",null,"C5.2.6.1",null,null,"Fill material in shoulder widening compacted to 93 % of MDD","m³",{"$nulls":5},{"$f":"IF(ISNUMBER(H50),L50*H50,IF(ISNUMBER(J50),J50,IF(J50=\"RATE ONLY\",LOWER(\"RATE ONLY\"),\" \")))","v":" "}]
[]
["IHDR2",null,"C5.2.6.2",null,null,"Fill material in shoulder widening compacted to 93 % of MDD using labour enhancement and light hand equipment.","m³",{"$nulls":5},{"$f":"IF(ISNUMBER(H52),L52*H52,IF(ISNUMBER(J52),J52,IF(J52=\"RATE ONLY\",LOWER(\"RATE ONLY\"),\" \")))","v":" "}]
[]
["IHDR1","C5.2.7",{"$nulls":3},"Construction of a trial section:",{"$nulls":6},{"$f":"IF(ISNUMBER(H54),L54*H54,IF(ISNUMBER(J54),J54,IF(J54=\"RATE ONLY\",LOWER(\"RATE ONLY\"),\" \")))","v":" "}]
[]
["Item",null,"C5.2.7.1",null,null,"Normal fill","m³",{"$nulls":4},{"v":25,"d":"25.00"},{"$f":"IF(ISNUMBER(H56),L56*H56,IF(ISNUMBER(J56),J56,IF(J56=\"RATE ONLY\",LOWER(\"RATE ONLY\"),\" \")))","v":" "}]
[]
["Item",null,"C5.2.7.2",null,null,"Sand fill","m³",{"$nulls":5}," "]
["Item",null,"C5.2.7.3",null,null,"Rock fill","m³",{"$nulls":4},{"v":35,"d":"35.00"},{"$f":"IF(ISNUMBER(H59),L59*H59,IF(ISNUMBER(J59),J59,IF(J59=\"RATE ONLY\",LOWER(\"RATE ONLY\"),\" \")))","v":" "}]
[]
["Item",null,"C5.2.7.4",null,null,"Coarse fill","m³",{"$nulls":4},{"v":30,"d":"30.00"},{"$f":"IF(ISNUMBER(H61),L61*H61,IF(ISNUMBER(J61),J61,IF(J61=\"RATE ONLY\",LOWER(\"RATE ONLY\"),\" \")))","v":" "}]
[]
["Item",null,"C5.2.7.5",null,null,"Roller-pass compaction","m³",{"$nulls":5}," "]
["IHDR1","C5.2.8",{"$nulls":3},"Breaking down oversize fill material on the road",{"$nulls":6},{"$f":"IF(ISNUMBER(H64),L64*H64,IF(ISNUMBER(J64),J64,IF(J64=\"RATE ONLY\",LOWER(\"RATE ONLY\"),\" \")))","v":" "}]
[]
["Item",null,"C5.2.8.1",null,null,"By normal grid rolling as per clause A5.3.7.3(b) (i) to (vii)","m2-pass",{"$nulls":4},{"v":6,"d":"6.00"},{"$f":"IF(ISNUMBER(H66),L66*H66,IF(ISNUMBER(J66),J66,IF(J66=\"RATE ONLY\",LOWER(\"RATE ONLY\"),\" \")))","v":" "}]
[]
["Item",null,"C5.2.8.2",null,null,"By tamping roller","m2-pass",{"$nulls":5}," "]
["Item",null,"C5.2.8.3",null,null,"By pad foot vibratory roller","m2-pass",{"$nulls":5}," "]
["Item",null,"C5.2.8.4",null,null,"By vibratory roller","m2-pass",{"$nulls":5}," "]
["IHDR1","C5.2.9",{"$nulls":3},"Removal of oversize material","m³",{"$nulls":4},{"v":10,"d":"10.00"},{"$f":"IF(ISNUMBER(H71),L71*H71,IF(ISNUMBER(J71),J71,IF(J71=\"RATE ONLY\",LOWER(\"RATE ONLY\"),\" \")))","v":" "}]
[]
["IHDR1","C5.2.10",{"$nulls":3},"Finishing off rock fill slopes:",{"$nulls":6},{"$f":"IF(ISNUMBER(H73),L73*H73,IF(ISNUMBER(J73),J73,IF(J73=\"RATE ONLY\",LOWER(\"RATE ONLY\"),\" \")))","v":" "}]
[]
["IHDR2",null,"C5.2.10.1",null,null,"Finishing off rock fill slopes with soft material","m³",{"$nulls":5},{"$f":"IF(ISNUMBER(H75),L75*H75,IF(ISNUMBER(J75),J75,IF(J75=\"RATE ONLY\",LOWER(\"RATE ONLY\"),\" \")))","v":" "}]
[]
["IHDR2",null,"C5.2.10.2",null,null,"Finishing off rock fill slopes with soft material using labour enhancement and light, hand equipment.","m³",{"$nulls":5},{"$f":"IF(ISNUMBER(H77),L77*H77,IF(ISNUMBER(J77),J77,IF(J77=\"RATE ONLY\",LOWER(\"RATE ONLY\"),\" \")))","v":" "}]
[]
["IHDR1","C5.2.11",{"$nulls":3},"Finishing-off fill slopes, medians and interchange areas:",{"$nulls":6},{"$f":"IF(ISNUMBER(H79),L79*H79,IF(ISNUMBER(J79),J79,IF(J79=\"RATE ONLY\",LOWER(\"RATE ONLY\"),\" \")))","v":" "}]
[]
["Item",null,"C5.2.11.1",null,null,"Fill slopes","m²",{"$nulls":4},{"v":5.7,"d":"5.70"},{"$f":"IF(ISNUMBER(H81),L81*H81,IF(ISNUMBER(J81),J81,IF(J81=\"RATE ONLY\",LOWER(\"RATE ONLY\"),\" \")))","v":" "}]
[]
["Item",null,"C5.2.11.2",null,null,"Medians and interchange areas","m²",{"$nulls":4},{"v":3.5,"d":"3.50"},{"$f":"IF(ISNUMBER(H83),L83*H83,IF(ISNUMBER(J83),J83,IF(J83=\"RATE ONLY\",LOWER(\"RATE ONLY\"),\" \")))","v":" "}]
[]
[]
[]
[]
[]
[]
["#BillEnd#"]
["#BillEnd#","TOTAL CARRIED FORWARD TO SUMMARY",{"$nulls":10},{"$f":"SUBTOTAL(9,M$7:M84)","v":0}]
["#BillEnd#"]

{"sheet":"5.3","index":20,"n_rows":174,"n_cols":13,"rows_kept":174,"hidden":true}
["#BillSheet#"]
["#BillSheet#","C5.3","ROAD PAVEMENT LAYERS",{"$nulls":3},"\n",null,null,"SCHEDULE A",{"$f":"SUBTOTAL(9,M$7:M1108)","v":{"v":200000,"d":"200,000.00"}},null,{"$f":"J2","v":"SCHEDULE A"}]
["#BillSheet#"]
["ColHDR"]
["ColHDR","ITEM",{"$nulls":3},"DESCRIPTION","UNIT","QTY","RATE","AMT",null,"RATE","AMOUNT"]
["ColHDR"]
[{"$nulls":5},"ROAD PAVEMENT LAYERS"]
["IHDR1","C5.3.1","C5.3.1",null,null,"Compiling and implementing M&U plans for the construction of all the pavement layers","No.",{"$nulls":4},{"v":40000,"d":"40,000.00"},{"$f":"IF(ISNUMBER(H8),L8*H8,IF(ISNUMBER(J8),J8,IF(J8=\"RATE ONLY\",LOWER(\"RATE ONLY\"),\" \")))","v":" "}]
[]
["IHDR1","C5.3.2",{"$nulls":3},"Construction of pavement layers:",{"$nulls":6},{"$f":"IF(ISNUMBER(H10),L10*H10,IF(ISNUMBER(J10),J10,IF(J10=\"RATE ONLY\",LOWER(\"RATE ONLY\"),\" \")))","v":" "}]
[]
["IHDR2",null,"PC5.3.2.1",null,null,"Construction of layers using conventional construction methods:",{"$nulls":6},{"$f":"IF(ISNUMBER(H12),L12*H12,IF(ISNUMBER(J12),J12,IF(J12=\"RATE ONLY\",LOWER(\"RATE ONLY\"),\" \")))","v":" "}]
[]
["IHDR3",null,null,"(a)",null,"Selected subgrade layers, compacted to 93 % of MDD:",{"$nulls":6},{"$f":"IF(ISNUMBER(H14),L14*H14,IF(ISNUMBER(J14),J14,IF(J14=\"RATE ONLY\",LOWER(\"RATE ONLY\"),\" \")))","v":" "}]
[]
["Item",{"$nulls":3},"(i)","Lower selected subgrade layer, 150mm thick","m³",{"$nulls":4},{"v":64,"d":"64.00"},{"$f":"IF(ISNUMBER(H16),L16*H16,IF(ISNUMBER(J16),J16,IF(J16=\"RATE ONLY\",LOWER(\"RATE ONLY\"),\" \")))","v":" "}]
[]
["Item",null,null," ","(ii)","Upper selected subgrade layer, 150mm thick","m³",{"$nulls":4},{"v":65,"d":"65.00"},{"$f":"IF(ISNUMBER(H18),L18*H18,IF(ISNUMBER(J18),J18,IF(J18=\"RATE ONLY\",LOWER(\"RATE ONLY\"),\" \")))","v":" "}]
[]
[{"$nulls":3},"(b)",null,"Lower selected subgrade layer (layer thickness indicated) compacted to 95 % of MDD","m³",{"$nulls":5},{"$f":"IF(ISNUMBER(H20),L20*H20,IF(ISNUMBER(J20),J20,IF(J20=\"RATE ONLY\",LOWER(\"RATE ONLY\"),\" \")))","v":" "}]
["IHDR3",null,null,"(c)",null,"Upper selected subgrade layer,  200mm thick , compacted to 95 % of MDD","m³",{"$nulls":4},{"v":65,"d":"65.00"},{"$f":"IF(ISNUMBER(H21),L21*H21,IF(ISNUMBER(J21),J21,IF(J21=\"RATE ONLY\",LOWER(\"RATE ONLY\"),\" \")))","v":" "}]
[]
["IHDR3",null,null,"(d)",null,"Upper selected subgrade layer (layer thickness indicated) compacted to 97 % of MDD","m³",{"$nulls":5},{"$f":"IF(ISNUMBER(H23),L23*H23,IF(ISNUMBER(J23),J23,IF(J23=\"RATE ONLY\",LOWER(\"RATE ONLY\"),\" \")))","v":" "}]
[]
["IHDR3",null,null,"(e)",null,"Sand layer (layer thickness indicated) compacted to 97 % of MDD","m³",{"$nulls":5},{"$f":"IF(ISNUMBER(H25),L25*H25,IF(ISNUMBER(J25),J25,IF(J25=\"RATE ONLY\",LOWER(\"RATE ONLY\"),\" \")))","v":" "}]
[]
["IHDR3",null,null,"(f)",null,"Sand layer (layer thickness indicated) compacted to 100 % of MDD","m³",{"$nulls":5},{"$f":"IF(ISNUMBER(H27),L27*H27,IF(ISNUMBER(J27),J27,IF(J27=\"RATE ONLY\",LOWER(\"RATE ONLY\"),\" \")))","v":" "}]
[]
["IHDR3",null,null,"(g)",null,"Gravel wearing course layer, 300mm thick,  compacted to 95 % of MDD","m³",{"$nulls":4},{"v":80,"d":"80.00"},{"$f":"IF(ISNUMBER(H29),L29*H29,IF(ISNUMBER(J29),J29,IF(J29=\"RATE ONLY\",LOWER(\"RATE ONLY\"),\" \")))","v":" "}]
[]
["IHDR3",null,null,"(h)",null,"Gravel shoulder layer, 150mm thick,  compacted to 95 % of MDD","m³",{"$nulls":4},{"v":80,"d":"80.00"},{"$f":"IF(ISNUMBER(H31),L31*H31,IF(ISNUMBER(J31),J31,IF(J31=\"RATE ONLY\",LOWER(\"RATE ONLY\"),\" \")))","v":" "}]
[]
["IHDR3",null,null,"(i)",null,"Lower subbase gravel layer (unstabilised), 200mm, compacted to 95 % of MDD","m³",{"$nulls":4},{"v":91,"d":"91.00"},{"$f":"IF(ISNUMBER(H33),L33*H33,IF(ISNUMBER(J33),J33,IF(J33=\"RATE ONLY\",LOWER(\"RATE ONLY\"),\" \")))","v":" "}]
[]
["IHDR3",null,null,"(j)",null,"Lower subbase gravel layer (chemically stabilised),200mm thick, compacted to 95 % of MDD","m³",{"$nulls":4},{"v":91,"d":"91.00"},{"$f":"IF(ISNUMBER(H35),L35*H35,IF(ISNUMBER(J35),J35,IF(J35=\"RATE ONLY\",LOWER(\"RATE ONLY\"),\" \")))","v":" "}]
[]
["IHDR3",null,null,"(k)",null,"Upper subbase gravel layer (unstabilised), compacted to 97 % of MDD",{"$nulls":6},{"$f":"IF(ISNUMBER(H37),L37*H37,IF(ISNUMBER(J37),J37,IF(J37=\"RATE ONLY\",LOWER(\"RATE ONLY\"),\" \")))","v":" "}]
[]
["Item",{"$nulls":3},"(i)","150 mm thick","m³",{"$nulls":5},{"$f":"IF(ISNUMBER(H39),L39*H39,IF(ISNUMBER(J39),J39,IF(J39=\"RATE ONLY\",LOWER(\"RATE ONLY\"),\" \")))","v":" "}]
["Item",{"$nulls":3},"(ii)","200 mm thick","m³",{"$nulls":4},{"v":95,"d":"95.00"},{"$f":"IF(ISNUMBER(H40),L40*H40,IF(ISNUMBER(J40),J40,IF(J40=\"RATE ONLY\",LOWER(\"RATE ONLY\"),\" \")))","v":" "}]
[]
["IHDR3",null,null,"(l)",null,"Upper subbase gravel layer (chemically stabilised),  compacted to 97 % of MDD"," ",{"$nulls":4}," ",{"$f":"IF(ISNUMBER(H42),L42*H42,IF(ISNUMBER(J42),J42,IF(J42=\"RATE ONLY\",LOWER(\"RATE ONLY\"),\" \")))","v":" "}]
[]
["Item",{"$nulls":3},"(i)","100 mm thick","m³",{"$nulls":4},{"v":95,"d":"95.00"},{"$f":"IF(ISNUMBER(H44),L44*H44,IF(ISNUMBER(J44),J44,IF(J44=\"RATE ONLY\",LOWER(\"RATE ONLY\"),\" \")))","v":" "}]
[]
["Item",{"$nulls":3},"(ii)","200 mm thick","m³",{"$nulls":4},{"v":95,"d":"95.00"},{"$f":"IF(ISNUMBER(H46),L46*H46,IF(ISNUMBER(J46),J46,IF(J46=\"RATE ONLY\",LOWER(\"RATE ONLY\"),\" \")))","v":" "}]
[]
[{"$nulls":3},"(m)",null,"Gravel base layer (unstabilised), (layer thickness indicated) compacted to 100 % of MDD","m³",{"$nulls":5}," "]
["IHDR3",null,null,"(n)",null,"Gravel base layer (chemically stabilised), (layer thickness indicated) compacted to 97 % of MDD","m³",{"$nulls":5},{"$f":"IF(ISNUMBER(H49),L49*H49,IF(ISNUMBER(J49),J49,IF(J49=\"RATE ONLY\",LOWER(\"RATE ONLY\"),\" \")))","v":" "}]
[]
["IHDR3",null,null,"(o)",null,"G5B crushed rock/boulder subbase layer (layer thickness indicated) compacted to 97 % of MDD","m³",{"$nulls":5},{"$f":"IF(ISNUMBER(H51),L51*H51,IF(ISNUMBER(J51),J51,IF(J51=\"RATE ONLY\",LOWER(\"RATE ONLY\"),\" \")))","v":" "}]
[]
["IHDR3",null,null,"(p)",null,"G5B crushed rock/boulder base layer (layer thickness indicated) compacted to 100 % of MDD","m³",{"$nulls":5},{"$f":"IF(ISNUMBER(H53),L53*H53,IF(ISNUMBER(J53),J53,IF(J53=\"RATE ONLY\",LOWER(\"RATE ONLY\"),\" \")))","v":" "}]
[]
["IHDR3",null,null,"(q)",null,"G5A crushed rock/boulder subbase layer (layer thickness indicated) compacted to 97 % of MDD","m³",{"$nulls":5},{"$f":"IF(ISNUMBER(H55),L55*H55,IF(ISNUMBER(J55),J55,IF(J55=\"RATE ONLY\",LOWER(\"RATE ONLY\"),\" \")))","v":" "}]
[]
["IHDR3",null,null,"(r)",null,"G5A crushed rock/boulder base layer (layer thickness indicated) compacted to 100 % of MDD","m³",{"$nulls":5},{"$f":"IF(ISNUMBER(H57),L57*H57,IF(ISNUMBER(J57),J57,IF(J57=\"RATE ONLY\",LOWER(\"RATE ONLY\"),\" \")))","v":" "}]
[]
["IHDR3",null,null,"(s)",null,"G4A crushed rock/boulder lower subbase layer (unstabilised or chemically stabilised) (layer thickness indicated) compacted to 95 % of MDD","m³",{"$nulls":5},{"$f":"IF(ISNUMBER(H59),L59*H59,IF(ISNUMBER(J59),J59,IF(J59=\"RATE ONLY\",LOWER(\"RATE ONLY\"),\" \")))","v":" "}]
[]
["IHDR3",null,null,"(t)",null,"G4A crushed rock/boulder upper subbase layer (unstabilised or chemically stabilised) (layer thickness indicated) compacted to 97 % of MDD","m³",{"$nulls":5},{"$f":"IF(ISNUMBER(H61),L61*H61,IF(ISNUMBER(J61),J61,IF(J61=\"RATE ONLY\",LOWER(\"RATE ONLY\"),\" \")))","v":" "}]
[]
["IHDR3",null,null,"(u)",null,"G4A crushed rock/boulder subbase layer compacted to 97 % of MDD","m³",{"$nulls":5},{"$f":"IF(ISNUMBER(H63),L63*H63,IF(ISNUMBER(J63),J63,IF(J63=\"RATE ONLY\",LOWER(\"RATE ONLY\"),\" \")))","v":" "}]
[]
["IHDR3",null,null,"(v)",null,"G3 crushed stone subbase layer (unstabilised or chemically stabilised) (layer thickness indicated) compacted to 97 % of MDD","m³",{"$nulls":5},{"$f":"IF(ISNUMBER(H65),L65*H65,IF(ISNUMBER(J65),J65,IF(J65=\"RATE ONLY\",LOWER(\"RATE ONLY\"),\" \")))","v":" "}]
[]
["IHDR3",null,null,"(w)",null,"G3 crushed stone base layer (layer thickness indicated) compacted to 85 % of BD","m³",{"$nulls":5},{"$f":"IF(ISNUMBER(H67),L67*H67,IF(ISNUMBER(J67),J67,IF(J67=\"RATE ONLY\",LOWER(\"RATE ONLY\"),\" \")))","v":" "}]
[]
["IHDR3",null,null,"(x)",null,"G2 crushed stone base layer (layer thickness indicated) compacted to 88 % of RD (category C / D roads)","m³",{"$nulls":5},{"$f":"IF(ISNUMBER(H69),L69*H69,IF(ISNUMBER(J69),J69,IF(J69=\"RATE ONLY\",LOWER(\"RATE ONLY\"),\" \")))","v":" "}]
[]
["IHDR3",null,null,"(y)",null,"G2 crushed stone base layer (layer thickness indicated) compacted to 88 % of AD (category A / B roads)","m³",{"$nulls":5},{"$f":"IF(ISNUMBER(H71),L71*H71,IF(ISNUMBER(J71),J71,IF(J71=\"RATE ONLY\",LOWER(\"RATE ONLY\"),\" \")))","v":" "}]
[]
["IHDR3",null,null,"(z)",null,"G1 crushed stone base layer (layer thickness indicated) compacted to 86 % of AD (category C / D roads)","m³",{"$nulls":5},{"$f":"IF(ISNUMBER(H73),L73*H73,IF(ISNUMBER(J73),J73,IF(J73=\"RATE ONLY\",LOWER(\"RATE ONLY\"),\" \")))","v":" "}]
[]
["IHDR3",null,null,"(aa)",null,"G1 crushed stone base layer, 150mm thick, compacted to 88 % of AD ","m³",{"$nulls":4},{"v":150,"d":"150.00"},{"$f":"IF(ISNUMBER(H75),L75*H75,IF(ISNUMBER(J75),J75,IF(J75=\"RATE ONLY\",LOWER(\"RATE ONLY\"),\" \")))","v":" "}]
[]
["IHDR3",null,null,"(bb)",null,"Bound macadam layer (layer thickness indicated) compacted to 90 % of AD","m³",{"$nulls":5},{"$f":"IF(ISNUMBER(H77),L77*H77,IF(ISNUMBER(J77),J77,IF(J77=\"RATE ONLY\",LOWER(\"RATE ONLY\"),\" \")))","v":" "}]
[]
["IHDR3",null,null,"(cc)",null,"PMPL wet lean-mix concrete layer (layer thickness indicated)","m³",{"$nulls":5},{"$f":"IF(ISNUMBER(H79),L79*H79,IF(ISNUMBER(J79),J79,IF(J79=\"RATE ONLY\",LOWER(\"RATE ONLY\"),\" \")))","v":" "}]
[]
["IHDR2",null,"C5.3.2.2",null,null,"Construction of layers using labour enhancement:",{"$nulls":6},{"$f":"IF(ISNUMBER(H81),L81*H81,IF(ISNUMBER(J81),J81,IF(J81=\"RATE ONLY\",LOWER(\"RATE ONLY\"),\" \")))","v":" "}]
[]
["Item",null,null,"(a)",null,"Lower selected subgrade layer (layer thickness indicated) compacted to 93 % of MDD","m³",{"$nulls":5},{"$f":"IF(ISNUMBER(H83),L83*H83,IF(ISNUMBER(J83),J83,IF(J83=\"RATE ONLY\",LOWER(\"RATE ONLY\"),\" \")))","v":" "}]
["Item",null,null,"(b)",null,"Upper selected subgrade layer (layer thickness indicated) compacted to 95 % of MDD","m³",{"$nulls":5}," "]
["Item",null,null,"(c)",null,"Sand layer (layer thickness indicated) compacted to 97 % of MDD","m³",{"$nulls":5}," "]
["Item",null,null,"(d)",null,"Sand layer (layer thickness indicated) compacted to 100 % of MDD","m³",{"$nulls":5}," "]
["Item",null,null,"(e)",null,"Gravel wearing course layer (layer thickness indicated) compacted to 95 % of MDD","m³",{"$nulls":5}," "]
["Item",null,null,"(f)",null,"Gravel shoulder layer (layer thickness indicated) compacted to 95 % of MDD","m³",{"$nulls":5}," "]
["Item",null,null,"(g)",null,"Lower gravel subbase layer (layer thickness indicated) compacted to 95 % of MDD","m³",{"$nulls":5}," "]
["Item",null,null,"(h)",null,"Upper gravel subbase layer (layer thickness indicated) compacted to 97 % of MDD","m³",{"$nulls":5}," "]
["Item",null,null,"(i)",null,"Gravel base layer (layer thickness indicated) compacted to 98 % of MDD","m³",{"$nulls":5}," "]
["Item",null,null,"(j)",null,"Gravel base layer (layer thickness indicated) compacted to 100 % of MDD","m³",{"$nulls":5}," "]
["Item",null,null,"(k)",null,"Bound macadam layer (layer thickness indicated) compacted to 90 % of AD","m³",{"$nulls":5}," "]
["IHDR1","C5.3.3",{"$nulls":3},"Construction of crushed stone base supplied by the Employer","m³",{"$nulls":5},{"$f":"IF(ISNUMBER(H94),L94*H94,IF(ISNUMBER(J94),J94,IF(J94=\"RATE ONLY\",LOWER(\"RATE ONLY\"),\" \")))","v":" "}]
[]
["IHDR1","C5.3.4",{"$nulls":3},"Deductions for G1 crushed stone base material supplied by the employer","t",{"$nulls":5},{"$f":"IF(ISNUMBER(H96),L96*H96,IF(ISNUMBER(J96),J96,IF(J96=\"RATE ONLY\",LOWER(\"RATE ONLY\"),\" \")))","v":" "}]
[]
["IHDR1","C5.3.5",{"$nulls":3},"Breaking down oversize layer material on the road:",{"$nulls":6},{"$f":"IF(ISNUMBER(H98),L98*H98,IF(ISNUMBER(J98),J98,IF(J98=\"RATE ONLY\",LOWER(\"RATE ONLY\"),\" \")))","v":" "}]
[]
["PB"]
["PB","CARRIED FORWARD",{"$nulls":10},{"$f":"SUBTOTAL(9,M$7:M99)","v":0}]
["PB"]
["PB"]
["PB","BROUGHT FORWARD",{"$nulls":10},{"$f":"SUBTOTAL(9,M$7:M102)","v":0}]
["PB"]
["Item",null,"C5.3.5.1",null,null,"By normal grid rolling as per clause A5.3.7.3b)","m²-pass",{"$nulls":4},{"v":6,"d":"6.00"},{"$f":"IF(ISNUMBER(H106),L106*H106,IF(ISNUMBER(J106),J106,IF(J106=\"RATE ONLY\",LOWER(\"RATE ONLY\"),\" \")))","v":" "}]
[]
["Item",null,"C5.3.5.2",null,null,"By tamping roller","m²-pass",{"$nulls":5}," "]
["Item",null,"C5.3.5.3",null,null,"By pad foot vibratory roller","m²-pass",{"$nulls":5}," "]
["Item",null,"C5.3.5.4",null,null,"By vibratory roller","m²-pass",{"$nulls":5}," "]
["Item",null,"C5.3.5.5",null,null,"By any other roller type","m²-pass",{"$nulls":5}," "]
["IHDR1","C5.3.6",{"$nulls":3},"Removal of oversize material","m³",{"$nulls":4},{"v":60,"d":"60.00"},{"$f":"IF(ISNUMBER(H112),L112*H112,IF(ISNUMBER(J112),J112,IF(J112=\"RATE ONLY\",LOWER(\"RATE ONLY\"),\" \")))","v":" "}]
[]
["IHDR1","C5.3.7",{"$nulls":3},"Recombining recovered material","m³",{"$nulls":5},{"$f":"IF(ISNUMBER(H114),L114*H114,IF(ISNUMBER(J114),J114,IF(J114=\"RATE ONLY\",LOWER(\"RATE ONLY\"),\" \")))","v":" "}]
[]
["IHDR1","C5.3.8",{"$nulls":3},"Processing of coarse gravel subbase or base layers","m³",{"$nulls":5},{"$f":"IF(ISNUMBER(H116),L116*H116,IF(ISNUMBER(J116),J116,IF(J116=\"RATE ONLY\",LOWER(\"RATE ONLY\"),\" \")))","v":" "}]
[]
["IHDR1","C5.3.9",{"$nulls":3},"Construction of a trial section:",{"$nulls":6},{"$f":"IF(ISNUMBER(H118),L118*H118,IF(ISNUMBER(J118),J118,IF(J118=\"RATE ONLY\",LOWER(\"RATE ONLY\"),\" \")))","v":" "}]
[]
["IHDR2",null,"C5.3.9.1",null,null,"Construction of a trial section using conventional methods of construction:",{"$nulls":6},{"$f":"IF(ISNUMBER(H120),L120*H120,IF(ISNUMBER(J120),J120,IF(J120=\"RATE ONLY\",LOWER(\"RATE ONLY\"),\" \")))","v":" "}]
[]
["Item",null,null,"(a)",null,"Stabilised gravel layer, 200mm thick, trial section","m³",{"$nulls":4},{"v":100,"d":"100.00"},{"$f":"IF(ISNUMBER(H122),L122*H122,IF(ISNUMBER(J122),J122,IF(J122=\"RATE ONLY\",LOWER(\"RATE ONLY\"),\" \")))","v":" "}]
[]
["Item",null,null,"(b)",null,"Crushed stone subbase layer, 150mm thick,  trial section","m³",{"$nulls":5}," "]
["Item",null,null,"(c)",null,"Crushed stone base layer, 150mm thick,  trial section","m³",{"$nulls":4},{"v":150,"d":"150.00"},{"$f":"IF(ISNUMBER(H125),L125*H125,IF(ISNUMBER(J125),J125,IF(J125=\"RATE ONLY\",LOWER(\"RATE ONLY\"),\" \")))","v":" "}]
[]
["Item",null,null,"(d)",null,"PMPL layer (layer thickness indicated) trial section","m³",{"$nulls":5}," "]
["Item",null,null,"(e)",null,"Bound macadam layer (layer thickness indicated) trial section","m³",{"$nulls":5}," "]
["Item",null,null,"(f)",null,"Any other","m³",{"$nulls":5}," "]
["IHDR2",null,"C5.3.9.2",null,null,"Construction of a trial section using labour enhancement methods:",{"$nulls":6},{"$f":"IF(ISNUMBER(H130),L130*H130,IF(ISNUMBER(J130),J130,IF(J130=\"RATE ONLY\",LOWER(\"RATE ONLY\"),\" \")))","v":" "}]
[]
["Item",null,null,"(a)",null,"Stabilised gravel layer (layer thickness indicated) trial section","m³",{"$nulls":5},{"$f":"IF(ISNUMBER(H132),L132*H132,IF(ISNUMBER(J132),J132,IF(J132=\"RATE ONLY\",LOWER(\"RATE ONLY\"),\" \")))","v":" "}]
["Item",null,null,"(b)",null,"Gravel base layer (layer thickness indicated) trial section","m³",{"$nulls":5}," "]
["Item",null,null,"(c)",null,"Bound macadam layer (layer thickness indicated) trial section","m³",{"$nulls":5}," "]
["Item",null,null,"(d)",null,"Any other","m³",{"$nulls":5}," "]
["IHDR1","C5.3.10",{"$nulls":3},"Removal of a completed trial section:",{"$nulls":6},{"$f":"IF(ISNUMBER(H136),L136*H136,IF(ISNUMBER(J136),J136,IF(J136=\"RATE ONLY\",LOWER(\"RATE ONLY\"),\" \")))","v":" "}]
[]
["Item",null,"C5.3.10.1",null,null,"Stabilised layer","m³",{"$nulls":4},{"v":75,"d":"75.00"},{"$f":"IF(ISNUMBER(H138),L138*H138,IF(ISNUMBER(J138),J138,IF(J138=\"RATE ONLY\",LOWER(\"RATE ONLY\"),\" \")))","v":" "}]
[]
["Item",null,"C5.3.10.2",null,null,"PMPL layer","m³",{"$nulls":5}," "]
["Item",null,"C5.3.10.3",null,null,"Crushed stone layer","m³",{"$nulls":4},{"v":60,"d":"60.00"},{"$f":"IF(ISNUMBER(H141),L141*H141,IF(ISNUMBER(J141),J141,IF(J141=\"RATE ONLY\",LOWER(\"RATE ONLY\"),\" \")))","v":" "}]
[]
["IHDR1","C5.3.11",{"$nulls":3},"Riding quality measurements:",{"$nulls":6},{"$f":"IF(ISNUMBER(H143),L143*H143,IF(ISNUMBER(J143),J143,IF(J143=\"RATE ONLY\",LOWER(\"RATE ONLY\"),\" \")))","v":" "}]
[]
["Item",null,"C5.3.11.1",null,null,"Using a 3,0 m straight edge","km",{"$nulls":5}," "]
["Item",null,"C5.3.11.2",null,null,"Using a rolling straight edge","km",{"$nulls":5}," "]
["Item",null,"C5.3.11.3",null,null,"Using an inertial profilometer","km",{"$nulls":4},{"v":3000,"d":"3,000.00"},{"$f":"IF(ISNUMBER(H147),L147*H147,IF(ISNUMBER(J147),J147,IF(J147=\"RATE ONLY\",LOWER(\"RATE ONLY\"),\" \")))","v":" "}]
[]
["IHDR1","C5.3.12",{"$nulls":3},"Surface regularity payment adjustments","prov sum",null,{"v":200000,"d":"200,000.00"},{"$f":"+I149","v":{"v":200000,"d":"200,000.00"}},null,{"v":200000,"d":"200,000.00"},{"$f":"IF(ISNUMBER(H149),L149*H149,IF(ISNUMBER(J149),J149,IF(J149=\"RATE ONLY\",LOWER(\"RATE ONLY\"),\" \")))","v":{"v":200000,"d":"200,000.00"}}]
{"$rows_empty":22}
["#BillEnd#"]
["#BillEnd#","TOTAL CARRIED FORWARD TO SUMMARY",{"$nulls":10},{"$f":"SUBTOTAL(9,M$7:M150)","v":{"v":200000,"d":"200,000.00"}}]
["#BillEnd#"]

{"sheet":"5.4","index":21,"n_rows":95,"n_cols":13,"rows_kept":95,"hidden":true}
["#BillSheet#"]
["#BillSheet#","C5.4","STABILISATION",{"$nulls":3},"\n",null,null,"SCHEDULE A",{"$f":"SUBTOTAL(9,M$7:M1080)","v":0},null,{"$f":"J2","v":"SCHEDULE A"}]
["#BillSheet#"]
["ColHDR"]
["ColHDR","ITEM",{"$nulls":3},"DESCRIPTION","UNIT","QTY","RATE","AMT",null,"RATE","AMOUNT"]
["ColHDR"]
[{"$nulls":5},"STABILISATION"]
["IHDR1","5.4.1",{"$nulls":3},"Pre-treatment of gravel layers:",{"$nulls":6},{"$f":"IF(ISNUMBER(H8),L8*H8,IF(ISNUMBER(J8),J8,IF(J8=\"RATE ONLY\",LOWER(\"RATE ONLY\"),\" \")))","v":" "}]
[]
["Item",null,"C5.4.1.1",null,null,"Pre-treatment of (insert layer thickness) gravel layer","m³",{"$nulls":5},{"$f":"IF(ISNUMBER(H10),L10*H10,IF(ISNUMBER(J10),J10,IF(J10=\"RATE ONLY\",LOWER(\"RATE ONLY\"),\" \")))","v":" "}]
["Item",null,"C5.4.1.2",null,null,"Pre-treatment of (insert layer thickness) gravel layer using labour enhanced methods of construction","m³",{"$nulls":5}," "]
["IHDR1","5.4.2",{"$nulls":3},"Chemical stabilisation:",{"$nulls":6},{"$f":"IF(ISNUMBER(H12),L12*H12,IF(ISNUMBER(J12),J12,IF(J12=\"RATE ONLY\",LOWER(\"RATE ONLY\"),\" \")))","v":" "}]
[]
["IHDR2",null,"C5.4.2.1",null,null,"Chemical stabilisation of pavement layers"," ",{"$nulls":5},{"$f":"IF(ISNUMBER(H14),L14*H14,IF(ISNUMBER(J14),J14,IF(J14=\"RATE ONLY\",LOWER(\"RATE ONLY\"),\" \")))","v":" "}]
[]
["Item",null,null,"(a)",null," 100mm thick,","m³",{"$nulls":4},{"v":13,"d":"13.00"},{"$f":"IF(ISNUMBER(H16),L16*H16,IF(ISNUMBER(J16),J16,IF(J16=\"RATE ONLY\",LOWER(\"RATE ONLY\"),\" \")))","v":" "}]
[]
["Item",null,null,"(b)",null," 200mm thick,","m³",{"$nulls":4},{"v":13,"d":"13.00"},{"$f":"IF(ISNUMBER(H18),L18*H18,IF(ISNUMBER(J18),J18,IF(J18=\"RATE ONLY\",LOWER(\"RATE ONLY\"),\" \")))","v":" "}]
[]
["Item",null,"C5.4.2.2",null,null,"Chemical stabilisation (layer thickness indicated) of pavement layers (layer to be stabilised indicated) using labour enhanced methods of construction","m³",{"$nulls":5}," "]
["IHDR1","5.4.3",{"$nulls":3},"Stabilised crushed stone PMPL layer: (pavement layer, type of material and source indicated)","m³",{"$nulls":5},{"$f":"IF(ISNUMBER(H21),L21*H21,IF(ISNUMBER(J21),J21,IF(J21=\"RATE ONLY\",LOWER(\"RATE ONLY\"),\" \")))","v":" "}]
[]
["IHDR1","5.4.4",{"$nulls":3},"Wet lean-mix concrete pavement PMPL layer (indicate specific pavement layer):","m³",{"$nulls":5},{"$f":"IF(ISNUMBER(H23),L23*H23,IF(ISNUMBER(J23),J23,IF(J23=\"RATE ONLY\",LOWER(\"RATE ONLY\"),\" \")))","v":" "}]
[]
["IHDR1","5.4.5",{"$nulls":3},"Cementitious stabilisation agents for pavement layers:",{"$nulls":6},{"$f":"IF(ISNUMBER(H25),L25*H25,IF(ISNUMBER(J25),J25,IF(J25=\"RATE ONLY\",LOWER(\"RATE ONLY\"),\" \")))","v":" "}]
[]
["IHDR2",null,"C5.4.5.1",null,null,"Addition of cementitious stabilisation agents for pavement layers:",{"$nulls":6},{"$f":"IF(ISNUMBER(H27),L27*H27,IF(ISNUMBER(J27),J27,IF(J27=\"RATE ONLY\",LOWER(\"RATE ONLY\"),\" \")))","v":" "}]
[]
["Item",null,null,"(a)",null,"Cement (for pavement layer) - CEM II 32.5","t",{"$nulls":4},{"v":5,"d":"5.00"},{"$f":"IF(ISNUMBER(H29),L29*H29,IF(ISNUMBER(J29),J29,IF(J29=\"RATE ONLY\",LOWER(\"RATE ONLY\"),\" \")))","v":" "}]
[]
["Item",null,null,"(b)",null,"And so forth for other agents (for pavement layers)","t",{"$nulls":5}," "]
["IHDR2",null,"C5.4.5.2",null,null,"Addition of cementitious stabilisation agents  for pavement layers and spreading the agent using bags and labour enhancement methods:",{"$nulls":6},{"$f":"IF(ISNUMBER(H32),L32*H32,IF(ISNUMBER(J32),J32,IF(J32=\"RATE ONLY\",LOWER(\"RATE ONLY\"),\" \")))","v":" "}]
[]
["Item",null,null,"(a)",null,"Cement (for pavement layer) - CEM II 32.5","t",{"$nulls":4},{"v":5,"d":"5.00"},{"$f":"IF(ISNUMBER(H34),L34*H34,IF(ISNUMBER(J34),J34,IF(J34=\"RATE ONLY\",LOWER(\"RATE ONLY\"),\" \")))","v":" "}]
[]
["Item",null,null,"(b)",null,"And so forth for other agents (for pavement layers)","t",{"$nulls":5}," "]
["IHDR1","5.4.6",{"$nulls":3},"Addition of cementitious stabilisation agents (specify agent separately) for a PMPL layer:",{"$nulls":6},{"$f":"IF(ISNUMBER(H37),L37*H37,IF(ISNUMBER(J37),J37,IF(J37=\"RATE ONLY\",LOWER(\"RATE ONLY\"),\" \")))","v":" "}]
[]
["Item",null,"C5.4.6.1",null,null,"Cement","t",{"$nulls":5}," "]
["Item",null,"C5.4.6.2",null,null,"And so forth for other agents","t",{"$nulls":5}," "]
["IHDR1","5.4.7",{"$nulls":3},"Bituminous stabilisation (layer thickness indicated) of pavement layers (stabilised layer to be indicated)","m³",{"$nulls":5},{"$f":"IF(ISNUMBER(H41),L41*H41,IF(ISNUMBER(J41),J41,IF(J41=\"RATE ONLY\",LOWER(\"RATE ONLY\"),\" \")))","v":" "}]
[]
["IHDR1","5.4.8",{"$nulls":3},"Bituminous stabilisation agent (specify agents separately):",{"$nulls":6},{"$f":"IF(ISNUMBER(H43),L43*H43,IF(ISNUMBER(J43),J43,IF(J43=\"RATE ONLY\",LOWER(\"RATE ONLY\"),\" \")))","v":" "}]
[]
["Item",null,"C5.4.8.1",null,null,"60 % anionic emulsion","litre",{"$nulls":5}," "]
["Item",null,"C5.4.8.2",null,null,"60 % cationic emulsion","litre",{"$nulls":5}," "]
["Item",null,"C5.4.8.3",null,null,"Foamed bitumen","litre",{"$nulls":5}," "]
["Item",null,"C5.4.8.4",null,null,"Any other","litre",{"$nulls":5}," "]
["IHDR1","5.4.9",{"$nulls":3},"Cementitious agent for bituminous stabilisation:",{"$nulls":6},{"$f":"IF(ISNUMBER(H49),L49*H49,IF(ISNUMBER(J49),J49,IF(J49=\"RATE ONLY\",LOWER(\"RATE ONLY\"),\" \")))","v":" "}]
[]
["Item",null,"C5.4.9.1",null,null,"Cementitious agent for bituminous stabilisation (specify agents separately)","t",{"$nulls":5}," "]
["Item",null,"C5.4.9.2",null,null,"Cementitious agent for bituminous stabilisation spreading the agent or filler using labour enhanced methods of construction (specify agents separately)","t",{"$nulls":5}," "]
["IHDR1","5.4.10",{"$nulls":3},"Provision and application of water for curing","kilolitre",{"$nulls":4},{"v":105,"d":"105.00"},{"$f":"IF(ISNUMBER(H53),L53*H53,IF(ISNUMBER(J53),J53,IF(J53=\"RATE ONLY\",LOWER(\"RATE ONLY\"),\" \")))","v":" "}]
[]
["IHDR1","5.4.11",{"$nulls":3},"Curing by covering with the subsequent layer","m²",{"$nulls":4},{"v":10,"d":"10.00"},{"$f":"IF(ISNUMBER(H55),L55*H55,IF(ISNUMBER(J55),J55,IF(J55=\"RATE ONLY\",LOWER(\"RATE ONLY\"),\" \")))","v":" "}]
[]
["IHDR1","5.4.12",{"$nulls":3},"Curing with a membrane (type of material to be specified):",{"$nulls":6},{"$f":"IF(ISNUMBER(H57),L57*H57,IF(ISNUMBER(J57),J57,IF(J57=\"RATE ONLY\",LOWER(\"RATE ONLY\"),\" \")))","v":" "}]
[]
["Item",null,"C5.4.12.1",null,null,"Cut back bitumen","litre",{"$nulls":5}," "]
["Item",null,"C5.4.12.2",null,null,"Inverted bitumen emulsion","litre",{"$nulls":5}," "]
["Item",null,"C5.4.12.3",null,null,"Spray grade emulsion","litre",{"$nulls":5}," "]
["Item",null,"C5.4.12.4",null,null,"Curing compound for PMPL layers","litre",{"$nulls":5}," "]
["IHDR1","5.4.13",{"$nulls":3},"Trial section for a PMPL layer (specify width)","m²",{"$nulls":5},{"$f":"IF(ISNUMBER(H63),L63*H63,IF(ISNUMBER(J63),J63,IF(J63=\"RATE ONLY\",LOWER(\"RATE ONLY\"),\" \")))","v":" "}]
[]
["IHDR1","5.4.14",{"$nulls":3},"Trial section for a chemically stabilised layer","m³",{"$nulls":4},{"v":20,"d":"20.00"},{"$f":"IF(ISNUMBER(H65),L65*H65,IF(ISNUMBER(J65),J65,IF(J65=\"RATE ONLY\",LOWER(\"RATE ONLY\"),\" \")))","v":" "}]
[]
["IHDR1","5.4.15",{"$nulls":3},"Trial section for a bituminously stabilised layer (specify width)","m²",{"$nulls":5},{"$f":"IF(ISNUMBER(H67),L67*H67,IF(ISNUMBER(J67),J67,IF(J67=\"RATE ONLY\",LOWER(\"RATE ONLY\"),\" \")))","v":" "}]
[]
["IHDR1","5.4.16",{"$nulls":3},"Mechanical modification","m³",{"$nulls":5},{"$f":"IF(ISNUMBER(H69),L69*H69,IF(ISNUMBER(J69),J69,IF(J69=\"RATE ONLY\",LOWER(\"RATE ONLY\"),\" \")))","v":" "}]
[]
["IHDR1","5.4.17",{"$nulls":3},"Addition of a soil binder","m³",{"$nulls":5},{"$f":"IF(ISNUMBER(H71),L71*H71,IF(ISNUMBER(J71),J71,IF(J71=\"RATE ONLY\",LOWER(\"RATE ONLY\"),\" \")))","v":" "}]
{"$rows_empty":21}
["#BillEnd#"]
["#BillEnd#","TOTAL CARRIED FORWARD TO SUMMARY",{"$nulls":10},{"$f":"SUBTOTAL(9,M$7:M72)","v":0}]
["#BillEnd#"]

{"sheet":"5.5","index":22,"n_rows":332,"n_cols":14,"rows_kept":332,"hidden":true}
["#BillSheet#"]
["#BillSheet#","C5.5","RECONSTRUCTION OF PAVEMENT LAYERS",{"$nulls":3},"\n",null,null,"SCHEDULE A",{"$f":"SUBTOTAL(9,M$7:M1304)","v":0},null,{"$f":"J2","v":"SCHEDULE A"}]
["#BillSheet#"]
["ColHDR"]
["ColHDR","ITEM",{"$nulls":3},"DESCRIPTION","UNIT","QTY","RATE","AMT",null,"RATE","AMOUNT"]
["ColHDR"]
[{"$nulls":5},"RECONSTRUCTION OF PAVEMENT LAYERS"]
["IHDR1","C5.5.1",{"$nulls":3},"Compiling and implementing M&U plans for the reconstruction of an existing road pavement","No.",{"$nulls":4},{"v":50000,"d":"50,000.00"},{"$f":"IF(ISNUMBER(H8),L8*H8,IF(ISNUMBER(J8),J8,IF(J8=\"RATE ONLY\",LOWER(\"RATE ONLY\"),\" \")))","v":" "}]
[]
["IHDR1","C5.5.2",{"$nulls":3},"Reconstruction preparatory work:",{"$nulls":6},{"$f":"IF(ISNUMBER(H10),L10*H10,IF(ISNUMBER(J10),J10,IF(J10=\"RATE ONLY\",LOWER(\"RATE ONLY\"),\" \")))","v":" "}]
[]
["IHDR2",null,"C5.5.2.1",null,null,"Undivided carriageway:",{"$nulls":6},{"$f":"IF(ISNUMBER(H12),L12*H12,IF(ISNUMBER(J12),J12,IF(J12=\"RATE ONLY\",LOWER(\"RATE ONLY\"),\" \")))","v":" "}]
[]
["Item",null,null,"(a)",null,"Uniform section from km__________ to km __________","km",{"$nulls":5},{"$f":"IF(ISNUMBER(H14),L14*H14,IF(ISNUMBER(J14),J14,IF(J14=\"RATE ONLY\",LOWER(\"RATE ONLY\"),\" \")))","v":" "}]
["Item",null,null,"(b)",null,"Uniform section from km__________ to km __________","km",{"$nulls":5}," "]
["Item",null,null,"(c)",null,"Additional uniform sections","km",{"$nulls":5}," "]
["IHDR2",null,"C5.5.2.2",null,null,"Divided carriageway:",{"$nulls":6},{"$f":"IF(ISNUMBER(H17),L17*H17,IF(ISNUMBER(J17),J17,IF(J17=\"RATE ONLY\",LOWER(\"RATE ONLY\"),\" \")))","v":" "}]
[]
["Item",null,null,"(a)",null,"Uniform section from km 89.16 to km 112","km",{"$nulls":4},{"v":10000,"d":"10,000.00"},{"$f":"IF(ISNUMBER(H19),L19*H19,IF(ISNUMBER(J19),J19,IF(J19=\"RATE ONLY\",LOWER(\"RATE ONLY\"),\" \")))","v":" "}]
[]
["Item",null,null,"(b)",null,"Uniform section from km__________ to km __________","km",{"$nulls":5}," "]
["Item",null,null,"(c)",null,"Additional uniform sections","km",{"$nulls":5}," "]
["IHDR1","C5.5.3",{"$nulls":3},"Construction equipment for sampling of in-situ material for mix design procedure","No.",{"$nulls":5},{"$f":"IF(ISNUMBER(H23),L23*H23,IF(ISNUMBER(J23),J23,IF(J23=\"RATE ONLY\",LOWER(\"RATE ONLY\"),\" \")))","v":" "}]
[]
["IHDR1","C5.5.4",{"$nulls":3},"Sampling of in-situ material for mix design procedure","No.",{"$nulls":5},{"$f":"IF(ISNUMBER(H25),L25*H25,IF(ISNUMBER(J25),J25,IF(J25=\"RATE ONLY\",LOWER(\"RATE ONLY\"),\" \")))","v":" "}]
[]
["IHDR1","C5.5.5",{"$nulls":3},"Construction of a trial section using a recycler","m³",{"$nulls":4},{"v":45,"d":"45.00"},{"$f":"IF(ISNUMBER(H27),L27*H27,IF(ISNUMBER(J27),J27,IF(J27=\"RATE ONLY\",LOWER(\"RATE ONLY\"),\" \")))","v":" "}]
[]
["IHDR1","C5.5.6",{"$nulls":3},"Construction of a trial section using conventional construction equipment","m³",{"$nulls":5},{"$f":"IF(ISNUMBER(H29),L29*H29,IF(ISNUMBER(J29),J29,IF(J29=\"RATE ONLY\",LOWER(\"RATE ONLY\"),\" \")))","v":" "}]
[]
["IHDR1","C5.5.7",{"$nulls":3},"Pre-milling existing wearing course material:",{"$nulls":6},{"$f":"IF(ISNUMBER(H31),L31*H31,IF(ISNUMBER(J31),J31,IF(J31=\"RATE ONLY\",LOWER(\"RATE ONLY\"),\" \")))","v":" "}]
[]
["Item",null,"C5.5.7.1",null,null,"Pre-milling an asphalt wearing course (depth of pre-milling varies between 10 mm and 40 mm maximum).","m²",{"$nulls":5}," "]
["Item",null,"C5.5.7.2",null,null,"Pre-milling a seal wearing course (depth of pre-milling varies between 10 mm and 25 mm)","m²",{"$nulls":5}," "]
["IHDR1","C5.5.8",{"$nulls":3},"Pre-pulverising material in the existing pavement:",{"$nulls":6},{"$f":"IF(ISNUMBER(H35),L35*H35,IF(ISNUMBER(J35),J35,IF(J35=\"RATE ONLY\",LOWER(\"RATE ONLY\"),\" \")))","v":" "}]
[]
["Item",null,"C5.5.8.1",null,null,"Asphalt wearing course (specify nominal depth)","m³",{"$nulls":5}," "]
["Item",null,"C5.5.8.2",null,null,"Crushed stone base (specify nominal depth)","m³",{"$nulls":5}," "]
["Item",null,"C5.5.8.3",null,null,"Stabilised crushed stone (specify nominal depth)","m³",{"$nulls":5}," "]
["Item",null,"C5.5.8.4",null,null,"Stabilised gravel layer (specify nominal depth)","m³",{"$nulls":5}," "]
["IHDR1","C5.5.9",{"$nulls":3},"Temporarily blading layer material to windrow","m³",{"$nulls":5},{"$f":"IF(ISNUMBER(H41),L41*H41,IF(ISNUMBER(J41),J41,IF(J41=\"RATE ONLY\",LOWER(\"RATE ONLY\"),\" \")))","v":" "}]
[]
["IHDR1","C5.5.10",{"$nulls":3},"Roller-pass compaction of an exposed pavement layer:",{"$nulls":6},{"$f":"IF(ISNUMBER(H43),L43*H43,IF(ISNUMBER(J43),J43,IF(J43=\"RATE ONLY\",LOWER(\"RATE ONLY\"),\" \")))","v":" "}]
[]
["Item",null,"C5.5.10.1",null,null,"Smooth drum vibratory rollers","m²",{"$nulls":5}," "]
["Item",null,"C5.5.10.2",null,null,"Other vibratory rollers. (specify ____________)","m²",{"$nulls":5}," "]
["Item",null,"C5.5.10.3",null,null,"Pneumatic rollers","m²",{"$nulls":5}," "]
["Item",null,"C5.5.10.4",null,null,"Other rollers. (specify _____________)","m²",{"$nulls":5}," "]
["IHDR1","C5.5.11",{"$nulls":3},"Watering the exposed pavement layer","kilolitre",{"$nulls":5},{"$f":"IF(ISNUMBER(H49),L49*H49,IF(ISNUMBER(J49),J49,IF(J49=\"RATE ONLY\",LOWER(\"RATE ONLY\"),\" \")))","v":" "}]
[]
["IHDR1","C5.5.12",{"$nulls":3},"Removal of surplus material from site","m³",{"$nulls":5},{"$f":"IF(ISNUMBER(H51),L51*H51,IF(ISNUMBER(J51),J51,IF(J51=\"RATE ONLY\",LOWER(\"RATE ONLY\"),\" \")))","v":" "}]
[]
["IHDR1","C5.5.13",{"$nulls":3},"Cross mixing of material (specify nominal depth)","m³",{"$nulls":5},{"$f":"IF(ISNUMBER(H53),L53*H53,IF(ISNUMBER(J53),J53,IF(J53=\"RATE ONLY\",LOWER(\"RATE ONLY\"),\" \")))","v":" "}]
[]
["IHDR1","C5.5.14",{"$nulls":3},"In-situ reconstruction of a pavement layer using a recycler to construct a stabilised selected layer:",{"$nulls":6},{"$f":"IF(ISNUMBER(H55),L55*H55,IF(ISNUMBER(J55),J55,IF(J55=\"RATE ONLY\",LOWER(\"RATE ONLY\"),\" \")))","v":" "}]
[]
["IHDR2",null,"C5.5.14.1",null,null,"Chemically stabilised selected layer compacted to 95 % of MDD:",{"$nulls":6},{"$f":"IF(ISNUMBER(H57),L57*H57,IF(ISNUMBER(J57),J57,IF(J57=\"RATE ONLY\",LOWER(\"RATE ONLY\"),\" \")))","v":" "},"change to gravel selected layer"]
[]
["Item",null,null,"(a)",null,"Using non-cemented material compacted to _________ mm thick","m³",{"$nulls":5},{"$f":"IF(ISNUMBER(H59),L59*H59,IF(ISNUMBER(J59),J59,IF(J59=\"RATE ONLY\",LOWER(\"RATE ONLY\"),\" \")))","v":" "}]
["Item",null,null,"(b)",null,"Using cemented material compacted to _________ mm thick","m³",{"$nulls":5}," "]
["Item",null,null,"(c)",null,"Using a combination of non-cemented and cemented material compacted to _________ mm thick","m³",{"$nulls":5}," "]
["Item",null,null,"(d)",null,"Using pre-pulverised material (as per item C5.5.8) compacted to __________ mm thick","m³",{"$nulls":5}," "]
["IHDR2",null,"C5.5.14.2",null,null,"Emulsion stabilised selected layer compacted to 95 % of MDD:",{"$nulls":6},{"$f":"IF(ISNUMBER(H63),L63*H63,IF(ISNUMBER(J63),J63,IF(J63=\"RATE ONLY\",LOWER(\"RATE ONLY\"),\" \")))","v":" "}]
[]
["Item",null,null,"(a)",null,"Using non-cemented material compacted to _________ mm thick","m³",{"$nulls":5}," "]
["Item",null,null,"(b)",null,"Using cemented material compacted to _________ mm thick","m³",{"$nulls":5}," "]
["Item",null,null,"(c)",null,"Using a combination of non-cemented and cemented material compacted to _________ mm thick","m³",{"$nulls":5}," "]
["Item",null,null,"(d)",null,"Using pre-pulverised material (as per item C5.5.8) compacted to __________ mm thick","m³",{"$nulls":5}," "]
["IHDR2",null,"C5.5.14.3",null,null,"Foam stabilised selected layer compacted to 95 % of MDD:",{"$nulls":6},{"$f":"IF(ISNUMBER(H69),L69*H69,IF(ISNUMBER(J69),J69,IF(J69=\"RATE ONLY\",LOWER(\"RATE ONLY\"),\" \")))","v":" "}]
[]
["Item",null,null,"(a)",null,"Using non-cemented material compacted to _________ mm thick","m³",{"$nulls":5}," "]
["Item",null,null,"(b)",null,"Using cemented material compacted to _________ mm thick","m³",{"$nulls":5}," "]
["Item",null,null,"(c)",null,"Using a combination of non-cemented and cemented material compacted to _________ mm thick","m³",{"$nulls":5}," "]
["Item",null,null,"(d)",null,"Using pre-pulverised material (as per item C5.5.8) compacted to __________ mm thick","m³",{"$nulls":5}," "]
["IHDR1","C5.5.15",{"$nulls":3},"In-situ reconstruction of a pavement layer using a recycler to construct a stabilised subbase layer:",{"$nulls":6},{"$f":"IF(ISNUMBER(H75),L75*H75,IF(ISNUMBER(J75),J75,IF(J75=\"RATE ONLY\",LOWER(\"RATE ONLY\"),\" \")))","v":" "}]
[]
["IHDR2",null,"C5.5.15.1",null,null,"Chemically stabilised subbase layer compacted to 97 % of MDD:",{"$nulls":6},{"$f":"IF(ISNUMBER(H77),L77*H77,IF(ISNUMBER(J77),J77,IF(J77=\"RATE ONLY\",LOWER(\"RATE ONLY\"),\" \")))","v":" "}]
[]
["IHDR3",null,null,"(a)",null,"Using non-cemented material: ",{"$nulls":6},{"$f":"IF(ISNUMBER(H79),L79*H79,IF(ISNUMBER(J79),J79,IF(J79=\"RATE ONLY\",LOWER(\"RATE ONLY\"),\" \")))","v":" "}]
[]
["Item",{"$nulls":3},"(i)","Compacted to 100mm thick","m³",{"$nulls":4},{"v":15,"d":"15.00"},{"$f":"IF(ISNUMBER(H81),L81*H81,IF(ISNUMBER(J81),J81,IF(J81=\"RATE ONLY\",LOWER(\"RATE ONLY\"),\" \")))","v":" "}]
[]
["Item",{"$nulls":3},"(ii)","Compacted to 200mm thick","m³",{"$nulls":4},{"v":15,"d":"15.00"},{"$f":"IF(ISNUMBER(H83),L83*H83,IF(ISNUMBER(J83),J83,IF(J83=\"RATE ONLY\",LOWER(\"RATE ONLY\"),\" \")))","v":" "}]
[]
["IHDR3",null,null,"(b)",null,"Using cemented material:",{"$nulls":6},{"$f":"IF(ISNUMBER(H85),L85*H85,IF(ISNUMBER(J85),J85,IF(J85=\"RATE ONLY\",LOWER(\"RATE ONLY\"),\" \")))","v":" "}]
[]
["Item",{"$nulls":3},"(i)","Compacted to 100mm thick","m³",{"$nulls":4},{"v":18,"d":"18.00"},{"$f":"IF(ISNUMBER(H87),L87*H87,IF(ISNUMBER(J87),J87,IF(J87=\"RATE ONLY\",LOWER(\"RATE ONLY\"),\" \")))","v":" "}]
[]
["Item",{"$nulls":3},"(ii)","Compacted to 200mm thick","m³",{"$nulls":4},{"v":20,"d":"20.00"},{"$f":"IF(ISNUMBER(H89),L89*H89,IF(ISNUMBER(J89),J89,IF(J89=\"RATE ONLY\",LOWER(\"RATE ONLY\"),\" \")))","v":" "}]
[]
["IHDR3",null,null,"(c)",null,"Using a combination of non-cemented and cemented material compacted to _________ mm thick","m³",{"$nulls":5},{"$f":"IF(ISNUMBER(H91),L91*H91,IF(ISNUMBER(J91),J91,IF(J91=\"RATE ONLY\",LOWER(\"RATE ONLY\"),\" \")))","v":" "}]
[]
["IHDR3",null,null,"(d)",null,"Using pre-pulverised material (as per item C5.5.8) compacted to __________ mm thick","m³",{"$nulls":5},{"$f":"IF(ISNUMBER(H93),L93*H93,IF(ISNUMBER(J93),J93,IF(J93=\"RATE ONLY\",LOWER(\"RATE ONLY\"),\" \")))","v":" "}]
[]
["IHDR2",null,"C5.5.15.2",null,null,"Emulsion stabilised subbase layer compacted to 97 % of MDD:",{"$nulls":6},{"$f":"IF(ISNUMBER(H95),L95*H95,IF(ISNUMBER(J95),J95,IF(J95=\"RATE ONLY\",LOWER(\"RATE ONLY\"),\" \")))","v":" "}]
[]
["Item",null,null,"(a)",null,"Using non-cemented material compacted to _________ mm thick","m³",{"$nulls":5},{"$f":"IF(ISNUMBER(H97),L97*H97,IF(ISNUMBER(J97),J97,IF(J97=\"RATE ONLY\",LOWER(\"RATE ONLY\"),\" \")))","v":" "}]
["Item",null,null,"(b)",null,"Using cemented material compacted to _________ mm thick","m³",{"$nulls":5}," "]
["Item",null,null,"(c)",null,"Using a combination of non-cemented and cemented material compacted to _________ mm thick","m³",{"$nulls":5}," "]
["Item",null,null,"(d)",null,"Using pre-pulverised material (as per item C5.5.8) compacted to __________ mm thick","m³",{"$nulls":5}," "]
["IHDR2",null,"C5.5.15.3",null,null,"Foam stabilised subbase layer compacted to 97 % of MDD:",{"$nulls":6},{"$f":"IF(ISNUMBER(H101),L101*H101,IF(ISNUMBER(J101),J101,IF(J101=\"RATE ONLY\",LOWER(\"RATE ONLY\"),\" \")))","v":" "}]
[]
["Item",null,null,"(a)",null,"Using non-cemented material compacted to _________ mm thick","m³",{"$nulls":5}," "]
["Item",null,null,"(b)",null,"Using cemented material compacted to _________ mm thick","m³",{"$nulls":5}," "]
["Item",null,null,"(c)",null,"Using a combination of non-cemented and cemented material compacted to _________ mm thick","m³",{"$nulls":5}," "]
["Item",null,null,"(d)",null,"Using pre-pulverised material (as per item C5.5.8) compacted to __________ mm thick","m³",{"$nulls":5}," "]
["IHDR2",null,"PC5.5.15.4",null,null,"Chemically stabilised subbase layer compacted to 95 % of MDD:",{"$nulls":6},{"$f":"IF(ISNUMBER(H107),L107*H107,IF(ISNUMBER(J107),J107,IF(J107=\"RATE ONLY\",LOWER(\"RATE ONLY\"),\" \")))","v":" "}]
[]
["Item",null,null,"(a)"," ","Using non-cemented material compacted to 200mm thick","m³",{"$nulls":4},{"v":20,"d":"20.00"},{"$f":"IF(ISNUMBER(H109),L109*H109,IF(ISNUMBER(J109),J109,IF(J109=\"RATE ONLY\",LOWER(\"RATE ONLY\"),\" \")))","v":" "}]
[]
["Item",null,null,"(b)"," ","Using cemented material compacted to 200 mm thick","m³",{"$nulls":4},{"v":20,"d":"20.00"},{"$f":"IF(ISNUMBER(H111),L111*H111,IF(ISNUMBER(J111),J111,IF(J111=\"RATE ONLY\",LOWER(\"RATE ONLY\"),\" \")))","v":" "}]
[]
["IHDR1","C5.5.16",{"$nulls":3},"In-situ reconstruction of a pavement layer using a recycler to construct a stabilised base layer:",{"$nulls":6},{"$f":"IF(ISNUMBER(H113),L113*H113,IF(ISNUMBER(J113),J113,IF(J113=\"RATE ONLY\",LOWER(\"RATE ONLY\"),\" \")))","v":" "}]
[]
["IHDR2",null,"C5.5.16.1",null,null,"Chemically stabilised base layer compacted to 100 % of MDD:",{"$nulls":6},{"$f":"IF(ISNUMBER(H115),L115*H115,IF(ISNUMBER(J115),J115,IF(J115=\"RATE ONLY\",LOWER(\"RATE ONLY\"),\" \")))","v":" "}]
[]
["Item",null,null,"(a)",null,"Using non-cemented material compacted to _________ mm thick","m³",{"$nulls":5},{"$f":"IF(ISNUMBER(H117),L117*H117,IF(ISNUMBER(J117),J117,IF(J117=\"RATE ONLY\",LOWER(\"RATE ONLY\"),\" \")))","v":" "}]
["Item",null,null,"(b)",null,"Using cemented material compacted to _________ mm thick","m³",{"$nulls":5}," "]
["Item",null,null,"(c)",null,"Using a combination of non-cemented and cemented material compacted to _________ mm thick","m³",{"$nulls":5}," "]
["Item",null,null,"(d)",null,"Using pre-pulverised material (as per item C5.5.8) compacted to __________ mm thick","m³",{"$nulls":5}," "]
["IHDR2",null,"C5.5.16.2",null,null,"Emulsion stabilised subbase layer compacted to 102 % of MDD:",{"$nulls":6},{"$f":"IF(ISNUMBER(H121),L121*H121,IF(ISNUMBER(J121),J121,IF(J121=\"RATE ONLY\",LOWER(\"RATE ONLY\"),\" \")))","v":" "}]
[]
["Item",null,null,"(a)",null,"Using non-cemented material compacted to _________ mm thick","m³",{"$nulls":5}," "]
["Item",null,null,"(b)",null,"Using cemented material compacted to _________ mm thick","m³",{"$nulls":5}," "]
["Item",null,null,"(c)",null,"Using a combination of non-cemented and cemented material compacted to _________ mm thick","m³",{"$nulls":5}," "]
["Item",null,null,"(d)",null,"Using pre-pulverised material (as per item C5.5.8) compacted to __________ mm thick","m³",{"$nulls":5}," "]
["IHDR2",null,"C5.5.16.3",null,null,"Foam stabilised subbase layer compacted to 102 % of MDD:",{"$nulls":6},{"$f":"IF(ISNUMBER(H127),L127*H127,IF(ISNUMBER(J127),J127,IF(J127=\"RATE ONLY\",LOWER(\"RATE ONLY\"),\" \")))","v":" "}]
[]
["Item",null,null,"(a)",null,"Using non-cemented material compacted to _________ mm thick","m³",{"$nulls":5}," "]
["Item",null,null,"(b)",null,"Using cemented material compacted to _________ mm thick","m³",{"$nulls":5}," "]
["Item",null,null,"(c)",null,"Using a combination of non-cemented and cemented material compacted to _________ mm thick","m³",{"$nulls":5}," "]
["Item",null,null,"(d)",null,"Using pre-pulverised material (as per item C5.5.8) compacted to __________ mm thick","m³",{"$nulls":5}," "]
["IHDR1","C5.5.17",{"$nulls":3},"In-situ reconstruction of a pavement layer using conventional construction equipment to construct a stabilised selected layer:",{"$nulls":6},{"$f":"IF(ISNUMBER(H133),L133*H133,IF(ISNUMBER(J133),J133,IF(J133=\"RATE ONLY\",LOWER(\"RATE ONLY\"),\" \")))","v":" "}]
[]
["IHDR2",null,"C5.5.17.1",null,null,"Chemically stabilised selected layer compacted to 95 % of MDD:",{"$nulls":6},{"$f":"IF(ISNUMBER(H135),L135*H135,IF(ISNUMBER(J135),J135,IF(J135=\"RATE ONLY\",LOWER(\"RATE ONLY\"),\" \")))","v":" "}]
[]
["Item",null,null,"(a)",null,"Using non-cemented material compacted to _________ mm thick","m³",{"$nulls":5}," "]
["Item",null,null,"(b)",null,"Using cemented material compacted to _________ mm thick","m³",{"$nulls":5}," "]
["Item",null,null,"(c)",null,"Using a combination of non-cemented and cemented material compacted to _________ mm thick","m³",{"$nulls":5}," "]
["Item",null,null,"(d)",null,"Using pre-pulverised material (as per item C5.5.8) compacted to __________ mm thick","m³",{"$nulls":5}," "]
["IHDR2",null,"C5.5.17.2",null,null,"Emulsion stabilised selected layer compacted to 95 % of MDD:",{"$nulls":6},{"$f":"IF(ISNUMBER(H141),L141*H141,IF(ISNUMBER(J141),J141,IF(J141=\"RATE ONLY\",LOWER(\"RATE ONLY\"),\" \")))","v":" "}]
[]
["Item",null,null,"(a)",null,"Using non-cemented material compacted to _________ mm thick","m³",{"$nulls":5}," "]
["Item",null,null,"(b)",null,"Using cemented material compacted to _________ mm thick","m³",{"$nulls":5}," "]
["Item",null,null,"(c)",null,"Using a combination of non-cemented and cemented material compacted to _________ mm thick","m³",{"$nulls":5}," "]
["Item",null,null,"(d)",null,"Using pre-pulverised material (as per item C5.5.8) compacted to __________ mm thick","m³",{"$nulls":5}," "]
["IHDR2",null,"C5.5.17.3",null,null,"Foam stabilised selected layer compacted to 95 % of MDD:",{"$nulls":6},{"$f":"IF(ISNUMBER(H147),L147*H147,IF(ISNUMBER(J147),J147,IF(J147=\"RATE ONLY\",LOWER(\"RATE ONLY\"),\" \")))","v":" "}]
[]
["Item",null,null,"(a)",null,"Using non-cemented material compacted to _________ mm thick","m³",{"$nulls":5}," "]
["Item",null,null,"(b)",null,"Using cemented material compacted to _________ mm thick","m³",{"$nulls":5}," "]
["Item",null,null,"(c)",null,"Using a combination of non-cemented and cemented material compacted to _________ mm thick","m³",{"$nulls":5}," "]
["Item",null,null,"(d)",null,"Using pre-pulverised material (as per item C5.5.8) compacted to __________ mm thick","m³",{"$nulls":5}," "]
["IHDR1","C5.5.18",{"$nulls":3},"In-situ reconstruction of a pavement layer using conventional construction equipment to construct a stabilised subbase layer:",{"$nulls":6},{"$f":"IF(ISNUMBER(H153),L153*H153,IF(ISNUMBER(J153),J153,IF(J153=\"RATE ONLY\",LOWER(\"RATE ONLY\"),\" \")))","v":" "}]
[]
["IHDR2",null,"C5.5.18.1",null,null,"Chemically stabilised subbase layer compacted to 97 % of MDD:",{"$nulls":6},{"$f":"IF(ISNUMBER(H155),L155*H155,IF(ISNUMBER(J155),J155,IF(J155=\"RATE ONLY\",LOWER(\"RATE ONLY\"),\" \")))","v":" "}]
[]
["Item",null,null,"(a)",null,"Using non-cemented material compacted to _________ mm thick","m³",{"$nulls":5},{"$f":"IF(ISNUMBER(H157),L157*H157,IF(ISNUMBER(J157),J157,IF(J157=\"RATE ONLY\",LOWER(\"RATE ONLY\"),\" \")))","v":" "}]
["Item",null,null,"(b)",null,"Using cemented material compacted to _________ mm thick","m³",{"$nulls":5}," "]
["Item",null,null,"(c)",null,"Using a combination of non-cemented and cemented material compacted to _________ mm thick","m³",{"$nulls":5}," "]
["Item",null,null,"(d)",null,"Using pre-pulverised material (as per item C5.5.8) compacted to __________ mm thick","m³",{"$nulls":5}," "]
["IHDR2",null,"C5.5.18.2",null,null,"Emulsion stabilised subbase layer compacted to 97 % of MDD:",{"$nulls":6},{"$f":"IF(ISNUMBER(H161),L161*H161,IF(ISNUMBER(J161),J161,IF(J161=\"RATE ONLY\",LOWER(\"RATE ONLY\"),\" \")))","v":" "}]
[]
["Item",null,null,"(a)",null,"Using non-cemented material compacted to _________ mm thick","m³",{"$nulls":5}," "]
["Item",null,null,"(b)",null,"Using cemented material compacted to _________ mm thick","m³",{"$nulls":5}," "]
["Item",null,null,"(c)",null,"Using a combination of non-cemented and cemented material compacted to _________ mm thick","m³",{"$nulls":5}," "]
["Item",null,null,"(d)",null,"Using pre-pulverised material (as per item C5.5.8) compacted to __________ mm thick","m³",{"$nulls":5}," "]
["IHDR2",null,"C5.5.18.3",null,null,"Foam stabilised subbase layer compacted to 97 % of MDD:",{"$nulls":6},{"$f":"IF(ISNUMBER(H167),L167*H167,IF(ISNUMBER(J167),J167,IF(J167=\"RATE ONLY\",LOWER(\"RATE ONLY\"),\" \")))","v":" "}]
[]
["Item",null,null,"(a)",null,"Using non-cemented material compacted to _________ mm thick","m³",{"$nulls":5}," "]
["Item",null,null,"(b)",null,"Using cemented material compacted to _________ mm thick","m³",{"$nulls":5}," "]
["Item",null,null,"(c)",null,"Using a combination of non-cemented and cemented material compacted to _________ mm thick","m³",{"$nulls":5}," "]
["Item",null,null,"(d)",null,"Using pre-pulverised material (as per item C5.5.8) compacted to __________ mm thick","m³",{"$nulls":5}," "]
["IHDR1","C5.5.19",{"$nulls":3},"In-situ reconstruction of a pavement layer using conventional construction equipment to construct a stabilised base layer:",{"$nulls":6},{"$f":"IF(ISNUMBER(H173),L173*H173,IF(ISNUMBER(J173),J173,IF(J173=\"RATE ONLY\",LOWER(\"RATE ONLY\"),\" \")))","v":" "}]
[]
["IHDR2",null,"C5.5.19.1",null,null,"Chemically stabilised base layer compacted to 98 % of MDD:",{"$nulls":6},{"$f":"IF(ISNUMBER(H175),L175*H175,IF(ISNUMBER(J175),J175,IF(J175=\"RATE ONLY\",LOWER(\"RATE ONLY\"),\" \")))","v":" "}]
[]
["Item",null,null,"(a)",null,"Using non-cemented material compacted to _________ mm thick","m³",{"$nulls":5}," "]
["Item",null,null,"(b)",null,"Using cemented material compacted to _________ mm thick","m³",{"$nulls":5}," "]
["Item",null,null,"(c)",null,"Using a combination of non-cemented and cemented material compacted to _________ mm thick","m³",{"$nulls":5}," "]
["Item",null,null,"(d)",null,"Using pre-pulverised material (as per item C5.5.8) compacted to __________ mm thick","m³",{"$nulls":5}," "]
["IHDR2",null,"C5.5.19.2",null,null,"Emulsion stabilised base layer compacted to 102 % of MDD:",{"$nulls":6},{"$f":"IF(ISNUMBER(H181),L181*H181,IF(ISNUMBER(J181),J181,IF(J181=\"RATE ONLY\",LOWER(\"RATE ONLY\"),\" \")))","v":" "}]
[]
["Item",null,null,"(a)",null,"Using non-cemented material compacted to _________ mm thick","m³",{"$nulls":5}," "]
["Item",null,null,"(b)",null,"Using cemented material compacted to _________ mm thick","m³",{"$nulls":5}," "]
["Item",null,null,"(c)",null,"Using a combination of non-cemented and cemented material compacted to _________ mm thick","m³",{"$nulls":5}," "]
["Item",null,null,"(d)",null,"Using pre-pulverised material (as per item C5.5.8) compacted to __________ mm thick","m³",{"$nulls":5}," "]
["IHDR2",null,"C5.5.19.3",null,null,"Foam stabilised base layer compacted to 102 % of MDD:",{"$nulls":6},{"$f":"IF(ISNUMBER(H187),L187*H187,IF(ISNUMBER(J187),J187,IF(J187=\"RATE ONLY\",LOWER(\"RATE ONLY\"),\" \")))","v":" "}]
[]
["Item",null,null,"(a)",null,"Using non-cemented material compacted to _________ mm thick","m³",{"$nulls":5}," "]
["Item",null,null,"(b)",null,"Using cemented material compacted to _________ mm thick","m³",{"$nulls":5}," "]
["Item",null,null,"(c)",null,"Using a combination of non-cemented and cemented material compacted to _________ mm thick","m³",{"$nulls":5}," "]
["Item",null,null,"(d)",null,"Using pre-pulverised material (as per item C5.5.8) compacted to __________ mm thick","m³",{"$nulls":5}," "]
["IHDR1","C5.5.20",{"$nulls":3},"Material shortfall or make-up material:",{"$nulls":6},{"$f":"IF(ISNUMBER(H193),L193*H193,IF(ISNUMBER(J193),J193,IF(J193=\"RATE ONLY\",LOWER(\"RATE ONLY\"),\" \")))","v":" "}]
[]
["Item",null,"C5.5.20.1",null,null,"For selected layer","m³",{"$nulls":4},{"v":65,"d":"65.00"},{"$f":"IF(ISNUMBER(H195),L195*H195,IF(ISNUMBER(J195),J195,IF(J195=\"RATE ONLY\",LOWER(\"RATE ONLY\"),\" \")))","v":" "}]
[]
["Item",null,"C5.5.20.2",null,null,"For subbase layer","m³",{"$nulls":4},{"v":91,"d":"91.00"},{"$f":"IF(ISNUMBER(H197),L197*H197,IF(ISNUMBER(J197),J197,IF(J197=\"RATE ONLY\",LOWER(\"RATE ONLY\"),\" \")))","v":" "}]
[]
["Item",null,"C5.5.20.3",null,null,"For base layer","m³",{"$nulls":5},{"$f":"IF(ISNUMBER(H199),L199*H199,IF(ISNUMBER(J199),J199,IF(J199=\"RATE ONLY\",LOWER(\"RATE ONLY\"),\" \")))","v":" "}]
["IHDR1","C5.5.21",{"$nulls":3},"Finishing the stabilised layer:",{"$nulls":6},{"$f":"IF(ISNUMBER(H200),L200*H200,IF(ISNUMBER(J200),J200,IF(J200=\"RATE ONLY\",LOWER(\"RATE ONLY\"),\" \")))","v":" "}]
[]
["IHDR2",null,"C5.5.21.1",null,null,"Slush trial section with:",{"$nulls":6},{"$f":"IF(ISNUMBER(H202),L202*H202,IF(ISNUMBER(J202),J202,IF(J202=\"RATE ONLY\",LOWER(\"RATE ONLY\"),\" \")))","v":" "}]
[]
["Item",null,null,"(a)",null,"Water","m²",{"$nulls":5}," "]
["Item",null,null,"(b)",null,"Diluted emulsion","m²",{"$nulls":5}," "]
["IHDR2",null,"C5.5.21.2",null,null,"Slush reconstructed section with:",{"$nulls":6},{"$f":"IF(ISNUMBER(H206),L206*H206,IF(ISNUMBER(J206),J206,IF(J206=\"RATE ONLY\",LOWER(\"RATE ONLY\"),\" \")))","v":" "}]
[]
["Item",null,null,"(a)",null,"Water","m²",{"$nulls":5}," "]
["Item",null,null,"(b)",null,"Diluted emulsion","m²",{"$nulls":5}," "]
["IHDR2",null,"C5.5.21.3",null,null,"Application of a diluted emulsion spray","litre",{"$nulls":5},{"$f":"IF(ISNUMBER(H210),L210*H210,IF(ISNUMBER(J210),J210,IF(J210=\"RATE ONLY\",LOWER(\"RATE ONLY\"),\" \")))","v":" "}]
[]
["IHDR1","C5.5.22",{"$nulls":3},"Excavate pavement layers for patching in existing pavements:",{"$nulls":6},{"$f":"IF(ISNUMBER(H212),L212*H212,IF(ISNUMBER(J212),J212,IF(J212=\"RATE ONLY\",LOWER(\"RATE ONLY\"),\" \")))","v":" "}]
[]
["IHDR2",null,"C5.5.22.1",null,null,"Excavate the following layers:",{"$nulls":6},{"$f":"IF(ISNUMBER(H214),L214*H214,IF(ISNUMBER(J214),J214,IF(J214=\"RATE ONLY\",LOWER(\"RATE ONLY\"),\" \")))","v":" "}]
[]
["IHDR3",null,null,"(a)",null,"Asphalt layers with a surface area:",{"$nulls":6},{"$f":"IF(ISNUMBER(H216),L216*H216,IF(ISNUMBER(J216),J216,IF(J216=\"RATE ONLY\",LOWER(\"RATE ONLY\"),\" \")))","v":" "}]
[]
["Item1",{"$nulls":3},"(i)","Not exceeding 20 m², including for edge repairs wider than 250 mm","m³",{"$nulls":5}," "]
["Item1",{"$nulls":3},"(ii)","Exceeding 20 m² but not exceeding 50 m², including for edge repairs wider than 250 mm","m³",{"$nulls":5}," "]
["Item1",{"$nulls":3},"(iii)","Exceeding 50 m² but not exceeding 100 m², including for edge repairs wider than 250 mm","m³",{"$nulls":5}," "]
["IHDR3",null,null,"(b)",null,"Cemented layers with a surface area:",{"$nulls":6},{"$f":"IF(ISNUMBER(H221),L221*H221,IF(ISNUMBER(J221),J221,IF(J221=\"RATE ONLY\",LOWER(\"RATE ONLY\"),\" \")))","v":" "}]
[]
["Item1",{"$nulls":3},"(i)","Not exceeding 20 m², including for edge repairs wider than 250 mm","m³",{"$nulls":5}," "]
["Item1",{"$nulls":3},"(ii)","Exceeding 20 m² but not exceeding 50 m², including for edge repairs wider than 250 mm","m³",{"$nulls":5}," "]
["Item1",{"$nulls":3},"(iii)","Exceeding 50 m² but not exceeding 100 m², including for edge repairs wider than 250 mm","m³",{"$nulls":5}," "]
["IHDR3",null,null,"(c)",null,"Any other layers (specify layer) with a surface area:",{"$nulls":6},{"$f":"IF(ISNUMBER(H226),L226*H226,IF(ISNUMBER(J226),J226,IF(J226=\"RATE ONLY\",LOWER(\"RATE ONLY\"),\" \")))","v":" "}]
[]
["Item1",{"$nulls":3},"(i)","Not exceeding 20 m², including for edge repairs wider than 250 mm","m³",{"$nulls":5}," "]
["Item1",{"$nulls":3},"(ii)","Exceeding 20 m² but not exceeding 50 m², including for edge repairs wider than 250 mm","m³",{"$nulls":5}," "]
["Item1",{"$nulls":3},"(iii)","Exceeding 50 m² but not exceeding 100 m², including for edge repairs wider than 250 mm","m³",{"$nulls":5}," "]
["IHDR2",null,"C5.5.22.2",null,null,"Excavate the following layers using labour enhanced methods of construction:",{"$nulls":6},{"$f":"IF(ISNUMBER(H231),L231*H231,IF(ISNUMBER(J231),J231,IF(J231=\"RATE ONLY\",LOWER(\"RATE ONLY\"),\" \")))","v":" "}]
[]
["IHDR3",null,null,"(a)",null,"Asphalt layers with a surface area:",{"$nulls":6},{"$f":"IF(ISNUMBER(H233),L233*H233,IF(ISNUMBER(J233),J233,IF(J233=\"RATE ONLY\",LOWER(\"RATE ONLY\"),\" \")))","v":" "}]
[]
["Item1",{"$nulls":3},"(i)","Not exceeding 20 m², including for edge repairs wider than 250 mm","m³",{"$nulls":5}," "]
["Item1",{"$nulls":3},"(ii)","Exceeding 20 m² but not exceeding 50 m², including for edge repairs wider than 250 mm","m³",{"$nulls":5}," "]
["Item1",{"$nulls":3},"(iii)","Exceeding 50 m² but not exceeding 100 m², including for edge repairs wider than 250 mm","m³",{"$nulls":5}," "]
["IHDR3",null,null,"(b)",null,"Cemented layers with a surface area:",{"$nulls":6},{"$f":"IF(ISNUMBER(H238),L238*H238,IF(ISNUMBER(J238),J238,IF(J238=\"RATE ONLY\",LOWER(\"RATE ONLY\"),\" \")))","v":" "}]
[]
["Item1",{"$nulls":3},"(i)","Not exceeding 20 m², including for edge repairs wider than 250 mm","m³",{"$nulls":5},{"$f":"IF(ISNUMBER(H240),L240*H240,IF(ISNUMBER(J240),J240,IF(J240=\"RATE ONLY\",LOWER(\"RATE ONLY\"),\" \")))","v":" "}]
["Item1",{"$nulls":3},"(ii)","Exceeding 20 m² but not exceeding 50 m², including for edge repairs wider than 250 mm","m³",{"$nulls":5}," "]
["Item1",{"$nulls":3},"(iii)","Exceeding 50 m² but not exceeding 100 m², including for edge repairs wider than 250 mm","m³",{"$nulls":5}," "]
["IHDR3",null,null,"(c)",null,"Any other layers (specify layer) with a surface area:",{"$nulls":6},{"$f":"IF(ISNUMBER(H243),L243*H243,IF(ISNUMBER(J243),J243,IF(J243=\"RATE ONLY\",LOWER(\"RATE ONLY\"),\" \")))","v":" "}]
[]
["Item1",{"$nulls":3},"(i)","Not exceeding 20 m², including for edge repairs wider than 250 mm","m³",{"$nulls":5}," "]
["Item1",{"$nulls":3},"(ii)","Exceeding 20 m² but not exceeding 50 m², including for edge repairs wider than 250 mm","m³",{"$nulls":5}," "]
["Item1",{"$nulls":3},"(iii)","Exceeding 50 m² but not exceeding 100 m², including for edge repairs wider than 250 mm","m³",{"$nulls":5}," "]
["IHDR1","C5.5.23",{"$nulls":3},"Edge break cutting back when narrower than 250 mm:",{"$nulls":6},{"$f":"IF(ISNUMBER(H248),L248*H248,IF(ISNUMBER(J248),J248,IF(J248=\"RATE ONLY\",LOWER(\"RATE ONLY\"),\" \")))","v":" "}]
[]
["Item",null,"C5.5.23.1",null,null,"Edge break cutting back when narrower than 250 mm","m",{"$nulls":5}," "]
["Item",null,"C5.5.23.2",null,null,"Edge break cutting back when narrower than 250 mm using labour enhanced methods of construction","m",{"$nulls":5}," "]
["IHDR1","C5.5.24",{"$nulls":3},"Edge break patching when narrower than 250 mm:",{"$nulls":6},{"$f":"IF(ISNUMBER(H252),L252*H252,IF(ISNUMBER(J252),J252,IF(J252=\"RATE ONLY\",LOWER(\"RATE ONLY\"),\" \")))","v":" "}]
[]
["Item",null,"C5.5.24.1",null,null,"Edge break patching using emulsion treated base (ETB) material to a maximum depth of 150 mm","m",{"$nulls":5}," "]
["Item",null,"C5.5.24.2",null,null,"Edge break patching using labour enhanced methods of construction and (ETB) to a maximum depth of 150 mm","m",{"$nulls":5}," "]
["IHDR1","C5.5.25",{"$nulls":3},"Compacting the floor of the excavation for patching","m²",{"$nulls":5},{"$f":"IF(ISNUMBER(H256),L256*H256,IF(ISNUMBER(J256),J256,IF(J256=\"RATE ONLY\",LOWER(\"RATE ONLY\"),\" \")))","v":" "}]
[]
["IHDR1","C5.5.26",{"$nulls":3},"Backfill patching excavations in existing pavements:",{"$nulls":6},{"$f":"IF(ISNUMBER(H258),L258*H258,IF(ISNUMBER(J258),J258,IF(J258=\"RATE ONLY\",LOWER(\"RATE ONLY\"),\" \")))","v":" "}]
[]
["IHDR2",null,"C5.5.26.1",null,null,"Backfill with the following pavement layer material:",{"$nulls":6},{"$f":"IF(ISNUMBER(H260),L260*H260,IF(ISNUMBER(J260),J260,IF(J260=\"RATE ONLY\",LOWER(\"RATE ONLY\"),\" \")))","v":" "}]
[]
["IHDR3",null,null,"(a)",null,"Chemically stabilised pavement layer material (specify the pavement layer, the material source being from commercial or from stockpile, the % stabilising agent and the % of MDD) for a patch with a surface area:",{"$nulls":6},{"$f":"IF(ISNUMBER(H262),L262*H262,IF(ISNUMBER(J262),J262,IF(J262=\"RATE ONLY\",LOWER(\"RATE ONLY\"),\" \")))","v":" "}]
[]
["Item1",{"$nulls":3},"(i)","Not exceeding 20 m², including for edge repairs wider than 250 mm","m³",{"$nulls":5}," "]
["Item1",{"$nulls":3},"(ii)","Exceeding 20 m² but not exceeding 50 m², including for edge repairs wider than 250 mm","m³",{"$nulls":5}," "]
["Item1",{"$nulls":3},"(iii)","Exceeding 50 m² but not exceeding 100 m², including for edge repairs wider than 250 mm","m³",{"$nulls":5}," "]
["IHDR3",null,null,"(b)",null,"Emulsion treated base, or ETB pavement material (specify the pavement layer, the material source being from commercial or from stockpile, the components as per Clause A4.1.5.14, and the % of MDD) for a patch with a surface area:",{"$nulls":6},{"$f":"IF(ISNUMBER(H267),L267*H267,IF(ISNUMBER(J267),J267,IF(J267=\"RATE ONLY\",LOWER(\"RATE ONLY\"),\" \")))","v":" "}]
[]
["Item1",{"$nulls":3},"(i)","Not exceeding 20 m², including for edge repairs wider than 250 mm","m³",{"$nulls":5}," "]
["Item1",{"$nulls":3},"(ii)","Exceeding 20 m² but not exceeding 50 m², including for edge repairs wider than 250 mm","m³",{"$nulls":5}," "]
["Item1",{"$nulls":3},"(iii)","Exceeding 50 m² but not exceeding 100 m², including for edge repairs wider than 250 mm","m³",{"$nulls":5}," "]
["IHDR2",null,"C5.5.26.2",null,null,"Backfill with the following pavement layer material using labour enhanced methods of construction:",{"$nulls":6},{"$f":"IF(ISNUMBER(H272),L272*H272,IF(ISNUMBER(J272),J272,IF(J272=\"RATE ONLY\",LOWER(\"RATE ONLY\"),\" \")))","v":" "}]
[]
["IHDR3",null,null,"(a)",null,"Chemically stabilised pavement material (specify the pavement layer, the material source being from commercial or from stockpile, the % stabilising agent and the % of MDD) for a patch with a surface area:",{"$nulls":6},{"$f":"IF(ISNUMBER(H274),L274*H274,IF(ISNUMBER(J274),J274,IF(J274=\"RATE ONLY\",LOWER(\"RATE ONLY\"),\" \")))","v":" "}]
[]
["Item1",{"$nulls":3},"(i)","Not exceeding 20 m², including for edge repairs wider than 250 mm","m³",{"$nulls":5}," "]
["Item1",{"$nulls":3},"(ii)","Exceeding 20 m² but not exceeding 50 m², including for edge repairs wider than 250 mm","m³",{"$nulls":5}," "]
["Item1",{"$nulls":3},"(iii)","Exceeding 50 m² but not exceeding 100 m², including for edge repairs wider than 250 mm","m³",{"$nulls":5}," "]
["IHDR3",null,null,"(b)",null,"Emulsion treated base, or ETB pavement material (specify the pavement layer, the material source being from commercial or from stockpile, the components as per Clause A4.1.5.14, and the % of MDD) for a patch with a surface area:",{"$nulls":6},{"$f":"IF(ISNUMBER(H279),L279*H279,IF(ISNUMBER(J279),J279,IF(J279=\"RATE ONLY\",LOWER(\"RATE ONLY\"),\" \")))","v":" "}]
[]
["Item1",{"$nulls":3},"(i)","Not exceeding 20 m², including for edge repairs wider than 250 mm","m³",{"$nulls":5}," "]
["Item1",{"$nulls":3},"(ii)","Exceeding 20 m² but not exceeding 50 m², including for edge repairs wider than 250 mm","m³",{"$nulls":5}," "]
["Item1",{"$nulls":3},"(iii)","Exceeding 50 m² but not exceeding 100 m², including for edge repairs wider than 250 mm","m³",{"$nulls":5},{"$f":"IF(ISNUMBER(H283),L283*H283,IF(ISNUMBER(J283),J283,IF(J283=\"RATE ONLY\",LOWER(\"RATE ONLY\"),\" \")))","v":" "}]
["IHDR1","PC5.5.27",{"$nulls":3},"In-situ reconstruction of a pavement layer using a recycler to construct a non-stabilised subbase layer:",{"$nulls":6},{"$f":"IF(ISNUMBER(H284),L284*H284,IF(ISNUMBER(J284),J284,IF(J284=\"RATE ONLY\",LOWER(\"RATE ONLY\"),\" \")))","v":" "},"Special"]
[]
["IHDR2",null,"PC5.5.27.1",null,null,"Gravel subbase layer compacted to 97 % of MDD:",{"$nulls":6},{"$f":"IF(ISNUMBER(H286),L286*H286,IF(ISNUMBER(J286),J286,IF(J286=\"RATE ONLY\",LOWER(\"RATE ONLY\"),\" \")))","v":" "}]
["PB"]
["PB","CARRIED FORWARD",{"$nulls":10},{"$f":"SUBTOTAL(9,M$7:M286)","v":0}]
["PB"]
["PB"]
["PB","BROUGHT FORWARD",{"$nulls":10},{"$f":"SUBTOTAL(9,M$7:M289)","v":0}]
["PB"]
[]
["Item1",null,null,"(a)"," ","Using non-cemented material compacted to 200mm thick","m³",{"$nulls":4},{"v":65,"d":"65.00"},{"$f":"IF(ISNUMBER(H294),L294*H294,IF(ISNUMBER(J294),J294,IF(J294=\"RATE ONLY\",LOWER(\"RATE ONLY\"),\" \")))","v":" "}]
[]
["Item1",null,null,"(b)"," ","Using cemented material compacted to 200 mm thick","m³",{"$nulls":4},{"v":67,"d":"67.00"},{"$f":"IF(ISNUMBER(H296),L296*H296,IF(ISNUMBER(J296),J296,IF(J296=\"RATE ONLY\",LOWER(\"RATE ONLY\"),\" \")))","v":" "}]
[]
["IHDR2",null,"PC5.5.27.2",null,null,"Gravel subbase layer compacted to 95 % of MDD:",{"$nulls":6},{"$f":"IF(ISNUMBER(H298),L298*H298,IF(ISNUMBER(J298),J298,IF(J298=\"RATE ONLY\",LOWER(\"RATE ONLY\"),\" \")))","v":" "}]
[]
["Item1",null,null,"(a)"," ","Using non-cemented material compacted to 200mm thick","m³",{"$nulls":4},{"v":60,"d":"60.00"},{"$f":"IF(ISNUMBER(H300),L300*H300,IF(ISNUMBER(J300),J300,IF(J300=\"RATE ONLY\",LOWER(\"RATE ONLY\"),\" \")))","v":" "}]
[]
["Item1",null,null,"(b)"," ","Using cemented material compacted to 200 mm thick","m³",{"$nulls":4},{"v":62,"d":"62.00"},{"$f":"IF(ISNUMBER(H302),L302*H302,IF(ISNUMBER(J302),J302,IF(J302=\"RATE ONLY\",LOWER(\"RATE ONLY\"),\" \")))","v":" "}]
[]
["IHDR1","PC5.5.28",{"$nulls":3},"In-situ reconstruction of a pavement layer using a recycler to construct a non-stabilised selected layer:",{"$nulls":6},{"$f":"IF(ISNUMBER(H304),L304*H304,IF(ISNUMBER(J304),J304,IF(J304=\"RATE ONLY\",LOWER(\"RATE ONLY\"),\" \")))","v":" "},"Special"]
[]
["IHDR2",null,"PC5.5.28.1",null,null,"Gravel selected layer compacted to 95 % of MDD:",{"$nulls":6},{"$f":"IF(ISNUMBER(H306),L306*H306,IF(ISNUMBER(J306),J306,IF(J306=\"RATE ONLY\",LOWER(\"RATE ONLY\"),\" \")))","v":" "}]
[]
["Item1",null,null,"(a)"," ","Using non-cemented material compacted to 200mm thick","m³",{"$nulls":4},{"v":52.5,"d":"52.50"},{"$f":"IF(ISNUMBER(H308),L308*H308,IF(ISNUMBER(J308),J308,IF(J308=\"RATE ONLY\",LOWER(\"RATE ONLY\"),\" \")))","v":" "}]
[]
["Item1",null,null,"(b)"," ","Using cemented material compacted to 200 mm thick","m³",{"$nulls":4},{"v":52.5,"d":"52.50"},{"$f":"IF(ISNUMBER(H310),L310*H310,IF(ISNUMBER(J310),J310,IF(J310=\"RATE ONLY\",LOWER(\"RATE ONLY\"),\" \")))","v":" "}]
[]
["IHDR2",null,"PC5.5.28.2",null,null,"Gravel selected layer compacted to 93 % of MDD:",{"$nulls":6},{"$f":"IF(ISNUMBER(H312),L312*H312,IF(ISNUMBER(J312),J312,IF(J312=\"RATE ONLY\",LOWER(\"RATE ONLY\"),\" \")))","v":" "}]
[]
["Item1",null,null,"(a)"," ","Using non-cemented material compacted to 150mm thick","m³",{"$nulls":4},{"v":50,"d":"50.00"},{"$f":"IF(ISNUMBER(H314),L314*H314,IF(ISNUMBER(J314),J314,IF(J314=\"RATE ONLY\",LOWER(\"RATE ONLY\"),\" \")))","v":" "}]
[]
["Item1",null,null,"(b)"," ","Using cemented material compacted to 150 mm thick","m³",{"$nulls":4},{"v":50,"d":"50.00"},{"$f":"IF(ISNUMBER(H316),L316*H316,IF(ISNUMBER(J316),J316,IF(J316=\"RATE ONLY\",LOWER(\"RATE ONLY\"),\" \")))","v":" "}]
{"$rows_empty":13}
["#BillEnd#"]
["#BillEnd#","TOTAL CARRIED FORWARD TO SUMMARY",{"$nulls":10},{"$f":"SUBTOTAL(9,M$7:M317)","v":0}]
["#BillEnd#"]

{"sheet":"6.1","index":23,"n_rows":54,"n_cols":13,"rows_kept":54,"hidden":true}
["#BillSheet#"]
["#BillSheet#","C6.1","PAVER LAID CONCRETE LAYERS",{"$nulls":3},"\n",null,null,"SCHEDULE A",{"$f":"SUBTOTAL(9,M$7:M901)","v":0},null,{"$f":"J2","v":"SCHEDULE A"}]
["#BillSheet#"]
["ColHDR"]
["ColHDR","ITEM",{"$nulls":3},"DESCRIPTION","UNIT","QTY","RATE","AMT",null,"RATE","AMOUNT"]
["ColHDR"]
[{"$nulls":5},"PAVER LAID CONCRETE LAYERS"]
["IHDR1","C6.1.1",{"$nulls":3},"Construction of trial section (Complete: including texturing and curing):",{"$nulls":6},{"$f":"IF(ISNUMBER(H8),L8*H8,IF(ISNUMBER(J8),J8,IF(J8=\"RATE ONLY\",LOWER(\"RATE ONLY\"),\" \")))","v":" "}]
["Item",null,"C6.1.1.1",null,null,"Mechanical construction (state pavement type and nominal thickness)","m²",{"$nulls":5}," "]
["Item",null,"C6.1.1.2",null,null,"Labour enhanced construction (state pavement type and nominal thickness)","m²",{"$nulls":5}," "]
["IHDR1","C6.1.2",{"$nulls":3},"Construction of jointed concrete pavement (JCP) (Excluding texturing and curing):",{"$nulls":6}," "]
["IHDR2",null,"C6.1.2.1",null,null,"JCP without dowels:",{"$nulls":6}," "]
["Item",null,null,"(a)",null,"Paver laid construction (state nominal thickness)","m²",{"$nulls":5}," "]
["Item",null,null,"(b)",null,"Labour enhanced construction (state nominal thickness)","m²",{"$nulls":5}," "]
["IHDR2",null,"C6.1.2.2",null,null,"JCP with dowels:",{"$nulls":6}," "]
["Item",null,null,"(a)",null,"Paver laid construction (state nominal thickness)","m²",{"$nulls":5}," "]
["Item",null,null,"(b)",null,"Labour enhanced construction (state nominal thickness)","m²",{"$nulls":5}," "]
["IHDR2",null,"C6.1.2.3",null,null,"Additional concrete placed to thicken up the slab at joints as specified in the Contract Documentation","m³",{"$nulls":5}," "]
["IHDR1","C6.1.3",{"$nulls":3},"Construction of continuously reinforced concrete pavement (Excluding texturing and\ncuring):",{"$nulls":6}," "]
["IHDR2",null,"C6.1.3.1",null,null,"Continuously reinforced concrete pavement (CRCP):",{"$nulls":6}," "]
["Item",null,null,"(a)",null,"Paver laid construction (state nominal thickness)","m²",{"$nulls":5}," "]
["Item",null,null,"(b)",null,"Labour enhanced construction (state nominal thickness)","m²",{"$nulls":5}," "]
["IHDR1","C6.1.4",{"$nulls":3},"Texturing and curing the concrete pavement:",{"$nulls":6}," "]
["IHDR2",null,"C6.1.4.1",null,null,"Burlap-dragged and grooved texture:",{"$nulls":6}," "]
["Item",null,null,"(a)",null,"Paver constructed","m²",{"$nulls":5}," "]
["Item",null,null,"(b)",null,"Labour enhanced construction ","m²",{"$nulls":5}," "]
["IHDR2",null,"C6.1.4.2",null,null,"Burlap-dragged and broom finish only","m²",{"$nulls":5}," "]
["IHDR2",null,"C6.1.4.3",null,null,"Curing:",{"$nulls":6}," "]
["Item",null,null,"(a)",null,"Paver constructed","m²",{"$nulls":5}," "]
["Item",null,null,"(b)",null,"Labour enhanced construction ","m²",{"$nulls":5}," "]
["IHDR1","C6.1.5",{"$nulls":3},"Variation in the rate of application of the curing compound","litre",{"$nulls":5}," "]
["IHDR1","C6.1.6",{"$nulls":3},"Joints:",{"$nulls":6}," "]
["IHDR2",null,"C6.1.6.1",null,null,"Expansion joints complete (excluding dowels)","m",{"$nulls":5}," "]
["IHDR2",null,"C6.1.6.2",null,null,"Longitudinal hinge joints:",{"$nulls":6}," "]
["Item",null,null,"(a)",null,"Sealed hinge joints (indicate type and reference to drawings)","m",{"$nulls":5}," "]
["Item",null,null,"(b)",null,"Unsealed hinge joints (indicate type and reference to drawings)","m",{"$nulls":5}," "]
["IHDR2",null,"C6.1.6.3",null,null,"Sealed transverse contraction joints sawn in two separate operations (widths as shown on the drawings)","m",{"$nulls":5}," "]
["IHDR2",null,"C6.1.6.4",null,null,"Dowel bars: mild steel inserted in new concrete (indicate diameter, length and position on drawings):",{"$nulls":6}," "]
["Item",null,null,"(a)",null,"Inserted by mechanical dowel bar inserter","No.",{"$nulls":5}," "]
["Item",null,null,"(b)",null,"Pre-installed on approved frame","No.",{"$nulls":5}," "]
["IHDR2",null,"C6.1.6.5",null,null,"Tie-bars: installed in new concrete (indicate, diameter and length):",{"$nulls":6}," "]
["Item",null,null,"(a)",null,"Mild steel","No.",{"$nulls":5}," "]
["Item",null,null,"(b)",null,"High tensile steel","No.",{"$nulls":5}," "]
["IHDR2",null,"C6.1.6.6",null,null,"Forming and sealing joints between asphalt and concrete pavements","m",{"$nulls":5}," "]
["IHDR1","C6.1.7",{"$nulls":3},"Steel reinforcement in concrete pavements:",{"$nulls":6}," "]
["Item",null,"C6.1.7.1",null,null,"Mild steel bars","t",{"$nulls":5}," "]
["Item",null,"C6.1.7.2",null,null,"High tensile steel bars","t",{"$nulls":5}," "]
["Item",null,"C6.1.7.3",null,null,"Welded steel fabric","kg",{"$nulls":5}," "]
["IHDR1","C6.1.8",{"$nulls":3},"Drilling of testing of cores:",{"$nulls":6}," "]
["Item",null,"C6.1.8.1",null,null,"100 mm cores drilled from pavement for testing of compressive strength","No.",{"$nulls":5}," "]
["Item",null,"C6.1.8.2",null,null,"150 mm cores drilled from pavement for testing of compressive strength","No.",{"$nulls":5}," "]
["#BillEnd#"]
["#BillEnd#","TOTAL CARRIED FORWARD TO SUMMARY",{"$nulls":10},{"$f":"SUBTOTAL(9,M$9:M51)","v":0}]
["#BillEnd#"]

{"sheet":"6.2","index":24,"n_rows":67,"n_cols":10,"rows_kept":67}
["#BillSheet#"]
["#BillSheet#","C6.2","SEGMENTAL BLOCK PAVING LAYERS",{"$nulls":3},"\n",null,null,"SCHEDULE A"]
["#BillSheet#"]
["ColHDR"]
["ColHDR","ITEM",{"$nulls":3},"DESCRIPTION","UNIT","QTY","RATE","AMT"]
["ColHDR"]
[{"$nulls":5},"SEGMENTAL BLOCK PAVING LAYERS"]
["IHDR1","C6.2.1",{"$nulls":3},"Segmental block paving:"]
[]
["IHDR2",null,"C6.2.1.1",null,null,"Concrete block paving:"]
[]
["item",null,null,"(a)",null,"80 mm thick, class 30, Type S-A (placed in herringbone pattern)","m²",400,null,{"$f":"IF(ISNUMBER(H12),H12*I12,IF(H12=\"-\",\"rate only\",\" \"))","v":0}]
[]
["item",null,null,"(b)",null,"60 mm thick, class 30, Type S-A (placed in herringbone pattern)","m²"]
["IHDR1","C6.2.2",{"$nulls":3},"Cast in-situ concrete edge and intermediate beams","m³",16,null,{"$f":"IF(ISNUMBER(H15),H15*I15,IF(H15=\"-\",\"rate only\",\" \"))","v":0}]
[]
["IHDR1","C6.2.3",{"$nulls":3},"Provision and application of approved herbicide and ant poison:"]
[]
["item",null,"C6.2.3.1",null,null,"Provision of materials","PC sum",1,{"v":20000,"d":"20,000.00"},{"$f":"IF(ISNUMBER(H19),H19*I19,IF(H19=\"-\",\"rate only\",\" \"))","v":{"v":20000,"d":"20,000.00"}}]
[]
["item3",null,"C6.2.3.2",null,null,"Contractor’s charges and profit added to the prime cost sum","%",{"$f":"J19","v":20000},null,{"$f":"IF(ISNUMBER(H21),H21*I21,IF(H21=\"-\",\"rate only\",\" \"))","v":0}]
[]
["IHDR1","C6.2.4",{"$nulls":3},"Re-sanding of joints in segmental block paving:"]
[]
["IHDR2",null,"C6.2.4.1",null,null,"Concrete block paving:"]
[]
["item",null,null,"(a)",null,"80 mm thick, class 30, Type S-A (placed in herringbone pattern)","m²",400,null,{"$f":"IF(ISNUMBER(H27),H27*I27,IF(H27=\"-\",\"rate only\",\" \"))","v":0}]
[]
["item",null,null,"(b)",null,"60 mm thick, class 30, Type S-A (placed in herringbone pattern)","m²"]
{"$rows_empty":35}
["#BillEnd#"]
["#BillEnd#","TOTAL CARRIED FORWARD TO SUMMARY",{"$nulls":7},{"$f":"SUM(J8:J64)","v":{"v":20000,"d":"20,000.00"}}]
["#BillEnd#"]

{"sheet":"7.1","index":25,"n_rows":72,"n_cols":10,"rows_kept":72}
["#BillSheet#"]
["#BillSheet#","C7.1","REPLACEMENT OF EXISTING JOINT SEALANT",{"$nulls":3},"\n",null,null,"SCHEDULE A"]
["#BillSheet#"]
["ColHDR"]
["ColHDR","ITEM",{"$nulls":3},"DESCRIPTION","UNIT","QTY","RATE","AMT"]
["ColHDR"]
[{"$nulls":5},"REPLACEMENT OF EXISTING JOINT SEALANT"]
["IHDR1","C7.1.1",{"$nulls":3},"Replacing of joint sealant in existing concrete pavement as follows:"]
[]
["Item",null,"C7.1.1.1",null,null,"Removal of existing seal and backing material","m",6900,null,{"$f":"IF(ISNUMBER(H10),H10*I10,IF(H10=\"-\",\"rate only\",\" \"))","v":0}]
[]
["Item",null,"C7.1.1.2",null,null,"Reaming of existing joints (indicate width and depth)","m"]
["Item",null,"C7.1.1.3",null,null,"Bevelling of one side of the joint to a dimension of 10 mm X 10 mm","m"]
["Item",null,"C7.1.1.4",null,null,"Bevelling of both sides of the joint to a dimension of 10 mm X 10 mm","m"]
["Item",null,"C7.1.1.5",null,null,"Installation of backing material in saw cut joints (to fit saw cut dimensions)","m",{"$f":"H10","v":6900},null,{"$f":"IF(ISNUMBER(H15),H15*I15,IF(H15=\"-\",\"rate only\",\" \"))","v":0}]
[]
["Item",null,"C7.1.1.6",null,null,"Installation of cold pour sealant","litre",5200,null,{"$f":"IF(ISNUMBER(H17),H17*I17,IF(H17=\"-\",\"rate only\",\" \"))","v":0}]
[]
["IHDR1"]
{"$rows_empty":50}
["#BillEnd#"]
["#BillEnd#","TOTAL CARRIED FORWARD TO SUMMARY",{"$nulls":7},{"$f":"SUM(J8:J69)","v":{"v":0,"d":"0.00"}}]
["#BillEnd#"]

{"sheet":"7.2","index":26,"n_rows":100,"n_cols":10,"rows_kept":100}
["#BillSheet#"]
["#BillSheet#","C7.2","REPAIR TO CONCRETE PANELS AND CONCRETE ADJACENT TO UNCONTROLLED ",{"$nulls":6},"SCHEDULE A "]
["#BillSheet#",null,"CRACKS AND EXISTING JOINTS"]
["ColHDR"]
["ColHDR","ITEM",{"$nulls":3},"DESCRIPTION","UNIT","QTY","RATE","AMT"]
["ColHDR"]
[{"$nulls":5},"REPAIR TO CONCRETE PANELS AND CONCRETE ADJACENT TO UNCONTROLLED CRACKS AND EXISTING JOINTS"]
["IHDR1","C7.2.1",{"$nulls":3},"Transverse and longitudinal crack and joint repairs incorporating the following\ntreatments"]
[]
["Item","C7.2.1.1",{"$nulls":3},"Routing of active cracks (indicate width and depth)","m"]
["Item","C7.2.1.2",{"$nulls":3},"Routing of non-active cracks (15mm wide by 15mm deep)","m",350,null,{"$f":"IF(ISNUMBER(H11),H11*I11,IF(H11=\"-\",\"rate only\",\" \"))","v":0}]
[]
["Item","C7.2.1.3",{"$nulls":3},"Bevelling of one side of the crack (indicate dimension)","m"]
["Item","C7.2.1.4",{"$nulls":3},"Bevelling of both sides of the crack ","m",350,null,{"$f":"IF(ISNUMBER(H14),H14*I14,IF(H14=\"-\",\"rate only\",\" \"))","v":0}]
[]
["Item","C7.2.1.5",{"$nulls":3},"Saw cutting of cracks and joints in one operation (indicate depth and width)","m"]
["Item","C7.2.1.6",{"$nulls":3},"Filling joint reservoir with cementitious non-shrink grout","kg",25,null,{"$f":"IF(ISNUMBER(H17),H17*I17,IF(H17=\"-\",\"rate only\",\" \"))","v":0}]
[]
["Item","C7.2.1.7",{"$nulls":3},"Installation of backing material in saw cut joints (to fit saw cut dimensions)","m"]
["Item","C7.2.1.8",{"$nulls":3},"Installation of cold pour sealant","litre",350,null,{"$f":"IF(ISNUMBER(H20),H20*I20,IF(H20=\"-\",\"rate only\",\" \"))","v":0}]
[]
["IHDR1","C7.2.2",{"$nulls":3},"Grouting of cracks","m",350,null,{"$f":"IF(ISNUMBER(H22),H22*I22,IF(H22=\"-\",\"rate only\",\" \"))","v":0}]
[]
["IHDR1","C7.2.3",{"$nulls":3},"Cross-stitching of longitudinal and transverse joints and cracks"]
[]
["Item","C7.2.3.1",{"$nulls":3},"Saw cutting of slots in concrete pavement (indicate dimensions)","No."]
["Item","C7.2.3.2",{"$nulls":3},"Application of wet-to-dry epoxy to vertical faces and top of existing concrete","litre"]
["Item","C7.2.3.3",{"$nulls":3},"Installation of 16 mm diameter deformed tie-bar (indicate length) including application of selflevelling pourable epoxy grout and 7,1 mm aggregate.","No."]
["Item","C7.2.3.4",{"$nulls":3},"Filling of slot with high strength concrete Class 50/7,1 mm","m³"]
["IHDR1","C7.2.4",{"$nulls":3},"Restoration of load transfer at transverse contraction joints"]
[]
["Item","C7.2.4.1",{"$nulls":3},"Saw cutting and preparation of slots in concrete pavement (indicate dimensions)","No."]
["Item","C7.2.4.2",{"$nulls":3},"Installation of new dowel bars as specified (indicate length and diameter) including application of bond breaker on free end, end caps.","No."]
["Item","C7.2.4.3",{"$nulls":3},"Filling of slot with high strength concrete Class 50/7,1 mm","No."]
["IHDR1","C7.2.5",{"$nulls":3},"Pre-treating existing dowels"]
[]
["Item","C7.2.5.1",{"$nulls":3},"Free ends in existing concrete","No."]
["Item","C7.2.5.2",{"$nulls":3},"Free ends in new concrete","No."]
["IHDR1","C7.2.6",{"$nulls":3},"Texturing and curing the concrete pavement:"]
[]
["IHDR2","C7.2.6.1",{"$nulls":3},"Burlap-dragged and grooved texture","m²"]
[]
["IHDR2","C7.2.6.2",{"$nulls":3},"Curing:"]
[]
["Item",{"$nulls":4},"(a) Paving train constructed","m²"]
["IHDR1","C7.2.7",{"$nulls":3},"Variation in the rate of application of the curing compound","litre"]
[]
["IHDR1","C7.2.8",{"$nulls":3},"Steel reinforcement in concrete pavements:"]
[]
["Item","C7.2.8.1",{"$nulls":3},"Mild steel bars","t"]
["Item","C7.2.8.2",{"$nulls":3},"High tensile steel bars","t"]
["Item","C7.2.8.3",{"$nulls":3},"Welded steel fabric","kg"]
{"$rows_empty":45}
["#BillEnd#"]
["#BillEnd#","TOTAL CARRIED FORWARD TO SUMMARY",{"$nulls":7},{"$f":"SUM(J8:J97)","v":{"v":0,"d":"0.00"}}]
["#BillEnd#"]

{"sheet":"7.3","index":27,"n_rows":84,"n_cols":10,"rows_kept":84}
["#BillSheet#"]
["#BillSheet#","C7.3","REMOVAL AND REINSTATEMENT OF EXISTING CONCRETE LAYERS",{"$nulls":6},"SCHEDULE A"]
["#BillSheet#"]
["ColHDR"]
["ColHDR","ITEM",{"$nulls":3},"DESCRIPTION","UNIT","QTY","RATE","AMT"]
["ColHDR"]
[{"$nulls":5},"REMOVAL AND REINSTATEMENT OF EXISTING CONCRETE LAYERS"]
["IHDR1","C7.3.1",{"$nulls":3},"Removal of concrete in rehabilitation work:"]
[]
["Item",null,"C7.3.1.1",null,null,"Concrete without reinforcing","m³",250,null,{"$f":"IF(ISNUMBER(H10),H10*I10,IF(H10=\"-\",\"rate only\",\" \"))","v":0}]
[]
["Item",null,"C7.3.1.2",null,null,"Reinforced concrete","m³",200,null,{"$f":"IF(ISNUMBER(H12),H12*I12,IF(H12=\"-\",\"rate only\",\" \"))","v":0}]
[]
["Item",null,"C7.3.1.3",null,null,"Underlying layers","m³"]
["IHDR1","C7.3.2",{"$nulls":3},"Full depth repairs using hand placed concrete with CEM I 52,5","m³",450,null,{"$f":"IF(ISNUMBER(H15),H15*I15,IF(H15=\"-\",\"rate only\",\" \"))","v":0}]
[]
["IHDR1","C7.3.3",{"$nulls":3},"Partial Depth Repairs using hand placed fine concrete","m³",250,null,{"$f":"IF(ISNUMBER(H17),H17*I17,IF(H17=\"-\",\"rate only\",\" \"))","v":0}]
[]
["IHDR1","C7.3.4",{"$nulls":3},"Tie-bars and dowels for full depth repairs:"]
[]
["Item",null,"C7.3.4.1",null,null,"Tie bars (indicate diameter and length)","No."]
["Item",null,"C7.3.4.2",null,null,"Dowel bars (indicate diameter and length)","No."]
["IHDR1","C7.3.5",{"$nulls":3},"Partial Depth Repairs using hand placed acrylic resin grout","m²"]
[]
["IHDR1","C7.3.6",{"$nulls":3},"Reinstating the subbase with lean mix concrete","m³",200,null,{"$f":"IF(ISNUMBER(H25),H25*I25,IF(H25=\"-\",\"rate only\",\" \"))","v":0}]
[]
["IHDR1","C7.3.7",{"$nulls":3},"Removal of exposed stitches in concrete pavement","No."]
[]
["IHDR1","C7.3.8",{"$nulls":3},"Sawing of concrete in rehabilitation works to different depths:"]
[]
["Item",null,"C7.3.8.1",null,null,"200 mm","m",150,null,{"$f":"IF(ISNUMBER(H31),H31*I31,IF(H31=\"-\",\"rate only\",\" \"))","v":0}]
[]
["IHDR1","C7.3.9",{"$nulls":3},"Removal of existing supporting layers in rehabilitation work:"]
[]
["Item",null,"C7.3.9.1",null,null,"Granular material","m³",200,null,{"$f":"IF(ISNUMBER(H35),H35*I35,IF(H35=\"-\",\"rate only\",\" \"))","v":0}]
[]
["Item",null,"C7.3.9.2",null,null,"Cemented material","m³",200,null,{"$f":"IF(ISNUMBER(H37),H37*I37,IF(H37=\"-\",\"rate only\",\" \"))","v":0}]
["Item"]
["IHDR1","C7.3.10",{"$nulls":3},"Preparing the underlying layers after the concrete has been removed:"]
[]
["Item",null,"C7.3.10.1",null,null,"Re-compaction of remaining underlying layers","m²",2900,null,{"$f":"IF(ISNUMBER(H41),H41*I41,IF(H41=\"-\",\"rate only\",\" \"))","v":0}]
[]
["Item",null,"C7.3.10.2",null,null,"Replacement of granular layers (material class and thickness indicated)","m²"]
["Item",null,"C7.3.10.3",null,null,"Replacement of stabilised layers (material class and thickness indicated)","m²"]
["Item",null,"C7.3.10.4",null,null,"Replacement of supporting layers with 10 MPa lean mix concrete (material class and thickness indicated)","m²"]
["Item",null,"C7.3.10.5",null,null,"Replacement of subbase with hot mix asphalt (thickness indicated)","t"]
["Item",null,"C7.3.10.6",null,null,"Levelling the surface with coarse slurry (micro surfacing)","m³"]
["IHDR1","C7.3.11",{"$nulls":3},"Reinstatement of concrete layers (Excluding texturing and curing):"]
[]
["Item",null,"C7.3.11.1",null,null,"Replacement of concrete in JCP pavements (200mm)","m²",2900,null,{"$f":"IF(ISNUMBER(H50),H50*I50,IF(H50=\"-\",\"rate only\",\" \"))","v":0}]
[]
["Item",null,"C7.3.11.2",null,null,"Replacement concrete in CRCP pavements (thickness indicated)","m²"]
["IHDR1","C7.3.12",{"$nulls":3},"Pre-treating existing dowels:"]
[]
["Item",null,"C7.3.12.1",null,null,"Free ends in existing concrete","No."]
["Item",null,"C7.3.12.2",null,null,"Free ends in new concrete","No."]
["IHDR1","C7.3.13",{"$nulls":3},"Texturing and curing the concrete pavement:"]
[]
["Item",null,"C7.3.13.1",null,null,"Burlap-dragged and texture (broom finish)","m²",{"$f":"H50","v":2900},null,{"$f":"IF(ISNUMBER(H59),H59*I59,IF(H59=\"-\",\"rate only\",\" \"))","v":0}]
[]
["Item",null,"C7.3.13.2",null,null,"Curing","m²"]
["IHDR1","C7.3.14",{"$nulls":3},"Variation in the rate of application of the curing compound","litre"]
[]
["IHDR1","C7.3.15",{"$nulls":3},"Steel reinforcement in concrete pavements:"]
[]
["Item",null,"C7.3.15.1",null,null,"Mild steel bars","t",0.5,null,{"$f":"IF(ISNUMBER(H66),H66*I66,IF(H66=\"-\",\"rate only\",\" \"))","v":0}]
[]
["Item",null,"C7.3.15.2",null,null,"High tensile steel bars","t",0.5]
[]
["Item",null,"C7.3.15.3",null,null,"Welded steel fabric","kg"]
["IHDR1"]
{"$rows_empty":10}
["#BillEnd#"]
["#BillEnd#","TOTAL CARRIED FORWARD TO SUMMARY",{"$nulls":7},{"$f":"SUM(J8:J81)","v":{"v":0,"d":"0.00"}}]
["#BillEnd#"]

{"sheet":"7.4","index":28,"n_rows":62,"n_cols":13,"rows_kept":62,"hidden":true}
["#BillSheet#"]
["#BillSheet#","C7.4","REINSTATEMENT OF SLAB SUPPORT BY GROUT INJECTION",{"$nulls":3},"\n",null,null,"SCHEDULE A",{"$f":"SUBTOTAL(9,M$7:M1032)","v":0},null,{"$f":"J2","v":"SCHEDULE A"}]
["#BillSheet#"]
["ColHDR"]
["ColHDR","ITEM",{"$nulls":3},"DESCRIPTION","UNIT","QTY","RATE","AMT",null,"RATE","AMOUNT"]
["ColHDR"]
[{"$nulls":5},"REINSTATEMENT OF SLAB SUPPORT BY GROUT INJECTION"]
["IHDR1","C7.4.1",{"$nulls":3},"Sub-sealing of the concrete pavement","No. of 50 kg cement pockets",{"$nulls":5},{"$f":"IF(ISNUMBER(H8),L8*H8,IF(ISNUMBER(J8),J8,IF(J8=\"RATE ONLY\",LOWER(\"RATE ONLY\"),\" \")))","v":" "}]
{"$rows_empty":51}
["#BillEnd#"]
["#BillEnd#","TOTAL CARRIED FORWARD TO SUMMARY",{"$nulls":10},{"$f":"SUBTOTAL(9,M$7:M9)","v":0}]
["#BillEnd#"]

{"sheet":"7.5","index":29,"n_rows":62,"n_cols":13,"rows_kept":62,"hidden":true}
["#BillSheet#"]
["#BillSheet#","C7.5","REINSTATEMENT OF RIDING QUALITY",{"$nulls":3},"\n",null,null,"SCHEDULE A",{"$f":"SUBTOTAL(9,M$7:M1042)","v":0},null,{"$f":"J2","v":"SCHEDULE A"}]
["#BillSheet#"]
["ColHDR"]
["ColHDR","ITEM",{"$nulls":3},"DESCRIPTION","UNIT","QTY","RATE","AMT",null,"RATE","AMOUNT"]
["ColHDR"]
[{"$nulls":5},"REINSTATEMENT OF RIDING QUALITY"]
["IHDR1","C7.5.1",{"$nulls":3},"Grinding of existing concrete pavement surfaces","m²",{"$nulls":5},{"$f":"IF(ISNUMBER(H8),L8*H8,IF(ISNUMBER(J8),J8,IF(J8=\"RATE ONLY\",LOWER(\"RATE ONLY\"),\" \")))","v":" "}]
{"$rows_empty":51}
["#BillEnd#"]
["#BillEnd#","TOTAL CARRIED FORWARD TO SUMMARY",{"$nulls":10},{"$f":"SUBTOTAL(9,M$7:M9)","v":0}]
["#BillEnd#"]

{"sheet":"7.6","index":30,"n_rows":62,"n_cols":13,"rows_kept":62,"hidden":true}
["#BillSheet#"]
["#BillSheet#","C7.6","REINSTATEMENT OF SURFACE TEXTURE",{"$nulls":3},"\n",null,null,"SCHEDULE A",{"$f":"SUBTOTAL(9,M$7:M966)","v":0},null,{"$f":"J2","v":"SCHEDULE A"}]
["#BillSheet#"]
["ColHDR"]
["ColHDR","ITEM",{"$nulls":3},"DESCRIPTION","UNIT","QTY","RATE","AMT",null,"RATE","AMOUNT"]
["ColHDR"]
[{"$nulls":5},"REINSTATEMENT OF SURFACE TEXTURE"]
["IHDR1","C7.6.1",{"$nulls":3},"Retexturing of concrete surfaces (transverse or longitudinal)","m²",{"$nulls":5},{"$f":"IF(ISNUMBER(H8),L8*H8,IF(ISNUMBER(J8),J8,IF(J8=\"RATE ONLY\",LOWER(\"RATE ONLY\"),\" \")))","v":" "}]
{"$rows_empty":51}
["#BillEnd#"]
["#BillEnd#","TOTAL CARRIED FORWARD TO SUMMARY",{"$nulls":10},{"$f":"SUBTOTAL(9,M$7:M9)","v":0}]
["#BillEnd#"]

{"sheet":"8.1","index":31,"n_rows":74,"n_cols":17,"rows_kept":74}
["#BillSheet#"]
["#BillSheet#","C8.1","PRIME COAT",{"$nulls":3},"\n",null,null,"SCHEDULE A"]
["#BillSheet#"]
["ColHDR"]
["ColHDR","ITEM",{"$nulls":3},"DESCRIPTION","UNIT","QTY","RATE","AMT"]
["ColHDR"]
[{"$nulls":5},"PRIME COAT"]
["IHDR1","C8.1.1",{"$nulls":3},"Prime coat:"]
[]
[{"$nulls":14},"N17","Ramps","Crossroad"]
["Item",null,"C8.1.1.1",null,null,"MC -10 cut-back bitumen","litre",{"$nulls":6},"Area",{"v":43364.688200000004,"d":"43,364.69"},{"v":55341.6,"d":"55,341.60"},{"v":10696.8,"d":"10,696.80"}]
[{"$nulls":13},"Total",{"$f":"ROUNDUP(O11:Q11,-1)","v":{"v":43370,"d":"43,370.00"}},55350,10700]
["Item",null,"C8.1.1.2",null,null,"MC -30 cut-back bitumen","litre",43800,null,{"$f":"IF(ISNUMBER(H13),H13*I13,IF(H13=\"-\",\"rate only\",\" \"))","v":0}]
[]
["Item",null,"C8.1.1.3",null,null,"Inverted bitumen emulsion","litre",43800,null,{"$f":"IF(ISNUMBER(H15),H15*I15,IF(H15=\"-\",\"rate only\",\" \"))","v":0}]
[]
["Item",null,"C8.1.1.4",null,null,"Certified product containing solvents (State name)","litre"]
["Item",null,"C8.1.1.5",null,null,"Certified product containing no solvents (State name)","litre"]
["IHDR1","C8.1.2",{"$nulls":3},"Aggregate for blinding:"]
[]
["Item",null,"C8.1.2.1",null,null,"Natural sand","m³",100,null,{"$f":"IF(ISNUMBER(H21),H21*I21,IF(H21=\"-\",\"rate only\",\" \"))","v":0}]
[]
["Item",null,"C8.1.2.2",null,null,"Crusher sand","m³",100,null,{"$f":"IF(ISNUMBER(H23),H23*I23,IF(H23=\"-\",\"rate only\",\" \"))","v":0}]
[]
["IHDR1","C8.1.3",{"$nulls":3},"Extra over item C8.1.1 for applying the prime coat accessible only to hand-held or light equipment","litre",200,null,{"$f":"IF(ISNUMBER(H25),H25*I25,IF(H25=\"-\",\"rate only\",\" \"))","v":0}]
{"$rows_empty":46}
["#BillEnd#"]
["#BillEnd#","TOTAL CARRIED FORWARD TO SUMMARY",{"$nulls":7},{"$f":"SUM(J8:J71)","v":{"v":0,"d":"0.00"}}]
["#BillEnd#"]

{"sheet":"8.2","index":32,"n_rows":24,"n_cols":13,"rows_kept":24,"hidden":true}
["#BillSheet#"]
["#BillSheet#","C8.2","COVER SPRAYS, FOG SPRAYS AND REJUVENATION SPRAYS",{"$nulls":3},"\n",null,null,"SCHEDULE A",{"$f":"SUBTOTAL(9,M$7:M978)","v":0},null,{"$f":"J2","v":"SCHEDULE A"}]
["#BillSheet#"]
["ColHDR"]
["ColHDR","ITEM",{"$nulls":3},"DESCRIPTION","UNIT","QTY","RATE","AMT",null,"RATE","AMOUNT"]
["ColHDR"]
[{"$nulls":5},"COVER SPRAYS, FOG SPRAYS AND REJUVENATION SPRAYS"]
["IHDR1","C8.2.1",{"$nulls":3},"Cover sprays, fog sprays and rejuvenation sprays:",{"$nulls":6},{"$f":"IF(ISNUMBER(H8),L8*H8,IF(ISNUMBER(J8),J8,IF(J8=\"RATE ONLY\",LOWER(\"RATE ONLY\"),\" \")))","v":" "}]
["IHDR2",null,"C8.2.1.1",null,null,"65 % Cationic spray grade emulsion:",{"$nulls":6}," "]
["Item",null,null,"(a)",null,"Indicate dilution (Diluted ..% Emulsion/…% Water)","litre",{"$nulls":5}," "]
["IHDR2",null,"C8.2.1.2",null,null,"60 % Anionic stable grade emulsion:",{"$nulls":6}," "]
["Item",null,null,"(a)",null,"Indicate dilution (Diluted ..% Emulsion/…% Water)","litre",{"$nulls":5}," "]
["IHDR2",null,"C8.2.1.3",null,null,"Cutback Inverted bitumen emulsion","litre",{"$nulls":5}," "]
["IHDR2",null,"C8.2.1.4",null,null,"Certified rejuvenator (State type and certification)","litre",{"$nulls":5}," "]
["IHDR1","C8.2.2",{"$nulls":3},"Extra over item C8.2.1 for labour enhanced application:",{"$nulls":6}," "]
["IHDR2",null,"C8.2.2.1",null,null,"65 % Cationic spray grade emulsion:",{"$nulls":6}," "]
["Item",null,null,"(a)",null,"Indicate dilution (Diluted ..% Emulsion/…% Water)","litre",{"$nulls":5}," "]
["IHDR2",null,"C8.2.2.2",null,null,"60 % Anionic stable grade emulsion:",{"$nulls":6}," "]
["Item",null,null,"(a)",null,"Indicate dilution (Diluted ..% Emulsion/…% Water)","litre",{"$nulls":5}," "]
["IHDR2",null,"C8.2.2.3",null,null,"Cutback Inverted bitumen emulsion","litre",{"$nulls":5}," "]
["IHDR2",null,"C8.2.2.4",null,null,"Certified rejuvenator (State type and certification)","litre",{"$nulls":5}," "]
["#BillEnd#"]
["#BillEnd#","TOTAL CARRIED FORWARD TO SUMMARY",{"$nulls":10},{"$f":"SUBTOTAL(9,M$9:M21)","v":0}]
["#BillEnd#"]

{"sheet":"8.3","index":33,"n_rows":14,"n_cols":13,"rows_kept":14,"hidden":true}
["#BillSheet#"]
["#BillSheet#","C8.3","TEXTURE TREATMENT",{"$nulls":3},"\n",null,null,"SCHEDULE A",{"$f":"SUBTOTAL(9,M$7:M972)","v":0},null,{"$f":"J2","v":"SCHEDULE A"}]
["#BillSheet#"]
["ColHDR"]
["ColHDR","ITEM",{"$nulls":3},"DESCRIPTION","UNIT","QTY","RATE","AMT",null,"RATE","AMOUNT"]
["ColHDR"]
[{"$nulls":5},"TEXTURE TREATMENT"]
["IHDR1","C8.3.1",{"$nulls":3},"Texture treatment:",{"$nulls":6},{"$f":"IF(ISNUMBER(H8),L8*H8,IF(ISNUMBER(J8),J8,IF(J8=\"RATE ONLY\",LOWER(\"RATE ONLY\"),\" \")))","v":" "}]
[" ",null,"C8.3.1.1",null,null,"Application of slurry for texture improvement, applied by hand (Indicate aggregate grade, type of emulsion, filler type)","m³",{"$nulls":5},{"$f":"IF(ISNUMBER(H9),L9*H9,IF(ISNUMBER(J9),J9,IF(J9=\"RATE ONLY\",LOWER(\"RATE ONLY\"),\" \")))","v":" "}]
["Item",null,"C8.3.1.2",null,null,"Application of slurry for texture improvement, applied by spreader box (Indicate aggregate grade, type of emulsion, filler type)","m³",{"$nulls":5},{"$f":"IF(ISNUMBER(H10),L10*H10,IF(ISNUMBER(J10),J10,IF(J10=\"RATE ONLY\",LOWER(\"RATE ONLY\"),\" \")))","v":" "}]
["Item",null,"C8.3.1.3",null,null,"Application of microsurfacing for texture improvement, applied by spreader box (Indicate aggregate grade, type of emulsion, filler type)","m³",{"$nulls":5},{"$f":"IF(ISNUMBER(H11),L11*H11,IF(ISNUMBER(J11),J11,IF(J11=\"RATE ONLY\",LOWER(\"RATE ONLY\"),\" \")))","v":" "}]
["#BillEnd#"]
["#BillEnd#","TOTAL CARRIED FORWARD TO SUMMARY",{"$nulls":10},{"$f":"SUBTOTAL(9,M$9:M11)","v":0}]
["#BillEnd#"]

{"sheet":"8.4","index":34,"n_rows":18,"n_cols":13,"rows_kept":18,"hidden":true}
["#BillSheet#"]
["#BillSheet#","C8.4","RUT AND/OR DEPRESSION CORRECTION",{"$nulls":3},"\n",null,null,"SCHEDULE A",{"$f":"SUBTOTAL(9,M$7:M1008)","v":0},null,{"$f":"J2","v":"SCHEDULE A"}]
["#BillSheet#"]
["ColHDR"]
["ColHDR","ITEM",{"$nulls":3},"DESCRIPTION","UNIT","QTY","RATE","AMT",null,"RATE","AMOUNT"]
["ColHDR"]
[{"$nulls":5},"RUT AND/OR DEPRESSION CORRECTION"]
["IHDR1","C8.4.1",{"$nulls":3},"Rut and/or Depression correction (screeding):",{"$nulls":6},{"$f":"IF(ISNUMBER(H8),L8*H8,IF(ISNUMBER(J8),J8,IF(J8=\"RATE ONLY\",LOWER(\"RATE ONLY\"),\" \")))","v":" "}]
["IHDR2",null,"C8.4.1.1",null,null,"Bond coat using 50 % diluted stable grade bitumen emulsion","litre",{"$nulls":5}," "]
["IHDR2",null,"C8.4.1.2",null,null,"Correction material:",{"$nulls":6}," "]
["Item",null,null,"(a)",null,"Continuously-graded asphalt (State Nominal maximum aggregate size and binder type)","t",{"$nulls":5}," "]
["Item",null,null,"(b)",null,"Semi-gap graded asphalt (State Nominal maximum aggregate size and binder type)","t",{"$nulls":5}," "]
["Item",null,null,"(c)",null,"Cold applied asphalt (Agrément SA certified for specific class as specified)","t",{"$nulls":5}," "]
["Item",null,null,"(d)",null,"Coarse slurry (state aggregate grade and emulsion type)","m³",{"$nulls":5}," "]
["Item",null,null,"(e)",null,"Microsurfacing (state aggregate grade and binder type)","m³",{"$nulls":5}," "]
["#BillEnd#"]
["#BillEnd#","TOTAL CARRIED FORWARD TO SUMMARY",{"$nulls":10},{"$f":"SUBTOTAL(9,M$10:M15)","v":0}]
["#BillEnd#"]

{"sheet":"8.5","index":35,"n_rows":79,"n_cols":10,"rows_kept":79}
["#BillSheet#"]
["#BillSheet#","C8.5","STANDARD CRACK SEALING",{"$nulls":3},"\n",null,null,"SCHEDULE A"]
["#BillSheet#"]
["ColHDR"]
["ColHDR","ITEM",{"$nulls":3},"DESCRIPTION","UNIT","QTY","RATE","AMT"]
["ColHDR"]
[{"$nulls":5},"STANDARD CRACK SEALING"]
["IHDR1","C8.5.1",{"$nulls":3},"Standard crack sealing:"]
[]
["IHDR2",null,"C8.5.1.1",null,null,"Cleaning cracks:"]
[]
["Item",null,null,"(a)",null,"Cleaning crack with cold compressed air","m",50000,null,{"$f":"IF(ISNUMBER(H12),H12*I12,IF(H12=\"-\",\"rate only\",\" \"))","v":0}]
[]
["Item",null,null,"(b)",null,"Cleaning crack with hot compressed air","m"]
["IHDR2",null,"C8.5.1.2",null,null,"Applying herbicides for sealing cracks","litre"]
[]
["IHDR2",null,"C8.5.1.3",null,null,"Priming (indicate primer)","litre"]
[]
["IHDR2",null,"C8.5.1.4",null,null,"Sealing the cracks:"]
[]
["Item",null,null,"(a)",null,"Sealing using (Class C-E1 or similar approved)","litre",30000,null,{"$f":"IF(ISNUMBER(H21),H21*I21,IF(H21=\"-\",\"rate only\",\" \"))","v":0}]
[]
["IHDR2",null,"C8.5.1.5",null,null,"Heating of surface before rolling","m"]
[]
["IHDR2",null,"C8.5.1.6",null,null,"Rolling the cracks","m"]
{"$rows_empty":51}
["#BillEnd#"]
["#BillEnd#","TOTAL CARRIED FORWARD TO SUMMARY",{"$nulls":7},{"$f":"SUM(J8:J76)","v":{"v":0,"d":"0.00"}}]
["#BillEnd#"]

{"sheet":"8.7","index":36,"n_rows":16,"n_cols":13,"rows_kept":16,"hidden":true}
["#BillSheet#"]
["#BillSheet#","C8.7","PLANING",{"$nulls":3},"\n",null,null,"SCHEDULE A",{"$f":"SUBTOTAL(9,M$7:M931)","v":0},null,{"$f":"J2","v":"SCHEDULE A"}]
["#BillSheet#"]
["ColHDR"]
["ColHDR","ITEM",{"$nulls":3},"DESCRIPTION","UNIT","QTY","RATE","AMT",null,"RATE","AMOUNT"]
["ColHDR"]
[{"$nulls":5},"PLANING"]
["IHDR1","C8.7.1",{"$nulls":3},"Planing:",{"$nulls":6},{"$f":"IF(ISNUMBER(H8),L8*H8,IF(ISNUMBER(J8),J8,IF(J8=\"RATE ONLY\",LOWER(\"RATE ONLY\"),\" \")))","v":" "}]
["Item",null,"C8.7.1.1",null,null,"Planing of road surface (Indicate thickness in mm)","m²",{"$nulls":5}," "]
["Item",null,"C8.7.1.2",null,null,"Fog spraying on planed surfaces","litre",{"$nulls":5}," "]
["Item",null,"C8.7.1.3",null,null,"Hand spraying","litre",{"$nulls":5}," "]
["Item",null,"C8.7.1.4",null,null,"Spraying with mechanical equipment","litre",{"$nulls":5}," "]
["Item",null,"C8.7.1.5",null,null,"Rolling the planed surface","m²-pass",{"$nulls":5}," "]
["#BillEnd#"]
["#BillEnd#","TOTAL CARRIED FORWARD TO SUMMARY",{"$nulls":10},{"$f":"SUBTOTAL(9,M$10:M13)","v":0}]
["#BillEnd#"]

{"sheet":"8.6","index":37,"n_rows":72,"n_cols":10,"rows_kept":72}
["#BillSheet#"]
["#BillSheet#","C8.6","GEOSYNTHETIC CRACK SEALING",{"$nulls":3},"\n",null,null,"SCHEDULE A"]
["#BillSheet#"]
["ColHDR"]
["ColHDR","ITEM",{"$nulls":3},"DESCRIPTION","UNIT","QTY","RATE","AMT"]
["ColHDR"]
[{"$nulls":5},"GEOSYNTHETIC CRACK SEALING"]
["IHDR1","C8.6.1",{"$nulls":3},"Geosynthetic crack sealing:"]
[]
["Item",null,"C8.6.1.1",null,null,"Sealing cracks with 200 mm wide geosynthetic (specify type of emulsion)","m"]
["Item",null,"C8.6.1.2",null,null,"Sealing cracks with geosynthetic over areas ","m²",20000,null,{"$f":"IF(ISNUMBER(H11),H11*I11,IF(H11=\"-\",\"rate only\",\" \"))","v":0}]
[]
[null,"PC8.6.2",{"$nulls":3},"Bituminous binder variation"]
[]
[null,null,"PC8.6.2.1",null,null,"Bitumen emulsion (Cat 60)","litre",40,null,{"$f":"IF(ISNUMBER(H15),H15*I15,IF(H15=\"-\",\"rate only\",\" \"))","v":0}]
{"$rows_empty":54}
["#BillEnd#"]
["#BillEnd#","TOTAL CARRIED FORWARD TO SUMMARY",{"$nulls":7},{"$f":"SUM(J8:J69)","v":{"v":0,"d":"0.00"}}]
["#BillEnd#"]

{"sheet":"8.8","index":38,"n_rows":148,"n_cols":10,"rows_kept":148}
["#BillSheet#"]
["#BillSheet#","C8.8","PATCHING AND EDGE BREAK REPAIR",{"$nulls":3},"\n",null,null,"SCHEDULE A "]
["#BillSheet#"]
["ColHDR"]
["ColHDR","ITEM",{"$nulls":3},"DESCRIPTION","UNIT","QTY","RATE","AMT"]
["ColHDR"]
[{"$nulls":5},"PATCHING AND EDGE BREAK REPAIR"]
["IHDR1","C8.8.1",{"$nulls":3},"Saw cutting pavement layers for patching:"]
[]
["IHDR2",null,"C8.8.1.1",null,null,"Asphalt or bituminous surfacing to an average depth:"]
[]
["Item",null,null,"(a)",null,"Not exceeding 50 mm","m",1500,null,{"$f":"IF(ISNUMBER(H12),H12*I12,IF(H12=\"-\",\"rate only\",\" \"))","v":0}]
[]
["Item",null,null,"(b)",null,"Exceeding 50 mm but not exceeding 100 mm","m",2500,null,{"$f":"IF(ISNUMBER(H14),H14*I14,IF(H14=\"-\",\"rate only\",\" \"))","v":0}]
[]
["Item",null,null,"(c)",null,"Exceeding 100 mm","m",3200,null,{"$f":"IF(ISNUMBER(H16),H16*I16,IF(H16=\"-\",\"rate only\",\" \"))","v":0}]
[]
["IHDR2",null,"C8.8.1.2",null,null,"Cemented pavement layers to an average depth:"]
[]
["Item",null,null,"(a)",null,"Not exceeding 100 mm","m"]
["Item",null,null,"(b)",null,"Exceeding 100 mm but not exceeding 200 mm","m"]
["Item",null,null,"(c)",null,"Exceeding 200 mm","m"]
["IHDR2",null,"C8.8.1.3",null,null,"Granular layers to an average depth:"]
[]
["Item",null,null,"(a)",null,"Not exceeding 100 mm","m"]
["Item",null,null,"(b)",null,"Not exceeding 200 mm","m"]
["Item",null,null,"(c)",null,"Exceeding 200 mm","m"]
["IHDR1","C8.8.2",{"$nulls":3},"Excavation in existing pavements for patching (non-milling):"]
[]
["IHDR2",null,"C8.8.2.1",null,null,"Asphalt layers:"]
[]
["Item",null,null,"(a)",null,"Not exceeding 10 m² including for edge repairs wider than 250 mm","m³",880,null,{"$f":"IF(ISNUMBER(H32),H32*I32,IF(H32=\"-\",\"rate only\",\" \"))","v":0}]
[]
["Item",null,null,"(b)",null,"Exceeding 10 m² but not exceeding 50 m² including for edge repairs wider than 250 mm","m³",1760,null,{"$f":"IF(ISNUMBER(H34),H34*I34,IF(H34=\"-\",\"rate only\",\" \"))","v":0}]
[]
["Item",null,null,"(c)",null,"Exceeding 50 m² up to 100 m² including for edge repairs wider than 250 mm","m³",1760,null,{"$f":"IF(ISNUMBER(H36),H36*I36,IF(H36=\"-\",\"rate only\",\" \"))","v":0}]
[]
["Item",null,null,"(d)",null,"Exceeding 100 m²","m³",4380,null,{"$f":"IF(ISNUMBER(H38),H38*I38,IF(H38=\"-\",\"rate only\",\" \"))","v":0}]
[]
["IHDR2",null,"C8.8.2.2",null,null,"Cemented layers:"]
[]
["Item",null,null,"(a)",null,"Not exceeding 10 m² including for edge repairs wider than 250 mm","m³"]
["Item",null,null,"(b)",null,"Exceeding 10 m² but not exceeding 50 m² including for edge repairs wider than 250 mm","m³"]
["Item",null,null,"(c)",null,"Exceeding 50 m² up to 100 m² including for edge repairs wider than 250 mm","m³"]
["Item",null,null,"(d)",null,"Exceeding 100 m²","m³"]
["IHDR2",null,"C8.8.2.3",null,null,"Other layers (granular):"]
[]
["Item",null,null,"(a)",null,"Not exceeding 10 m² including for edge repairs wider than 250 mm","m³",1650,null,{"$f":"IF(ISNUMBER(H48),H48*I48,IF(H48=\"-\",\"rate only\",\" \"))","v":0}]
[]
["Item",null,null,"(b)",null,"Exceeding 10 m² but not exceeding 50 m² including for edge repairs wider than 250 mm","m³",3290,null,{"$f":"IF(ISNUMBER(H50),H50*I50,IF(H50=\"-\",\"rate only\",\" \"))","v":0}]
[]
["Item",null,null,"(c)",null,"Exceeding 50 m² up to 100 m² including for edge repairs wider than 250 mm","m³",3290,null,{"$f":"IF(ISNUMBER(H52),H52*I52,IF(H52=\"-\",\"rate only\",\" \"))","v":0}]
[]
["Item",null,null,"(d)",null,"(d) Exceeding 100 m²","m³",8210,null,{"$f":"IF(ISNUMBER(H54),H54*I54,IF(H54=\"-\",\"rate only\",\" \"))","v":0}]
[]
["IHDR1","C8.8.3",{"$nulls":3},"Compacting the floor of excavations for patching (compacted to 95% of MDD)","m²",109500,null,{"$f":"IF(ISNUMBER(H56),H56*I56,IF(H56=\"-\",\"rate only\",\" \"))","v":0}]
[]
["IHDR1","C8.8.4",{"$nulls":3},"Backfilling of excavations for patching with:"]
[]
["IHDR2",null,"C8.8.4.1",null,null,"Chemically stabilised pavement material (state the pavement material and the stabilising agent) for a patch with a surface area:"]
[]
["Item",null,null,"(a)",null,"Not exceeding 10 m² including for edge repairs wider than 250 mm","m³"]
["Item",null,null,"(b)",null,"Exceeding 10 m² but not exceeding 50 m² including for edge repairs wider than 250 mm","m³"]
["Item",null,null,"(c)",null,"Exceeding 50 m² up to 100 m² including for edge repairs wider than 250 mm","m³"]
["Item",null,null,"(d)",null,"Exceeding 100 m²","m³"]
["IHDR2",null,"C8.8.4.2",null,null,"Bitumen Stabilised Material (specify type and level of compaction) for a patch with a surface area:"]
[]
["Item",null,null,"(a)",null,"Not exceeding 10 m² including for edge repairs wider than 250 mm","m³"]
["Item",null,null,"(b)",null,"Exceeding 10 m² but not exceeding 50 m² including for edge repairs wider than 250 mm","m³"]
["Item",null,null,"(c)",null,"Exceeding 50 m² up to 100 m² including for edge repairs wider than 250 mm","m³"]
["Item",null,null,"(d)",null,"Exceeding 100 m²","m³"]
["IHDR2",null,"C8.8.4.3",null,null,"Asphalt for a patch with a surface area"]
[]
["IHDR3",null,null,"(a)",null,"Not exceeding 10 m² including for edge repairs wider than 250 mm"]
[]
["Item",{"$nulls":3},"(i)","Base repairs: continuously graded asphalt base, 80mm thick using PG64E-16 binder, Sabita Manual 35","t",4250,null,{"$f":"IF(ISNUMBER(H76),H76*I76,IF(H76=\"-\",\"rate only\",\" \"))","v":0}]
[]
["Item",{"$nulls":3},"(ii)","Surface repairs: continuously graded asphalt surfacing, 45mm thick (NMPS 14mm) using Elastomeric Polymer Modified Binder PG58E-22","t",{"$f":"4250*0.2","v":850},null,{"$f":"IF(ISNUMBER(H78),H78*I78,IF(H78=\"-\",\"rate only\",\" \"))","v":0}]
["PB"]
["PB","CARRIED FORWARD",{"$nulls":7},{"$f":"SUM(J8:J78)","v":{"v":0,"d":"0.00"}}]
["PB"]
["PB"]
["PB","BROUGHT FORWARD",{"$nulls":7},{"$f":"J80","v":{"v":0,"d":"0.00"}}]
["PB"]
[]
["IHDR3",null,null,"(b)",null,"Exceeding 10 m² but not exceeding 50 m² including for edge repairs wider than 250 mm"]
[]
["Item",{"$nulls":3},"(i)","Base repairs: continuously graded asphalt base, 80mm thick using PG64E-16 binder, Sabita Manual 35","t",8450,null,{"$f":"IF(ISNUMBER(H88),H88*I88,IF(H88=\"-\",\"rate only\",\" \"))","v":0}]
[]
["Item",{"$nulls":3},"(ii)","Surface repairs: continuously graded asphalt surfacing, 45mm thick (NMPS 14mm) using Elastomeric Polymer Modified Binder PG58E-22","t",{"$f":"8450*0.2","v":1690},null,{"$f":"IF(ISNUMBER(H90),H90*I90,IF(H90=\"-\",\"rate only\",\" \"))","v":0}]
[]
["IHDR3",null,null,"(c)",null,"Exceeding 50 m² up to 100 m² including for edge repairs wider than 250 mm"]
[]
["Item",{"$nulls":3},"(i)","Base repairs: continuously graded asphalt base, 80mm thick using PG64E-16 binder, Sabita Manual 35","t",8450,null,{"$f":"IF(ISNUMBER(H94),H94*I94,IF(H94=\"-\",\"rate only\",\" \"))","v":0}]
[]
["Item",{"$nulls":3},"(ii)","Surface repairs: continuously graded asphalt surfacing, 45mm thick (NMPS 14mm) using Elastomeric Polymer Modified Binder PG58E-22","t",{"$f":"8450*0.2","v":1690},null,{"$f":"IF(ISNUMBER(H96),H96*I96,IF(H96=\"-\",\"rate only\",\" \"))","v":0}]
[]
["IHDR3",null,null,"(d)",null,"Exceeding 100 m²"]
[]
["Item",{"$nulls":3},"(i)","Base repairs: continuously graded asphalt base, 80mm thick using PG64E-16 binder, Sabita Manual 35","t",21050,null,{"$f":"IF(ISNUMBER(H100),H100*I100,IF(H100=\"-\",\"rate only\",\" \"))","v":0}]
[]
["Item",{"$nulls":3},"(ii)","Surface repairs: continuously graded asphalt surfacing, 45mm thick (NMPS 14mm) using Elastomeric Polymer Modified Binder PG58E-22","t",{"$f":"21050*0.2","v":4210},null,{"$f":"IF(ISNUMBER(H102),H102*I102,IF(H102=\"-\",\"rate only\",\" \"))","v":0}]
[]
["IHDR2",null,"C8.8.4.4",null,null,"Granular base material (state type and density) for a patch with a surface area:"]
[]
["Item",null,null,"(a)",null,"Not exceeding 10 m² including for edge repairs wider than 250 mm","t"]
["Item",null,null,"(b)",null,"Exceeding 10 m² but not exceeding 50 m² including for edge repairs wider than 250 mm","t"]
["Item",null,null,"(c)",null,"Exceeding 50 m² up to 100 m² including for edge repairs wider than 250 mm","t"]
["Item",null,null,"(d)",null,"Exceeding 100 m²","t"]
["IHDR1","C8.8.5",{"$nulls":3},"Geosynthetic patching:"]
[]
["Item",null,"C8.8.5.1",null,null,"Sealing joints with geosynthetic strips (specify width and type of emulsion)","m"]
["IHDR1","C8.8.6",{"$nulls":3},"Repairing edge breaks in surfacing:"]
[]
["IHDR2",null,"C8.8.6.1",null,null,"Cutting back the edges of the existing surfacing for the repairing of edge breaks","m"]
[]
["IHDR2",null,"C8.8.6.2",null,null,"Prime coat (state type and rate of application)","litre"]
[]
["IHDR2",null,"C8.8.6.3",null,null,"Reconstructing edges using:"]
[]
["Item",null,null,"(a)",null,"Continuously-graded hot asphalt (state type and density)","t"]
["Item",null,null,"(b)",null,"Continuously-graded cold asphalt (Agrément SA certified -state class and density)","t"]
["Item",null,null,"(c)",null,"Bitumen Stabilised Material (state type and level of compaction)","m³"]
{"$rows_empty":22}
["#BillEnd#"]
["#BillEnd#","TOTAL CARRIED FORWARD TO SUMMARY",{"$nulls":7},{"$f":"SUM(J82:J145)","v":{"v":0,"d":"0.00"}}]
["#BillEnd#"]

{"sheet":"8.9","index":39,"n_rows":22,"n_cols":13,"rows_kept":22,"hidden":true}
["#BillSheet#"]
["#BillSheet#","C8.9","REPAIR OF SURFACE DEFECTS",{"$nulls":3},"\n",null,null,"SCHEDULE A",{"$f":"SUBTOTAL(9,M$7:M939)","v":0},null,{"$f":"J2","v":"SCHEDULE A"}]
["#BillSheet#"]
["ColHDR"]
["ColHDR","ITEM",{"$nulls":3},"DESCRIPTION","UNIT","QTY","RATE","AMT",null,"RATE","AMOUNT"]
["ColHDR"]
[{"$nulls":5},"REPAIR OF SURFACE DEFECTS"]
["IHDR1","C8.9.1",{"$nulls":3},"Heating of the road surface:",{"$nulls":6},{"$f":"IF(ISNUMBER(H8),L8*H8,IF(ISNUMBER(J8),J8,IF(J8=\"RATE ONLY\",LOWER(\"RATE ONLY\"),\" \")))","v":" "}]
["Item",null,"C8.9.1.1",null,null,"Establishing of heating apparatus on site for softening of the road surface","lump sum",{"$nulls":5}," "]
["Item",null,"C8.9.1.2",null,null,"Heating of road surface","m²",{"$nulls":5}," "]
["IHDR1","C8.9.2",{"$nulls":3},"Aggregate for treatment of bleeding sections:",{"$nulls":6}," "]
["Item",null,"C8.9.2.1",null,null,"Heated aggregate (state size)","m³",{"$nulls":5}," "]
["Item",null,"C8.9.2.2",null,null,"Precoating of aggregate (state type and application litre/m³)","m³",{"$nulls":5}," "]
["IHDR1","C8.9.3",{"$nulls":3},"Application and rolling in of heated aggregate","m²",{"$nulls":5}," "]
["IHDR1","C8.9.4",{"$nulls":3},"Trial sections for heating, application and rolling in of heated aggregate","m²",{"$nulls":5}," "]
["IHDR1","C8.9.5",{"$nulls":3},"Water cutting:",{"$nulls":6}," "]
["Item",null,"C8.9.5.1",null,null,"Establishing of water cutting equipment on site","lump sum",{"$nulls":5}," "]
["Item",null,"C8.9.5.2",null,null,"Water cutting of the road surface","m²",{"$nulls":5}," "]
["IHDR1","C8.9.6","C8.9.6",null,null,"Trial sections for water cutting","m²",{"$nulls":5}," "]
["#BillEnd#"]
["#BillEnd#","TOTAL CARRIED FORWARD TO SUMMARY",{"$nulls":10},{"$f":"SUBTOTAL(9,M$9:M19)","v":0}]
["#BillEnd#"]

{"sheet":"9.1","index":40,"n_rows":178,"n_cols":10,"rows_kept":178}
["#BillSheet#"]
["#BillSheet#","C9.1","ASPHALT LAYERS",{"$nulls":6},"SCHEDULE A"]
["#BillSheet#"]
["ColHDR"]
["ColHDR","ITEM",{"$nulls":3},"DESCRIPTION","UNIT","QTY","RATE","AMT"]
["ColHDR"]
[{"$nulls":5},"ASPHALT LAYERS"]
["IHDR1","C9.1.1",{"$nulls":3},"Asphalt mix designs:"]
[]
[]
["IHDR2",null,"C9.1.1.1",null,null,"Stone skeletal mixes:"]
[]
[]
[]
["Item",null,null,"(b)",null,"High modulus asphalt (EME) (state binder type and level of design)","lump sum"]
["Item",null,null,"(c)",null,"Stone Mastic Asphalt (SMA) (state binder type)","lump sum"]
["Item",null,null,"(b)",null,"Ultrathin Friction Courses (UTFC) ","lump sum",1,null,{"$f":"IF(ISNUMBER(H17),H17*I17,IF(H17=\"-\",\"rate only\",\" \"))","v":0}]
[]
["Item",null,null,"(e)",null,"Porous asphalt (state binder type)","lump sum"]
["Item",null,null,"(f)",null,"Bitumen rubber open and semi-open mixes (state mix type)","lump sum"]
["Item",null,null,"(g)",null,"Other – as stated and defined in the Contract Documentation","lump sum"]
["IHDR2",null,"C9.1.1.2",null,null,"Sand skeletal mixes:"]
[]
["Item",null,null,"(a)",null,"Continuously graded surfacing, 45mm thick (NMPS 14mm) using Elastomeric Polymer Modified Binder PG58E-22, Sabita Manual 35, design level III","lump sum",1,null,{"$f":"IF(ISNUMBER(H24),H24*I24,IF(H24=\"-\",\"rate only\",\" \"))","v":0}]
[]
["Item",null,null,"(b)",null,"Continuously graded base, 80mm thick (NMPS 20mm) using PG64E-16 binder, Sabita Manual 35, design level III","lump sum",1,null,{"$f":"IF(ISNUMBER(H26),H26*I26,IF(H26=\"-\",\"rate only\",\" \"))","v":0}]
[]
["Item",null,null,"(b)",null,"Semi-gap graded mixes (state binder type and level of design)","lump sum"]
["Item",null,null,"(c)",null,"Gap graded mixes (state binder type and level of design)","lump sum"]
["Item",null,null,"(d)",null,"Sand asphalt (state binder type and level of design)","lump sum"]
["Item",null,null,"(e)",null,"Other (as stated and defined in the Contract Documentation)","lump sum"]
["IHDR1","C9.1.2",{"$nulls":3},"Construction of trial sections:"]
[]
["Item",null,"C9.1.2.1",null,null,"Asphalt layers, continuously graded, placed by paver "]
["Item"]
["Item",null,null,"(a)",null,"Sand skeletal mix, Continuously graded asphalt surfacing, 45mm thick using Elastomeric Polymer Modified Binder PG58E-22 paver placed","m²",1500,null,{"$f":"IF(ISNUMBER(H36),H36*I36,IF(H36=\"-\",\"rate only\",\" \"))","v":0}]
[]
["Item"]
["Item",null,null,"(b)",null,"Stone skeletal mix, Continuously graded asphalt base, 80mm thick using PG64E-16 binder paver placed","m²",{"$f":"H36","v":1500},null,{"$f":"IF(ISNUMBER(H39),H39*I39,IF(H39=\"-\",\"rate only\",\" \"))","v":0}]
[]
["Item"]
["Item",null,"C9.1.2.2",null,null,"Removal of trial section where so instructed by the Engineer","m²",{"$f":"H36+H39","v":3000},null,{"$f":"IF(ISNUMBER(H42),H42*I42,IF(H42=\"-\",\"rate only\",\" \"))","v":0}]
[]
["IHDR1","C9.1.3",{"$nulls":3},"Application of bond coat:"]
[]
["Item",null,"C9.1.3.1",null,null,"Stable –grade 30 % net bitumen emulsion as specified. Applied with a calibrated distributer","litre",706000,null,{"$f":"IF(ISNUMBER(H46),H46*I46,IF(H46=\"-\",\"rate only\",\" \"))","v":0}]
[]
[]
["Item",null,"C9.1.3.2",null,null,"Applied in restricted areas using a portable pressure sprayer","litre",10000,null,{"$f":"IF(ISNUMBER(H49),H49*I49,IF(H49=\"-\",\"rate only\",\" \"))","v":0}]
[]
["Item",null,"C9.1.3.3",null,null,"Applied by hand using brushes on all exposed transverse and longitudinal construction joints","litre"]
["Item",null,"C9.1.3.4",null,null,"Other: (state type, such as standard, modified emulsion, “trackless”, Agrément certified, or heated if applied for night work)","litre"]
["IHDR1","C9.1.4",{"$nulls":3},"Asphalt base:"]
[]
["IHDR2",null,"C9.1.4.1",null,null,"New Construction:"]
[]
["Item",null,null,"(a)",null,"Stone skeletal mix – continuously graded as defined (state layer thickness, binder type and design class/ level and placing technique)","m²"]
["Item",null,null,"(b)",null,"Stone skeletal mix – High Modulus (EME) as defined (state layer thickness, binder type, design class/ level and placing technique)","m²"]
["Item",null,null,"(c)",null,"Sand skeletal mix – continuously graded as defined (state layer thickness, binder type, design class/ level and placing technique)","m²"]
["Item",null,null,"(d)",null,"Any of the above mix types where the use of reclaimed asphalt has been specified (indicate maximum % reclaimed asphalt or binder replacement limits)","m²"]
["Item",null,null,"(e)",null,"Any mix certified for specific applications by an approved agency as being fit for the purpose and as specified in the Contract Documentation.","m²"]
[{"$nulls":5},"In all cases state placing technique (hand/paver)"]
["IHDR2",null,"C9.1.4.2",null,null,"Rehabilitation:"]
[]
["Item",null,null,"(a)",null,"Stone skeletal mix – continuously graded, 80mm thick using 35/50 penetration grade binder paver placed, design level 3","t"]
["Item",null,null,"(b)",null,"Stone skeletal mix – High Modulus (EME) as defined (state layer thickness, binder type, design class/ level and placing technique)","t"]
["Item",null,null,"(c)",null,"Sand skeletal mix – continuously graded as defined (state layer thickness, binder type, design class/ level and placing technique)","t"]
["Item",null,null,"(d)",null,"Any of the above mix types where the use of reclaimed asphalt has been specified (indicate maximum % reclaimed asphalt or binder replacement limits)","t"]
["Item",null,null,"(e)",null,"Certified: any mixes certified for specific applications by an approved agency as being fit for the purpose and as specified in the Contract Documentation.","t"]
[{"$nulls":5},"In all cases state placing technique (hand/paver)"]
["IHDR1","C9.1.5",{"$nulls":3},"Asphalt surfacing:"]
[]
["IHDR2",null,"C9.1.5.1",null,null,"New Construction:"]
[]
["Item",null,null,"(a)",null,"Sand skeletal mix, Continuously graded asphalt surfacing, 45mm thick using A-E2 modified binder,Sabita Manual 35, design level 3, paver placed","m²"]
["Item",null,null,"(b)",null,"Stone skeletal mix – SMA as defined (state layer thickness, binder type)","m²"]
["Item",null,null,"(c)",null,"Stone skeletal mix - Porous asphalt as defined (state layer thickness and binder type)","m²"]
["Item",null,null,"(d)",null,"Stone skeletal mix- open graded as defined (state layer thickness and binder type)","m²"]
["Item",null,null,"(e)",null,"Sand skeletal mix – continuously graded as defined (state layer thickness, binder type, design class/ level)","m²"]
["Item",null,null,"(f)",null,"Semi gap mix – as defined (state layer thickness, binder type and design level)","m²"]
["Item",null,null,"(g)",null,"Sand skeletal mix - gap-graded mix (state layer thickness, binder type design class/level)","m²"]
["Item",null,null,"(h)",null,"Any of the above mix types where the use of reclaimed asphalt has been specified (indicate maximum % reclaimed asphalt or binder replacement limits)","m²"]
["Item",null,null,"(i)",null,"Certified: any mixes certified for specific applications by an approved agency as being fit for the purpose and as specified in the Contract Documentation.","m²"]
[{"$nulls":5},"In all cases state placing technique (hand/paver)"]
["IHDR2",null,"C9.1.5.2",null,null,"Rehabilitation:"]
[]
["Item",null,null,"(g)",null,"Sand skeletal mix, Continuously graded asphalt surfacing, 45mm thick (NMPS 14mm) using Elastomeric Polymer Modified Binder PG58E-22, with maximum reclaimed asphalt presentage of 15%, Sabita Manual 35, design level III, paver placed","t",112000,null,{"$f":"IF(ISNUMBER(H87),H87*I87,IF(H87=\"-\",\"rate only\",\" \"))","v":0}]
[]
[{"$nulls":3},"(h)",null,"Certified: any mixes certified for specific applications by an approved agency as being fit for the purpose and as specified in the Contract Documentation (Asphalt type 1b).","t",30,null,{"$f":"IF(ISNUMBER(H89),H89*I89,IF(H89=\"-\",\"rate only\",\" \"))","v":0}]
[]
["Item",null,null,"(b)",null,"Stone skeletal mix – SMA as defined (state layer thickness, binder type)","t"]
["Item",null,null,"(c)",null,"Stone skeletal mix - Porous asphalt as defined (state layer thickness and binder type)","t"]
["Item",null,null,"(d)",null,"Stone skeletal mix- open graded as defined (state layer thickness and binder type)","t"]
["Item",null,null,"(e)",null,"Sand skeletal mix – continuously graded as defined (state layer thickness, binder type, design class/ level)","t"]
["Item",null,null,"(f)",null,"Sand skeletal mix - gap-graded mix (state layer thickness, binder type design class/level)","t"]
["Item",null,null,"(g)",null,"Any of the above mix types where the use of reclaimed asphalt has been specified (indicate maximum % reclaimed asphalt or binder replacement limits)","t"]
["Item",null,null,"(h)",null,"Certified: any mixes certified for specific applications by an approved agency as being fit for the purpose and as specified in the Contract Documentation.","t"]
[{"$nulls":5},"In all cases state placing technique (hand/paver)"]
[]
["Item",null,"C9.1.7.1",null,null,"Extra over payment items C9.1.4.1 and C9.1.5.1 (State layer thickness, mix class, binder type, nominal maximum particle size and placing technique (hand/paver))","m²"]
["PB"]
["PB","CARRIED FORWARD",{"$nulls":7},{"$f":"SUM(J8:J99)","v":{"v":0,"d":"0.00"}}]
["PB"]
["PB"]
["PB","BROUGHT FORWARD",{"$nulls":7},{"$f":"J102","v":{"v":0,"d":"0.00"}}]
["PB"]
[]
[]
[null,"C9.1.8",{"$nulls":3},"Surfacing of bridge decks:"]
[]
["Item",null,"C9.1.8.2",null,null,"Sand skeletal mix, Continuously graded asphalt surfacing, 45mm thick using Elastomeric Polymer Modified Binder PG58E-22, Sabita Manual 35,  paver placed","t",{"$f":"4900*2","v":9800},null,{"$f":"IF(ISNUMBER(H111),H111*I111,IF(H111=\"-\",\"rate only\",\" \"))","v":0}]
[]
["IHDR1","C9.1.9",{"$nulls":3},"Application of rolled in chippings (State nominal size):"]
[]
["Item",null,"C9.1.9.1",null,null,"By means of chip spreader","m²"]
["Item",null,"C9.1.9.2",null,null,"By hand in restricted areas","m²"]
["IHDR1","C9.1.10",{"$nulls":3},"Variation rates:"]
[]
[]
["Item",null,"C9.1.10.1",null,null,"Bitumen "]
[]
[{"$nulls":3},"(a)",null,"PG58E-22","t",210,null,{"$f":"IF(ISNUMBER(H122),H122*I122,IF(H122=\"-\",\"rate only\",\" \"))","v":0}]
[]
[{"$nulls":3},"(b)",null,"PG64E-16","t",420,null,{"$f":"IF(ISNUMBER(H124),H124*I124,IF(H124=\"-\",\"rate only\",\" \"))","v":0}]
[]
[]
["Item",null,"C9.1.10.2",null,null,"Aggregate","t",410,null,{"$f":"IF(ISNUMBER(H127),H127*I127,IF(H127=\"-\",\"rate only\",\" \"))","v":0}]
[]
[]
["Item",null,"C9.1.10.3",null,null,"Active filler (lime)","t",55,null,{"$f":"IF(ISNUMBER(H130),H130*I130,IF(H130=\"-\",\"rate only\",\" \"))","v":0}]
[]
["Item",null,"C9.1.10.4",null,null,"Cellulose fibre (state type)","t"]
["Item",null,"C9.1.10.5",null,null,"Rolled-in chippings","t"]
["Item",null,"C9.1.10.6",null,null,"Bituminous bond coat – Stable –grade 30 % net bitumen emulsion","t",35,null,{"$f":"IF(ISNUMBER(H134),H134*I134,IF(H134=\"-\",\"rate only\",\" \"))","v":0}]
[]
["IHDR1","C9.1.11",{"$nulls":3},"Asphalt warm mix technology – extra over/under rate:"]
[]
["Item",null,"C9.1.11.1",null,null,"New construction","m²"]
["Item",null,"C9.1.11.2",null,null,"Rehabilitation","t"]
["IHDR1","C9.1.12",{"$nulls":3},"Asphalt reinforcing - complete (State type)","m²"]
[]
["IHDR1","C9.1.13",{"$nulls":3},"Coring of asphalt layers:"]
[]
["Item",null,"C9.1.13.1",null,null,"100 mm diameter","No.",1000,null,{"$f":"IF(ISNUMBER(H144),H144*I144,IF(H144=\"-\",\"rate only\",\" \"))","v":0}]
[]
["Item",null,"C9.1.13.2",null,null,"150 mm diameter","No.",700,null,{"$f":"IF(ISNUMBER(H146),H146*I146,IF(H146=\"-\",\"rate only\",\" \"))","v":0}]
[]
["IHDR1","C9.1.14",{"$nulls":3},"Surface regularity testing as described in Clause A9.1.8.4:"]
[]
["Item",null,"C9.1.14.1",null,null,"Establishment of equipment:\nInertial laser Profilometer\n","No."]
["Item",null,"C9.1.14.2",null,null,"Profiler Surveys utilising equipment as specified - Base layers and surfacing layers","km"]
["IHDR1","C9.1.15",{"$nulls":3},"Milling of bridge decks and keys adjacent to bridge decks:"]
[]
["Item",null,"C9.1.15.1",null,null,"Provision of an appropriate sized milling machine","No."]
["Item",null,"C9.1.15.2",null,null,"Milling of bridge decks and keys to bridge deck approaches","m³",5400,null,{"$f":"IF(ISNUMBER(H155),H155*I155,IF(H155=\"-\",\"rate only\",\" \"))","v":0}]
[]
["Item",null,"C9.1.15.3",null,null,"Cleaning of milled surfaces","m²",45000,null,{"$f":"IF(ISNUMBER(H157),H157*I157,IF(H157=\"-\",\"rate only\",\" \"))","v":0}]
[]
["IHDR1","PC9.1.16",{"$nulls":3},"Work undertaken in accordance with a Product Performance Guarantee System:"]
[]
["Item",null,"PC9.1.16.1",null,null,"Provision of Performance Guarantees in respect of UTFC","lump sum",1,null,{"$f":"IF(ISNUMBER(H161),H161*I161,IF(H161=\"-\",\"rate only\",\" \"))","v":0}]
[]
["Item",null,"PC9.1.16.2",null,null,"Construction of UTFC pavement layer (10mm aggregate, 18mm nominal thickness)","m²",1140000,null,{"$f":"IF(ISNUMBER(H163),H163*I163,IF(H163=\"-\",\"rate only\",\" \"))","v":0}]
[]
[null,null,"PC9.1.16.3",null,null,"Trial section ","m²",{"$f":"3.5*400","v":1400},null,{"$f":"IF(ISNUMBER(H165),H165*I165,IF(H165=\"-\",\"rate only\",\" \"))","v":0}]
[]
[null,"PC9.1.17",{"$nulls":3},"Surface regularity payment adjustments","Prov Sum"]
[null,"PC9.1.18",{"$nulls":3},"Asphalt Texturing "]
[null,null,"PC9.1.18.1",null,null,"Grooving finish ","m²",1800]
[null,"PC9.1.17",{"$nulls":3},"Surface regularity payment adjustments","Prov Sum",1,{"v":500000,"d":"500,000.00"},{"$f":"IF(ISNUMBER(H170),H170*I170,IF(H170=\"-\",\"rate only\",\" \"))","v":{"v":500000,"d":"500,000.00"}}]
[]
[null,"PC9.1.18",{"$nulls":3},"Asphalt Texturing "]
[]
[null,null,"PC9.1.18.1",null,null,"Grooving finish ","m²",1800,null,{"$f":"IF(ISNUMBER(H174),H174*I174,IF(H174=\"-\",\"rate only\",\" \"))","v":0}]
[]
["#BillEnd#"]
["#BillEnd#","TOTAL CARRIED FORWARD TO SUMMARY",{"$nulls":7},{"$f":"SUM(J104:J175)","v":{"v":500000,"d":"500,000.00"}}]
["#BillEnd#"]

{"sheet":"10.1","index":41,"n_rows":225,"n_cols":13,"rows_kept":225,"hidden":true}
["#BillSheet#"]
["#BillSheet#","C10.1","GENERAL REQUIREMENTS FOR SURFACE TREATMENTS",{"$nulls":3},"\n",null,null,"SCHEDULE A",{"$f":"SUBTOTAL(9,M$7:M1062)","v":0},null,{"$f":"J2","v":"SCHEDULE A"}]
["#BillSheet#"]
["ColHDR"]
["ColHDR","ITEM",{"$nulls":3},"DESCRIPTION","UNIT","QTY","RATE","AMT",null,"RATE","AMOUNT"]
["ColHDR"]
[{"$nulls":5},"GENERAL REQUIREMENTS FOR SURFACE TREATMENTS"]
["IHDR1","C10.1.1",{"$nulls":3},"Single seals including a cover spray, if specified (indicate grade of aggregate and type of binder):",{"$nulls":6},{"$f":"IF(ISNUMBER(H8),L8*H8,IF(ISNUMBER(J8),J8,IF(J8=\"RATE ONLY\",LOWER(\"RATE ONLY\"),\" \")))","v":" "}]
[]
["Item",null,"C10.1.1.1",null,null,"Using 5,0 mm aggregate","m²",{"$nulls":5},{"$f":"IF(ISNUMBER(H10),L10*H10,IF(ISNUMBER(J10),J10,IF(J10=\"RATE ONLY\",LOWER(\"RATE ONLY\"),\" \")))","v":" "}]
["Item",null,"C10.1.1.2",null,null,"Using 7,1 mm aggregate","m²",{"$nulls":5}," "]
["Item",null,"C10.1.1.3",null,null,"Using 10 mm aggregate","m²",{"$nulls":5}," "]
["Item",null,"C10.1.1.4",null,null,"Using 14 mm aggregate","m²",{"$nulls":5}," "]
["Item",null,"C10.1.1.5",null,null,"Using 20 mm aggregate","m²",{"$nulls":5}," "]
["IHDR1","C10.1.2",{"$nulls":3},"Single seals including a cover spray, if specified (indicate grade of aggregate and type of binder) spreading the aggregate by (state: walk behind spreader or by hand):",{"$nulls":6},{"$f":"IF(ISNUMBER(H15),L15*H15,IF(ISNUMBER(J15),J15,IF(J15=\"RATE ONLY\",LOWER(\"RATE ONLY\"),\" \")))","v":" "}]
[]
["Item",null,"C10.1.2.1",null,null,"Using 5,0 mm aggregate","m²",{"$nulls":5}," "]
["Item",null,"C10.1.2.2",null,null,"Using 7,1 mm aggregate","m²",{"$nulls":5}," "]
["Item",null,"C10.1.2.3",null,null,"Using 10 mm aggregate","m²",{"$nulls":5}," "]
["Item",null,"C10.1.2.4",null,null,"Using 14 mm aggregate","m²",{"$nulls":5}," "]
["Item",null,"C10.1.2.5",null,null,"Using 20 mm aggregate","m²",{"$nulls":5}," "]
["IHDR1","C10.1.3",{"$nulls":3},"Multiple stone seals including a cover spray, if specified using:",{"$nulls":6},{"$f":"IF(ISNUMBER(H22),L22*H22,IF(ISNUMBER(J22),J22,IF(J22=\"RATE ONLY\",LOWER(\"RATE ONLY\"),\" \")))","v":" "}]
[]
["Item",null,"C10.1.3.1",null,null,"20 mm and 10 mm aggregate (state grade of aggregate and type of binder to be used for each layer)","m²",{"$nulls":5}," "]
["Item",null,"C10.1.3.2",null,null,"20 mm and 7,1 mm aggregate (state grade of aggregate and type of binder to be used for each layer)","m²",{"$nulls":5}," "]
["Item",null,"C10.1.3.3",null,null,"14 mm and 7,1 mm aggregate (state grade of aggregate and type of binder to be used for each layer)","m²",{"$nulls":5}," "]
["Item",null,"C10.1.3.4",null,null,"14 mm and 5,0 mm aggregate (state grade of aggregate and type of binder to be used for each layer)","m²",{"$nulls":5}," "]
["Item",null,"C10.1.3.5",null,null,"20 mm with a split application of 7,1 mm aggregate, grade 1 aggregate with S-R1 non-homogeneous modified binder and S-E1 homogeneous binder and 65% cationic emulsion cover spray","m²",{"$nulls":4},{"v":45,"d":"45.00"},{"$f":"IF(ISNUMBER(H28),L28*H28,IF(ISNUMBER(J28),J28,IF(J28=\"RATE ONLY\",LOWER(\"RATE ONLY\"),\" \")))","v":" "}]
[]
["IHDR1","C10.1.4",{"$nulls":3},"Embargo period effects:",{"$nulls":6},{"$f":"IF(ISNUMBER(H30),L30*H30,IF(ISNUMBER(J30),J30,IF(J30=\"RATE ONLY\",LOWER(\"RATE ONLY\"),\" \")))","v":" "}]
[]
["Item",null,"C10.1.4.1",null,null,"Re-establishment of sealing team after embargo period","lump sum",{"$nulls":5}," "]
["Item",null,"C10.1.4.2",null,null,"Extra-over for sealing during the specified embargo period (State seal type, binder for each layer)","m²",{"$nulls":5}," "]
["IHDR1","C10.1.5",{"$nulls":3},"Sand or Grit seals using:",{"$nulls":6},{"$f":"IF(ISNUMBER(H34),L34*H34,IF(ISNUMBER(J34),J34,IF(J34=\"RATE ONLY\",LOWER(\"RATE ONLY\"),\" \")))","v":" "}]
[]
["Item",null,"C10.1.5.1",null,null,"Sand seal (state grades of aggregate and types of binders to be used)","m²",{"$nulls":5}," "]
["Item",null,"C10.1.5.2",null,null,"Grit seal (state grades of aggregate and types of binders to be used)","m²",{"$nulls":5}," "]
["IHDR1","C10.1.6",{"$nulls":3},"Sand or Grit seals using (state: walk behind spreader or by hand):",{"$nulls":6},{"$f":"IF(ISNUMBER(H38),L38*H38,IF(ISNUMBER(J38),J38,IF(J38=\"RATE ONLY\",LOWER(\"RATE ONLY\"),\" \")))","v":" "}]
[]
["Item",null,"C10.1.6.1",null,null,"Sand seal (state grades of aggregate and types of binders to be used)","m²",{"$nulls":5}," "]
["Item",null,"C10.1.6.2",null,null,"Grit seal (state grades of aggregate and types of binders to be used)","m²",{"$nulls":5}," "]
["IHDR1","C10.1.7",{"$nulls":3},"Graded aggregate (Otta) seals using:",{"$nulls":6},{"$f":"IF(ISNUMBER(H42),L42*H42,IF(ISNUMBER(J42),J42,IF(J42=\"RATE ONLY\",LOWER(\"RATE ONLY\"),\" \")))","v":" "}]
[]
["Item",null,"C10.1.7.1",null,null,"Single minus 20 mm aggregate (state grades of aggregate and types of binders to be used)","m²",{"$nulls":5}," "]
["Item",null,"C10.1.7.2",null,null,"Single minus 14 mm aggregate (state grades of aggregate and types of binders to be used)","m²",{"$nulls":5}," "]
["Item",null,"C10.1.7.3",null,null,"Single minus 10 mm aggregate (state grades of aggregate and types of binders to be used)","m²",{"$nulls":5}," "]
["Item",null,"C10.1.7.4",null,null,"Extra over for sand seal (state grades of aggregate and types of binders to be used)","m²",{"$nulls":5}," "]
["IHDR1","C10.1.8",{"$nulls":3},"Graded aggregate (Otta) seals, with aggregate applied by hand, using:",{"$nulls":6},{"$f":"IF(ISNUMBER(H48),L48*H48,IF(ISNUMBER(J48),J48,IF(J48=\"RATE ONLY\",LOWER(\"RATE ONLY\"),\" \")))","v":" "}]
[]
["Item",null,"C10.1.8.1",null,null,"Single minus 20 mm aggregate (state grades of aggregate and types of binders to be used)","m²",{"$nulls":5},{"$f":"IF(ISNUMBER(H50),L50*H50,IF(ISNUMBER(J50),J50,IF(J50=\"RATE ONLY\",LOWER(\"RATE ONLY\"),\" \")))","v":" "}]
["Item",null,"C10.1.8.2",null,null,"Single minus 14 mm aggregate (state grades of aggregate and types of binders to be used)","m²",{"$nulls":5}," "]
["Item",null,"C10.1.8.3",null,null,"Single minus 10 mm aggregate (state grades of aggregate and types of binders to be used)","m²",{"$nulls":5}," "]
["Item",null,"C10.1.8.4",null,null,"Extra over for sand seal (state grades of aggregate and types of binders to be used)","m²",{"$nulls":5}," "]
["IHDR1","C10.1.9",{"$nulls":3},"Bituminous binder variations:",{"$nulls":6},{"$f":"IF(ISNUMBER(H54),L54*H54,IF(ISNUMBER(J54),J54,IF(J54=\"RATE ONLY\",LOWER(\"RATE ONLY\"),\" \")))","v":" "}]
[]
["IHDR2",null,"C10.1.9.1",null,null,"70/100 Penetration grade bitumen","litre",{"$nulls":5},{"$f":"IF(ISNUMBER(H56),L56*H56,IF(ISNUMBER(J56),J56,IF(J56=\"RATE ONLY\",LOWER(\"RATE ONLY\"),\" \")))","v":" "}]
[]
["IHDR2",null,"C10.1.9.2",null,null,"60 % Stable-grade emulsion","litre",{"$nulls":5},{"$f":"IF(ISNUMBER(H58),L58*H58,IF(ISNUMBER(J58),J58,IF(J58=\"RATE ONLY\",LOWER(\"RATE ONLY\"),\" \")))","v":" "}]
[]
["IHDR2",null,"C10.1.9.3",null,null,"Cationic Stable grade emulsion ((indicate bitumen content)","litre",{"$nulls":5},{"$f":"IF(ISNUMBER(H60),L60*H60,IF(ISNUMBER(J60),J60,IF(J60=\"RATE ONLY\",LOWER(\"RATE ONLY\"),\" \")))","v":" "}]
[]
["IHDR2",null,"C10.1.9.4",null,null,"Cationic emulsion ",{"$nulls":6},{"$f":"IF(ISNUMBER(H62),L62*H62,IF(ISNUMBER(J62),J62,IF(J62=\"RATE ONLY\",LOWER(\"RATE ONLY\"),\" \")))","v":" "}]
[]
["Item",null,null,"(a)",null,"65% Spray-grade","litre",null," ",null,null,{"v":8.7,"d":"8.70"},{"$f":"IF(ISNUMBER(H64),L64*H64,IF(ISNUMBER(J64),J64,IF(J64=\"RATE ONLY\",LOWER(\"RATE ONLY\"),\" \")))","v":" "}]
[]
["Item",null,null,"(b)",null,"35% Spray-grade","litre",null," ",null,null,{"v":8.7,"d":"8.70"},{"$f":"IF(ISNUMBER(H66),L66*H66,IF(ISNUMBER(J66),J66,IF(J66=\"RATE ONLY\",LOWER(\"RATE ONLY\"),\" \")))","v":" "}]
[]
["IHDR2",null,"C10.1.9.5",null,null,"Homogeneous modified binder (indicate type and bitumen content) cold applied","litre",{"$nulls":5},{"$f":"IF(ISNUMBER(H68),L68*H68,IF(ISNUMBER(J68),J68,IF(J68=\"RATE ONLY\",LOWER(\"RATE ONLY\"),\" \")))","v":" "}]
[]
["IHDR2",null,"C10.1.9.6",null,null,"Non-homogeneous modified binder,  S-R1 ","litre",{"$nulls":4},{"v":7.8,"d":"7.80"},{"$f":"IF(ISNUMBER(H70),L70*H70,IF(ISNUMBER(J70),J70,IF(J70=\"RATE ONLY\",LOWER(\"RATE ONLY\"),\" \")))","v":" "}]
[]
["IHDR2",null,"C10.1.9.7",null,null,"Homogeneous modified binder, S-E1, hot applied","litre",{"$nulls":4},{"v":7.8,"d":"7.80"},{"$f":"IF(ISNUMBER(H72),L72*H72,IF(ISNUMBER(J72),J72,IF(J72=\"RATE ONLY\",LOWER(\"RATE ONLY\"),\" \")))","v":" "}]
[]
["IHDR2",null,"C10.1.9.8",null,null,"Homogeneous modified binder S-E1 with 4,5% MC30","litre",{"$nulls":5},{"$f":"IF(ISNUMBER(H74),L74*H74,IF(ISNUMBER(J74),J74,IF(J74=\"RATE ONLY\",LOWER(\"RATE ONLY\"),\" \")))","v":" "}]
[]
["IHDR2",null,"C10.1.9.9",null,null,"Homogeneous modified binder S-E1 with 9% MC30","litre",{"$nulls":5},{"$f":"IF(ISNUMBER(H76),L76*H76,IF(ISNUMBER(J76),J76,IF(J76=\"RATE ONLY\",LOWER(\"RATE ONLY\"),\" \")))","v":" "}]
[]
["IHDR2",null,"C10.1.9.10",null,null,"MC-3000 cut-back bitumen","litre",{"$nulls":5},{"$f":"IF(ISNUMBER(H78),L78*H78,IF(ISNUMBER(J78),J78,IF(J78=\"RATE ONLY\",LOWER(\"RATE ONLY\"),\" \")))","v":" "}]
[]
["IHDR2",null,"C10.1.9.11",null,null,"Precoating fluid ","litre",{"$nulls":4},{"v":13.6,"d":"13.60"},{"$f":"IF(ISNUMBER(H80),L80*H80,IF(ISNUMBER(J80),J80,IF(J80=\"RATE ONLY\",LOWER(\"RATE ONLY\"),\" \")))","v":" "}]
[]
["IHDR2",null,"PC10.1.9.12",null,null,"Non-homogeneous modified binder,  SC-E1 (70-73)(t) ","litre",{"$nulls":4},{"v":12,"d":"12.00"},{"$f":"IF(ISNUMBER(H82),L82*H82,IF(ISNUMBER(J82),J82,IF(J82=\"RATE ONLY\",LOWER(\"RATE ONLY\"),\" \")))","v":" "}]
[]
["IHDR1","C10.1.10",{"$nulls":3},"Aggregate variation (grade 1):",{"$nulls":6},{"$f":"IF(ISNUMBER(H84),L84*H84,IF(ISNUMBER(J84),J84,IF(J84=\"RATE ONLY\",LOWER(\"RATE ONLY\"),\" \")))","v":" "}]
[]
["Item",null,"C10.1.10.1",null,null,"5 mm aggregate","m³",{"$nulls":5}," "]
["Item",null,"C10.1.10.2",null,null,"7,1 mm aggregate","m³",{"$nulls":4},{"v":620,"d":"620.00"},{"$f":"IF(ISNUMBER(H87),L87*H87,IF(ISNUMBER(J87),J87,IF(J87=\"RATE ONLY\",LOWER(\"RATE ONLY\"),\" \")))","v":" "}]
[]
["Item",null,"C10.1.10.3",null,null,"10 mm aggregate","m³",{"$nulls":5}," "]
["Item",null,"C10.1.10.4",null,null,"14 mm aggregate","m³",{"$nulls":5}," "]
["Item",null,"C10.1.10.5",null,null,"20 mm aggregate","m³",{"$nulls":4},{"v":730,"d":"730.00"},{"$f":"IF(ISNUMBER(H91),L91*H91,IF(ISNUMBER(J91),J91,IF(J91=\"RATE ONLY\",LOWER(\"RATE ONLY\"),\" \")))","v":" "}]
[]
["Item",null,"C10.1.10.6",null,null,"Sand","m³",{"$nulls":5}," "]
["Item",null,"C10.1.10.7",null,null,"Grit","m³",{"$nulls":5}," "]
["IHDR1","C10.1.11",{"$nulls":3},"Application of cover spray:",{"$nulls":6},{"$f":"IF(ISNUMBER(H95),L95*H95,IF(ISNUMBER(J95),J95,IF(J95=\"RATE ONLY\",LOWER(\"RATE ONLY\"),\" \")))","v":" "}]
[]
["Item",null,"C10.1.11.1",null,null,"60 % Anionic Stable-grade emulsion","litre",{"$nulls":5}," "]
["Item",null,"C10.1.11.2",null,null,"60 % Diluted Anionic stable-grade emulsion (indicate dilution in % emulsion/%water)","litre",{"$nulls":5}," "]
["Item",null,"C10.1.11.3",null,null,"Diluted 65% Cationic spray-grade emulsion ","litre",{"$nulls":4},{"v":8.7,"d":"8.70"},{"$f":"IF(ISNUMBER(H99),L99*H99,IF(ISNUMBER(J99),J99,IF(J99=\"RATE ONLY\",LOWER(\"RATE ONLY\"),\" \")))","v":" "}]
[]
["Item",null,"C10.1.11.4",null,null,"Diluted SC-E1 (indicate % bitumen and dilution in % emulsion/%water)","litre",{"$nulls":5}," "]
["IHDR1","C10.1.12",{"$nulls":3},"Application of cover spray by hand:",{"$nulls":6},{"$f":"IF(ISNUMBER(H102),L102*H102,IF(ISNUMBER(J102),J102,IF(J102=\"RATE ONLY\",LOWER(\"RATE ONLY\"),\" \")))","v":" "}]
[]
["Item",null,"C10.1.12.1",null,null,"60 % Anionic Stable-grade emulsion","litre",{"$nulls":5}," "]
["Item",null,"C10.1.12.2",null,null,"60 % Diluted Anionic stable-grade emulsion (indicate dilution in % emulsion/%water)","litre",{"$nulls":5},{"$f":"IF(ISNUMBER(H105),L105*H105,IF(ISNUMBER(J105),J105,IF(J105=\"RATE ONLY\",LOWER(\"RATE ONLY\"),\" \")))","v":" "}]
["Item",null,"C10.1.12.3",null,null,"Diluted Cationic spray-grade emulsion (indicate % bitumen and dilution in % emulsion/%water)","litre",{"$nulls":5}," "]
["Item",null,"C10.1.12.4",null,null,"Diluted SC-E1 (indicate % bitumen and dilution in % emulsion/%water)","litre",{"$nulls":5}," "]
["IHDR1","C10.1.13",{"$nulls":3},"Precoating of aggregate using a dedicated plant:",{"$nulls":6},{"$f":"IF(ISNUMBER(H108),L108*H108,IF(ISNUMBER(J108),J108,IF(J108=\"RATE ONLY\",LOWER(\"RATE ONLY\"),\" \")))","v":" "}]
[]
["Item",null,"C10.1.13.1",null,null,"Product containing low flashpoint solvent (indicate precoating fluid)","litre",{"$nulls":5}," "]
["Item",null,"C10.1.13.2",null,null,"Product containing no low flashpoint solvent (indicate precoating fluid)","litre",{"$nulls":5}," "]
["IHDR1","C10.1.14",{"$nulls":3},"Precoating of aggregate using a frontend loader:",{"$nulls":6},{"$f":"IF(ISNUMBER(H112),L112*H112,IF(ISNUMBER(J112),J112,IF(J112=\"RATE ONLY\",LOWER(\"RATE ONLY\"),\" \")))","v":" "}]
[]
["Item",null,"C10.1.14.1",null,null,"Product containing low flashpoint solvent ","litre",{"$nulls":4},{"v":13.6,"d":"13.60"},{"$f":"IF(ISNUMBER(H114),L114*H114,IF(ISNUMBER(J114),J114,IF(J114=\"RATE ONLY\",LOWER(\"RATE ONLY\"),\" \")))","v":" "}]
[]
["Item",null,"C10.1.14.2",null,null,"Product containing no low flashpoint solvent (indicate precoating fluid)","litre",{"$nulls":5}," "]
["IHDR1","C10.1.15",{"$nulls":3},"Precoating of aggregate by hand:",{"$nulls":6},{"$f":"IF(ISNUMBER(H117),L117*H117,IF(ISNUMBER(J117),J117,IF(J117=\"RATE ONLY\",LOWER(\"RATE ONLY\"),\" \")))","v":" "}]
[]
["Item",null,"C10.1.15.1",null,null,"Product containing low flashpoint solvent (indicate precoating fluid)","litre",{"$nulls":5}," "]
["Item",null,"C10.1.15.2",null,null,"Product containing no low flashpoint solvent (indicate precoating fluid)","litre",{"$nulls":5}," "]
["IHDR1","C10.1.16",{"$nulls":3},"Addition of wetting agent:",{"$nulls":6},{"$f":"IF(ISNUMBER(H121),L121*H121,IF(ISNUMBER(J121),J121,IF(J121=\"RATE ONLY\",LOWER(\"RATE ONLY\"),\" \")))","v":" "}]
[]
["Item",null,"C10.1.16.1",null,null,"Providing and supplying","PC sum",{"$nulls":5}," "]
["Item",null,"C10.1.16.2",null,null,"Handling, applying, profit and all other costs","%",{"$nulls":5}," "]
["IHDR1","C10.1.17",{"$nulls":3},"Aggregate for blinding:",{"$nulls":6},{"$f":"IF(ISNUMBER(H125),L125*H125,IF(ISNUMBER(J125),J125,IF(J125=\"RATE ONLY\",LOWER(\"RATE ONLY\"),\" \")))","v":" "}]
[]
["Item",null,"C10.1.17.1",null,null,"Natural sand","m³",{"$nulls":5}," "]
["Item",null,"C10.1.17.2",null,null,"Crusher sand","m³",{"$nulls":4},{"v":150,"d":"150.00"},{"$f":"IF(ISNUMBER(H128),L128*H128,IF(ISNUMBER(J128),J128,IF(J128=\"RATE ONLY\",LOWER(\"RATE ONLY\"),\" \")))","v":" "}]
[]
["IHDR1","C10.1.18",{"$nulls":3},"Aggregate for blinding by hand:",{"$nulls":6},{"$f":"IF(ISNUMBER(H130),L130*H130,IF(ISNUMBER(J130),J130,IF(J130=\"RATE ONLY\",LOWER(\"RATE ONLY\"),\" \")))","v":" "}]
[]
["Item",null,"C10.1.18.1",null,null,"Natural sand","m³",{"$nulls":5}," "]
["Item",null,"C10.1.18.2",null,null,"Crusher sand","m³",{"$nulls":4},{"v":160,"d":"160.00"},{"$f":"IF(ISNUMBER(H133),L133*H133,IF(ISNUMBER(J133),J133,IF(J133=\"RATE ONLY\",LOWER(\"RATE ONLY\"),\" \")))","v":" "}]
[]
["IHDR1","C10.1.19",{"$nulls":3},"Extra over item for work in areas inaccessible to mechanical equipment:",{"$nulls":6},{"$f":"IF(ISNUMBER(H135),L135*H135,IF(ISNUMBER(J135),J135,IF(J135=\"RATE ONLY\",LOWER(\"RATE ONLY\"),\" \")))","v":" "}]
[]
["IHDR2",null,"C10.1.19.1",null,null,"Single seals","m²",{"$nulls":5},{"$f":"IF(ISNUMBER(H137),L137*H137,IF(ISNUMBER(J137),J137,IF(J137=\"RATE ONLY\",LOWER(\"RATE ONLY\"),\" \")))","v":" "}]
[]
["IHDR2",null,"C10.1.19.2",null,null,"Multiple stone seals","m²",{"$nulls":5},{"$f":"IF(ISNUMBER(H139),L139*H139,IF(ISNUMBER(J139),J139,IF(J139=\"RATE ONLY\",LOWER(\"RATE ONLY\"),\" \")))","v":" "}]
[]
["IHDR2",null,"C10.1.19.3",null,null,"Cape seals with one layer of slurry","m²",{"$nulls":5},{"$f":"IF(ISNUMBER(H141),L141*H141,IF(ISNUMBER(J141),J141,IF(J141=\"RATE ONLY\",LOWER(\"RATE ONLY\"),\" \")))","v":" "}]
[]
["IHDR2",null,"C10.1.19.4",null,null,"Cape seals with two layers of slurry","m²",{"$nulls":5},{"$f":"IF(ISNUMBER(H143),L143*H143,IF(ISNUMBER(J143),J143,IF(J143=\"RATE ONLY\",LOWER(\"RATE ONLY\"),\" \")))","v":" "}]
[]
["IHDR2",null,"C10.1.19.5",null,null,"Graded aggregate seals","m²",{"$nulls":5},{"$f":"IF(ISNUMBER(H145),L145*H145,IF(ISNUMBER(J145),J145,IF(J145=\"RATE ONLY\",LOWER(\"RATE ONLY\"),\" \")))","v":" "}]
[]
["IHDR2",null,"C10.1.19.6",null,null,"Sand and Grit seals","m²",{"$nulls":5},{"$f":"IF(ISNUMBER(H147),L147*H147,IF(ISNUMBER(J147),J147,IF(J147=\"RATE ONLY\",LOWER(\"RATE ONLY\"),\" \")))","v":" "}]
[]
["IHDR2",null,"C10.1.19.7",null,null,"Conventional slurry","m²",{"$nulls":5},{"$f":"IF(ISNUMBER(H149),L149*H149,IF(ISNUMBER(J149),J149,IF(J149=\"RATE ONLY\",LOWER(\"RATE ONLY\"),\" \")))","v":" "}]
[]
["IHDR2",null,"C10.1.19.8",null,null,"Microsurfacing","m²",{"$nulls":5},{"$f":"IF(ISNUMBER(H151),L151*H151,IF(ISNUMBER(J151),J151,IF(J151=\"RATE ONLY\",LOWER(\"RATE ONLY\"),\" \")))","v":" "}]
[]
["IHDR2",null,"C10.1.19.9",null,null,"Adding Grit or slurry to single seals on areas subjected to traffic turning and breaking actions or localised cold areas:",{"$nulls":6},{"$f":"IF(ISNUMBER(H153),L153*H153,IF(ISNUMBER(J153),J153,IF(J153=\"RATE ONLY\",LOWER(\"RATE ONLY\"),\" \")))","v":" "}]
[]
["Item",null,null,"(a)",null,"Application of diluted emulsion (State type, % bitumen and dilution)","litre",{"$nulls":5}," "]
["Item",null,null,"(b)",null,"Applying Grit","m³",{"$nulls":5},{"$f":"IF(ISNUMBER(H156),L156*H156,IF(ISNUMBER(J156),J156,IF(J156=\"RATE ONLY\",LOWER(\"RATE ONLY\"),\" \")))","v":" "}]
["Item",null,null,"(c)",null,"Applying Texture slurry","m³",{"$nulls":5}," "]
["IHDR1","C10.1.20",{"$nulls":3},"Supply and application of geosynthetic membrane:",{"$nulls":6},{"$f":"IF(ISNUMBER(H158),L158*H158,IF(ISNUMBER(J158),J158,IF(J158=\"RATE ONLY\",LOWER(\"RATE ONLY\"),\" \")))","v":" "}]
[]
["Item",null,"C10.1.20.1",null,null,"Supply and application of geosynthetic membrane (state type)","m²",{"$nulls":5}," "]
["IHDR1","C10.1.21",{"$nulls":3},"Slurry and microsurfacing:",{"$nulls":6},{"$f":"IF(ISNUMBER(H161),L161*H161,IF(ISNUMBER(J161),J161,IF(J161=\"RATE ONLY\",LOWER(\"RATE ONLY\"),\" \")))","v":" "}]
[]
["Item",null,"C10.1.21.1",null,null,"Conventional slurry (indicate type and grade of binder and grade of aggregate)","m³",{"$nulls":5}," "]
["Item",null,"C10.1.21.2",null,null,"Microsurfacing (indicate type and grade of binder and grade of aggregate)","m³",{"$nulls":5}," "]
["IHDR1","C10.1.22",{"$nulls":3},"Bituminous single seal and slurry, including a cover spray if specified:",{"$nulls":6},{"$f":"IF(ISNUMBER(H165),L165*H165,IF(ISNUMBER(J165),J165,IF(J165=\"RATE ONLY\",LOWER(\"RATE ONLY\"),\" \")))","v":" "}]
["PB"]
["PB","CARRIED FORWARD",{"$nulls":10},{"$f":"SUBTOTAL(9,M$7:M165)","v":0}]
["PB"]
["PB"]
["PB","BROUGHT FORWARD",{"$nulls":10},{"$f":"SUBTOTAL(9,M$7:M168)","v":0}]
["PB"]
[]
["IHDR2",null,"C10.1.22.1",null,null,"Bituminous single seal with 20 mm grade 1 aggregate and first slurry and 35% spray-grade emulsion cover spray "," "," ",{"$nulls":4},{"$f":"IF(ISNUMBER(H173),L173*H173,IF(ISNUMBER(J173),J173,IF(J173=\"RATE ONLY\",LOWER(\"RATE ONLY\"),\" \")))","v":" "}]
[]
["Item",null,null,"(a)",null,"Tack Coat: S-E1 Hot applied polymer modified bitumen","m²",{"$nulls":4},{"v":45,"d":"45.00"},{"$f":"IF(ISNUMBER(H175),L175*H175,IF(ISNUMBER(J175),J175,IF(J175=\"RATE ONLY\",LOWER(\"RATE ONLY\"),\" \")))","v":" "}]
[]
["Item",null,null,"(b)",null,"Tack Coat:  SC-E1 (70-73)t Cold applied latex modified binder","m²",{"$nulls":4},{"v":52,"d":"52.00"},{"$f":"IF(ISNUMBER(H177),L177*H177,IF(ISNUMBER(J177),J177,IF(J177=\"RATE ONLY\",LOWER(\"RATE ONLY\"),\" \")))","v":" "}]
[]
[{"$nulls":5},"(ii)Cover spray:35% spray-grade emulsion","m²",{"$nulls":5}," "]
["IHDR2",null,"C10.1.22.2",null,null,"Bituminous single seal with 14 mm aggregate and slurry (indicate type of tack coat and cover spray binder, grade of aggregate and grade of slurry)","m²",{"$nulls":5},{"$f":"IF(ISNUMBER(H180),L180*H180,IF(ISNUMBER(J180),J180,IF(J180=\"RATE ONLY\",LOWER(\"RATE ONLY\"),\" \")))","v":" "}]
[]
["IHDR2",null,"C10.1.22.3",null,null,"Bituminous single seal with 10 mm aggregate and slurry (indicate type of tack coat and cover spray binder, grade of aggregate and grade of slurry)","m²",{"$nulls":5},{"$f":"IF(ISNUMBER(H182),L182*H182,IF(ISNUMBER(J182),J182,IF(J182=\"RATE ONLY\",LOWER(\"RATE ONLY\"),\" \")))","v":" "}]
[]
["IHDR2",null,"C10.1.22.4",null,null,"Extra over C10.1.22.1 for application of fine second slurry ","m²",{"$nulls":4},{"v":13.2,"d":"13.20"},{"$f":"IF(ISNUMBER(H184),L184*H184,IF(ISNUMBER(J184),J184,IF(J184=\"RATE ONLY\",LOWER(\"RATE ONLY\"),\" \")))","v":" "}]
[]
["IHDR1","C10.1.23",{"$nulls":3},"Slurry-bound macadam seal:",{"$nulls":6},{"$f":"IF(ISNUMBER(H186),L186*H186,IF(ISNUMBER(J186),J186,IF(J186=\"RATE ONLY\",LOWER(\"RATE ONLY\"),\" \")))","v":" "}]
[]
["Item",null,"C10.1.23.1",null,null,"Slurry-bound macadam seal with 14 mm aggregate and slurry (indicate thickness and grade of aggregate)","m²",{"$nulls":5}," "]
["Item",null,"C10.1.23.2",null,null,"Slurry-bound macadam seal with 20 mm aggregate and slurry (indicate thickness and grade of aggregate)","m²",{"$nulls":5}," "]
["Item",null,"C10.1.23.3",null,null,"Slurry-bound macadam seal with 28 mm aggregate and slurry (indicate thickness and grade of aggregate)","m²",{"$nulls":5}," "]
["IHDR1","C10.1.24",{"$nulls":3},"Variation in the rate of application of the fine slurry:",{"$nulls":6},{"$f":"IF(ISNUMBER(H191),L191*H191,IF(ISNUMBER(J191),J191,IF(J191=\"RATE ONLY\",LOWER(\"RATE ONLY\"),\" \")))","v":" "}]
[]
["Item",null,"C10.1.24.1",null,null,"Fine grade","m³",{"$nulls":5}," "]
["Item",null,"C10.1.24.2",null,null,"Medium grade","m³",{"$nulls":4},{"v":2710,"d":"2,710.00"},{"$f":"IF(ISNUMBER(H194),L194*H194,IF(ISNUMBER(J194),J194,IF(J194=\"RATE ONLY\",LOWER(\"RATE ONLY\"),\" \")))","v":" "}]
[]
["IHDR1","C10.1.25",{"$nulls":3},"Variation in active filler content (specify active filler)","t",{"$nulls":5},{"$f":"IF(ISNUMBER(H196),L196*H196,IF(ISNUMBER(J196),J196,IF(J196=\"RATE ONLY\",LOWER(\"RATE ONLY\"),\" \")))","v":" "}]
[]
["IHDR1","C10.1.26",{"$nulls":3},"Trial sections for all seal types specified:",{"$nulls":6},{"$f":"IF(ISNUMBER(H198),L198*H198,IF(ISNUMBER(J198),J198,IF(J198=\"RATE ONLY\",LOWER(\"RATE ONLY\"),\" \")))","v":" "}]
[]
["Item",null,"C10.1.26.1",null,null,"Multiple stone seals: 20 mm with a split application of 7,1 mm aggregate, grade 1 aggregate with S-R1 non-homogeneous modified binder and S-E1 homogeneous binder ","lump sum",{"$nulls":4},{"v":50000,"d":"50,000.00"},{"$f":"IF(ISNUMBER(H200),L200*H200,IF(ISNUMBER(J200),J200,IF(J200=\"RATE ONLY\",LOWER(\"RATE ONLY\"),\" \")))","v":" "}]
[]
["Item",null,"C10.1.26.2",null,null,"Bituminous single seal and slurry, including a cover spray: Tack Coat: S-E1 Hot applied polymer modified bitumen, Cover spray:35% spray-grade emulsion, Medium Grade Slurry   ","lump sum",{"$nulls":4},{"v":50000,"d":"50,000.00"},{"$f":"IF(ISNUMBER(H202),L202*H202,IF(ISNUMBER(J202),J202,IF(J202=\"RATE ONLY\",LOWER(\"RATE ONLY\"),\" \")))","v":" "}]
[]
["IHDR1","C10.1.27",{"$nulls":3},"Provision of Performance Guarantee in respect of the Surfacing","lump sum",{"$nulls":5},{"$f":"IF(ISNUMBER(H204),L204*H204,IF(ISNUMBER(J204),J204,IF(J204=\"RATE ONLY\",LOWER(\"RATE ONLY\"),\" \")))","v":" "}]
[]
["IHDR1","C10.1.28",{"$nulls":3},"Surfacing (state type and binders)","m²",{"$nulls":5},{"$f":"IF(ISNUMBER(H206),L206*H206,IF(ISNUMBER(J206),J206,IF(J206=\"RATE ONLY\",LOWER(\"RATE ONLY\"),\" \")))","v":" "}]
{"$rows_empty":16}
["#BillEnd#"]
["#BillEnd#","TOTAL CARRIED FORWARD TO SUMMARY",{"$nulls":10},{"$f":"SUBTOTAL(9,M$7:M207)","v":0}]
["#BillEnd#"]

{"sheet":"11.1","index":42,"n_rows":77,"n_cols":13,"rows_kept":77,"hidden":true}
["#BillSheet#"]
["#BillSheet#","C11.1","PITCHING, STONEWORK, CAST IN SITU CONCRETE FOR PROTECTION AGAINST EROSION",{"$nulls":6},"SCHEDULE A",{"$f":"SUBTOTAL(9,M$7:M1018)","v":{"v":15000,"d":"15,000.00"}},null,{"$f":"J2","v":"SCHEDULE A"}]
["#BillSheet#"]
["ColHDR"]
["ColHDR","ITEM",{"$nulls":3},"DESCRIPTION","UNIT","QTY","RATE","AMT",null,"RATE","AMOUNT"]
["ColHDR"]
[{"$nulls":5},"PITCHING, STONEWORK, CAST IN SITU CONCRETE FOR PROTECTION AGAINST EROSION"]
["IHDR1","C11.1.1",{"$nulls":3},"Foundation trenches for stone masonry walls:",{"$nulls":6},{"$f":"IF(ISNUMBER(H8),L8*H8,IF(ISNUMBER(J8),J8,IF(J8=\"RATE ONLY\",LOWER(\"RATE ONLY\"),\" \")))","v":" "}]
[]
["Item",null,"C11.1.1.1",null,null,"Excavating foundation trenches in soft material using labour enhanced construction methods 0 m to 1,0 m depth","m³",{"$nulls":5},{"$f":"IF(ISNUMBER(H10),L10*H10,IF(ISNUMBER(J10),J10,IF(J10=\"RATE ONLY\",LOWER(\"RATE ONLY\"),\" \")))","v":" "}]
["Item",null,"C11.1.1.2",null,null,"Excavating foundation trenches in intermediate material using labour enhanced construction methods 0 m to 1,0 m depth","m³",{"$nulls":5}," "]
["IHDR1","C11.1.2",{"$nulls":3},"Stone pitching:",{"$nulls":6},{"$f":"IF(ISNUMBER(H12),L12*H12,IF(ISNUMBER(J12),J12,IF(J12=\"RATE ONLY\",LOWER(\"RATE ONLY\"),\" \")))","v":" "}]
[]
["IHDR2",null,"C11.1.2.1",null,null,"Plain stone pitching:",{"$nulls":6},{"$f":"IF(ISNUMBER(H14),L14*H14,IF(ISNUMBER(J14),J14,IF(J14=\"RATE ONLY\",LOWER(\"RATE ONLY\"),\" \")))","v":" "}]
[]
["Item",null,null,"(a)",null,"Method 1","m²",{"$nulls":4},{"v":205,"d":"205.00"},{"$f":"IF(ISNUMBER(H16),L16*H16,IF(ISNUMBER(J16),J16,IF(J16=\"RATE ONLY\",LOWER(\"RATE ONLY\"),\" \")))","v":" "}]
[]
["Item",null,null,"(b)",null,"Method 2","m²",{"$nulls":5}," "]
["IHDR2",null,"C11.1.2.2",null,null,"Grouted stone pitching with mortar","m²",{"$nulls":4},{"v":350,"d":"350.00"},{"$f":"IF(ISNUMBER(H19),L19*H19,IF(ISNUMBER(J19),J19,IF(J19=\"RATE ONLY\",LOWER(\"RATE ONLY\"),\" \")))","v":" "}]
[]
["IHDR2",null,"C11.1.2.3",null,null,"Grouted stone pitching on a concrete bed","m²",{"$nulls":5},{"$f":"IF(ISNUMBER(H21),L21*H21,IF(ISNUMBER(J21),J21,IF(J21=\"RATE ONLY\",LOWER(\"RATE ONLY\"),\" \")))","v":" "}]
[]
["IHDR1","C11.1.3",{"$nulls":3},"Riprap:",{"$nulls":6},{"$f":"IF(ISNUMBER(H23),L23*H23,IF(ISNUMBER(J23),J23,IF(J23=\"RATE ONLY\",LOWER(\"RATE ONLY\"),\" \")))","v":" "}]
[]
["IHDR2",null,"C11.1.3.1",null,null,"Packed riprap (“critical mass of stone” and thickness indicated)","m³",{"$nulls":5},{"$f":"IF(ISNUMBER(H25),L25*H25,IF(ISNUMBER(J25),J25,IF(J25=\"RATE ONLY\",LOWER(\"RATE ONLY\"),\" \")))","v":" "}]
[]
["IHDR2",null,"C11.1.3.2",null,null,"Extra over item C11.1.3.1 for constructing packed riprap using labour enhanced construction methods (Maximum size of stone shall be 0,03 m³ or a maximum mass of 30 kg)","m³",{"$nulls":5},{"$f":"IF(ISNUMBER(H27),L27*H27,IF(ISNUMBER(J27),J27,IF(J27=\"RATE ONLY\",LOWER(\"RATE ONLY\"),\" \")))","v":" "}]
[]
["IHDR2",null,"C11.1.3.3",null,null,"Dumped riprap (50kg, 300mm thick) - (at down pipe outlets)","m³",{"$nulls":4},{"v":290,"d":"290.00"},{"$f":"IF(ISNUMBER(H29),L29*H29,IF(ISNUMBER(J29),J29,IF(J29=\"RATE ONLY\",LOWER(\"RATE ONLY\"),\" \")))","v":" "}]
[]
["IHDR2",null,"C11.1.3.4",null,null,"Filter layer consisting of:",{"$nulls":6},{"$f":"IF(ISNUMBER(H31),L31*H31,IF(ISNUMBER(J31),J31,IF(J31=\"RATE ONLY\",LOWER(\"RATE ONLY\"),\" \")))","v":" "}]
[]
["Item",null,null,"(a)",null,"Crushed stone (at down pipe outlets)","m³",{"$nulls":4},{"v":340,"d":"340.00"},{"$f":"IF(ISNUMBER(H33),L33*H33,IF(ISNUMBER(J33),J33,IF(J33=\"RATE ONLY\",LOWER(\"RATE ONLY\"),\" \")))","v":" "}]
[]
["Item",null,null,"(b)",null,"Filter sand","m³",{"$nulls":5}," "]
["Item",null,null,"(c)",null,"Geotextile (synthetic-fibre filter fabric, Grade 3) - (at down pipe outlets)","m²",{"$nulls":4},{"v":18.5,"d":"18.50"},{"$f":"IF(ISNUMBER(H36),L36*H36,IF(ISNUMBER(J36),J36,IF(J36=\"RATE ONLY\",LOWER(\"RATE ONLY\"),\" \")))","v":" "}]
[]
["IHDR1","C11.1.4",{"$nulls":3},"Stone masonry walls:",{"$nulls":6},{"$f":"IF(ISNUMBER(H38),L38*H38,IF(ISNUMBER(J38),J38,IF(J38=\"RATE ONLY\",LOWER(\"RATE ONLY\"),\" \")))","v":" "}]
[]
["Item",null,"C11.1.4.1",null,null,"Plain packed stone walls","m³",{"$nulls":5}," "]
["Item",null,"C11.1.4.2",null,null,"Cement-mortared stone walls","m³",{"$nulls":5}," "]
["Item",null,"C11.1.4.3",null,null,"Extra over items C11.1.4.1 and C11.1.4.2 for procuring stone from commercial sources","m³",{"$nulls":5}," "]
["IHDR1","C11.1.5",{"$nulls":3},"Concrete pitching or paving:",{"$nulls":6},{"$f":"IF(ISNUMBER(H43),L43*H43,IF(ISNUMBER(J43),J43,IF(J43=\"RATE ONLY\",LOWER(\"RATE ONLY\"),\" \")))","v":" "}]
[]
["IHDR2",null,"C11.1.5.1",null,null,"Cast in situ concrete pitching or paving (class of concrete and thickness of pitching or paving indicated)","m²",{"$nulls":5},{"$f":"IF(ISNUMBER(H45),L45*H45,IF(ISNUMBER(J45),J45,IF(J45=\"RATE ONLY\",LOWER(\"RATE ONLY\"),\" \")))","v":" "}]
[]
["IHDR2",null,"C11.1.5.2",null,null,"Prefabricated concrete grass blocks (Armorflex interlocking blocks or similar approved, 140mm thick as shown on the drawings)",{"$nulls":6},{"$f":"IF(ISNUMBER(H47),L47*H47,IF(ISNUMBER(J47),J47,IF(J47=\"RATE ONLY\",LOWER(\"RATE ONLY\"),\" \")))","v":" "}]
[]
["IHDR3",null,null,"(a)",null,"Along catchwater banks:",{"$nulls":6},{"$f":"IF(ISNUMBER(H49),L49*H49,IF(ISNUMBER(J49),J49,IF(J49=\"RATE ONLY\",LOWER(\"RATE ONLY\"),\" \")))","v":" "}]
[]
["Item",{"$nulls":3},"(i)","3.0 m wide channel (Type 3A)","m²",{"$nulls":4},{"v":600,"d":"600.00"},{"$f":"IF(ISNUMBER(H51),L51*H51,IF(ISNUMBER(J51),J51,IF(J51=\"RATE ONLY\",LOWER(\"RATE ONLY\"),\" \")))","v":" "}]
[]
["Item",{"$nulls":3},"(ii)","2.5 m wide channel (Type 3B)","m²",{"$nulls":4},{"v":700,"d":"700.00"},{"$f":"IF(ISNUMBER(H53),L53*H53,IF(ISNUMBER(J53),J53,IF(J53=\"RATE ONLY\",LOWER(\"RATE ONLY\"),\" \")))","v":" "}]
[]
["IHDR3",null,null,"(b)",null,"Along cut benches, 1.725 m wide channel","m²",{"$nulls":4},{"v":960,"d":"960.00"},{"$f":"IF(ISNUMBER(H55),L55*H55,IF(ISNUMBER(J55),J55,IF(J55=\"RATE ONLY\",LOWER(\"RATE ONLY\"),\" \")))","v":" "}]
[]
["IHDR2",null,"C11.1.5.3",null,null,"Welded steel fabric used for cast in situ pitching or paving (type indicated)","kg",{"$nulls":5},{"$f":"IF(ISNUMBER(H57),L57*H57,IF(ISNUMBER(J57),J57,IF(J57=\"RATE ONLY\",LOWER(\"RATE ONLY\"),\" \")))","v":" "}]
[]
["IHDR1","C11.1.6",{"$nulls":3},"Concrete edge beams (class C16/20-20 concrete) - (at catchwater bank channels and cut bench channels)","m³",{"$nulls":4},{"v":1950,"d":"1,950.00"},{"$f":"IF(ISNUMBER(H59),L59*H59,IF(ISNUMBER(J59),J59,IF(J59=\"RATE ONLY\",LOWER(\"RATE ONLY\"),\" \")))","v":" "}]
[]
["IHDR1","C11.1.7",{"$nulls":3},"Provision of approved herbicide and ant poison:",{"$nulls":6},{"$f":"IF(ISNUMBER(H61),L61*H61,IF(ISNUMBER(J61),J61,IF(J61=\"RATE ONLY\",LOWER(\"RATE ONLY\"),\" \")))","v":" "}]
[]
["Item",null,"C11.1.7.1",null,null,"Provision of materials","PC sum",null,{"v":15000,"d":"15,000.00"},{"$f":"I63","v":{"v":15000,"d":"15,000.00"}},null,{"v":15000,"d":"15,000.00"},{"$f":"IF(ISNUMBER(H63),L63*H63,IF(ISNUMBER(J63),J63,IF(J63=\"RATE ONLY\",LOWER(\"RATE ONLY\"),\" \")))","v":{"v":15000,"d":"15,000.00"}}]
[]
["Item3",null,"C11.1.7.2",null,null,"Contractor’s charges and profit added to the prime cost sum","%",{"$nulls":4},{"v":0.1,"d":"10%"},{"$f":"IF(ISNUMBER(H65),L65*H65,IF(ISNUMBER(J65),J65,IF(J65=\"RATE ONLY\",LOWER(\"RATE ONLY\"),\" \")))","v":" "}]
{"$rows_empty":9}
["#BillEnd#"]
["#BillEnd#","TOTAL CARRIED FORWARD TO SUMMARY",{"$nulls":10},{"$f":"SUBTOTAL(9,M$7:M66)","v":{"v":15000,"d":"15,000.00"}}]
["#BillEnd#"]

{"sheet":"11.2","index":43,"n_rows":58,"n_cols":13,"rows_kept":58,"hidden":true}
["#BillSheet#"]
["#BillSheet#","C11.2","NON-STRUCTURAL GABIONS",{"$nulls":3},"\n",null,null,"SCHEDULE A",{"$f":"SUBTOTAL(9,M$7:M1037)","v":0},null,{"$f":"J2","v":"SCHEDULE A"}]
["#BillSheet#"]
["ColHDR"]
["ColHDR","ITEM",{"$nulls":3},"DESCRIPTION","UNIT","QTY","RATE","AMT",null,"RATE","AMOUNT"]
["ColHDR"]
[{"$nulls":5},"NON-STRUCTURAL GABIONS"]
["IHDR1","C11.2.1",{"$nulls":3},"Foundation trench excavation:",{"$nulls":6},{"$f":"IF(ISNUMBER(H8),L8*H8,IF(ISNUMBER(J8),J8,IF(J8=\"RATE ONLY\",LOWER(\"RATE ONLY\"),\" \")))","v":" "}]
[]
["IHDR2",null,"C11.2.1.1",null,null,"Excavating all material situated within the following depth ranges below the surface level:",{"$nulls":6},{"$f":"IF(ISNUMBER(H10),L10*H10,IF(ISNUMBER(J10),J10,IF(J10=\"RATE ONLY\",LOWER(\"RATE ONLY\"),\" \")))","v":" "}]
[]
["Item",null,null,"(a)",null,"0 m to 1,5 m","m³",{"$nulls":4},{"v":100,"d":"100.00"},{"$f":"IF(ISNUMBER(H12),L12*H12,IF(ISNUMBER(J12),J12,IF(J12=\"RATE ONLY\",LOWER(\"RATE ONLY\"),\" \")))","v":" "}]
[]
["Item",null,null,"(b)",null,"Exceeding 1,5 m and up to 3,0 m","m³",{"$nulls":5},{"$f":"IF(ISNUMBER(H14),L14*H14,IF(ISNUMBER(J14),J14,IF(J14=\"RATE ONLY\",LOWER(\"RATE ONLY\"),\" \")))","v":" "}]
["Item",null,null,"(c)",null,"Etc, in increments of 1,5 m","m³",{"$nulls":5}," "]
["IHDR2",null,"C11.2.1.2",null,null,"Extra over sub-item C11.2.1.1 for excavation in hard material, irrespective of depth","m³",{"$nulls":4},{"v":260,"d":"260.00"},{"$f":"IF(ISNUMBER(H16),L16*H16,IF(ISNUMBER(J16),J16,IF(J16=\"RATE ONLY\",LOWER(\"RATE ONLY\"),\" \")))","v":" "}]
[]
["IHDR2",null,"C11.2.1.3",null,null,"Excavating soft material within 1,5 m below the surface level using labour enhanced construction methods","m³",{"$nulls":5},{"$f":"IF(ISNUMBER(H18),L18*H18,IF(ISNUMBER(J18),J18,IF(J18=\"RATE ONLY\",LOWER(\"RATE ONLY\"),\" \")))","v":" "}]
[]
["IHDR2",null,"C11.2.1.4",null,null,"Excavating intermediate material within 1,5 m below the surface level using labour enhanced construction methods","m³",{"$nulls":5},{"$f":"IF(ISNUMBER(H20),L20*H20,IF(ISNUMBER(J20),J20,IF(J20=\"RATE ONLY\",LOWER(\"RATE ONLY\"),\" \")))","v":" "}]
[]
["IHDR1","C11.2.2",{"$nulls":3},"Surface preparation for bedding the gabion boxes and mattresses","m²",{"$nulls":4},{"v":15.8,"d":"15.80"},{"$f":"IF(ISNUMBER(H22),L22*H22,IF(ISNUMBER(J22),J22,IF(J22=\"RATE ONLY\",LOWER(\"RATE ONLY\"),\" \")))","v":" "}]
[]
["IHDR1","C11.2.3",{"$nulls":3},"Gabion boxes and mattresses:",{"$nulls":6},{"$f":"IF(ISNUMBER(H24),L24*H24,IF(ISNUMBER(J24),J24,IF(J24=\"RATE ONLY\",LOWER(\"RATE ONLY\"),\" \")))","v":" "}]
[]
["IHDR2",null,"C11.2.3.1",null,null,"Galvanized gabion boxes:",{"$nulls":6},{"$f":"IF(ISNUMBER(H26),L26*H26,IF(ISNUMBER(J26),J26,IF(J26=\"RATE ONLY\",LOWER(\"RATE ONLY\"),\" \")))","v":" "}]
[]
["Item",null,null,"(a)",null,"0,5 m x 0,5 m x 1,0 m with 80 mm x 100 mm mesh and 2,7 mm dia mesh wire","m³",{"$nulls":4},{"v":1150,"d":"1,150.00"},{"$f":"IF(ISNUMBER(H28),L28*H28,IF(ISNUMBER(J28),J28,IF(J28=\"RATE ONLY\",LOWER(\"RATE ONLY\"),\" \")))","v":" "}]
[]
["Item",null,null,"(b)",null,"1,0 m x 0,3 m x 1,0 m with 80 mm x 100 mm mesh and 2,7 mm dia mesh wire","m³",{"$nulls":4},{"v":1150,"d":"1,150.00"},{"$f":"IF(ISNUMBER(H30),L30*H30,IF(ISNUMBER(J30),J30,IF(J30=\"RATE ONLY\",LOWER(\"RATE ONLY\"),\" \")))","v":" "}]
[]
["Item",null,null,"(c)",null,"1,0 m x 1,0 m x 1,0 m with 80 mm x 100 mm mesh and 2,7 mm dia mesh wire","m³",{"$nulls":4},{"v":1150,"d":"1,150.00"},{"$f":"IF(ISNUMBER(H32),L32*H32,IF(ISNUMBER(J32),J32,IF(J32=\"RATE ONLY\",LOWER(\"RATE ONLY\"),\" \")))","v":" "}]
[]
["IHDR2",null,"C11.2.3.2",null,null,"PVC coated gabion boxes (dimensions of box)","m³",{"$nulls":5},{"$f":"IF(ISNUMBER(H34),L34*H34,IF(ISNUMBER(J34),J34,IF(J34=\"RATE ONLY\",LOWER(\"RATE ONLY\"),\" \")))","v":" "}]
[]
["IHDR2",null,"C11.2.3.3",null,null,"Galvanized gabion mattresses:",{"$nulls":6},{"$f":"IF(ISNUMBER(H36),L36*H36,IF(ISNUMBER(J36),J36,IF(J36=\"RATE ONLY\",LOWER(\"RATE ONLY\"),\" \")))","v":" "}]
[]
["Item",null,null,"(a)",null,"0,3 m deep with 80 mm x 100 mm mesh and diaphragms at 1,0 m centres and 2,7 mm dia mesh wire","m³",{"$nulls":4},{"v":1415,"d":"1,415.00"},{"$f":"IF(ISNUMBER(H38),L38*H38,IF(ISNUMBER(J38),J38,IF(J38=\"RATE ONLY\",LOWER(\"RATE ONLY\"),\" \")))","v":" "}]
[]
["Item",null,null,"(b)",null,"0,5 m deep with 80 mm x 100 mm mesh and diaphragms at 1,0 m centres and 2,7 mm dia mesh wire","m³",{"$nulls":4},{"v":1415,"d":"1,415.00"},{"$f":"IF(ISNUMBER(H40),L40*H40,IF(ISNUMBER(J40),J40,IF(J40=\"RATE ONLY\",LOWER(\"RATE ONLY\"),\" \")))","v":" "}]
[]
["IHDR2",null,"C11.2.3.4",null,null,"PVC-coated gabion mattresses (dimensions of mattress)","m³",{"$nulls":5},{"$f":"IF(ISNUMBER(H42),L42*H42,IF(ISNUMBER(J42),J42,IF(J42=\"RATE ONLY\",LOWER(\"RATE ONLY\"),\" \")))","v":" "}]
[]
["IHDR1","C11.2.4",{"$nulls":3},"Geotextile (Synthetic-fibre filter fabric,   Grade 3)","m²",{"$nulls":4},{"v":18.5,"d":"18.50"},{"$f":"IF(ISNUMBER(H44),L44*H44,IF(ISNUMBER(J44),J44,IF(J44=\"RATE ONLY\",LOWER(\"RATE ONLY\"),\" \")))","v":" "}]
[]
["IHDR","C11.2/ C1.7",{"$nulls":3},"LOADING AND HAULING",{"$nulls":6},{"$f":"IF(ISNUMBER(H46),L46*H46,IF(ISNUMBER(J46),J46,IF(J46=\"RATE ONLY\",LOWER(\"RATE ONLY\"),\" \")))","v":" "}]
[]
["IHDR1",null,"C1.7.2",null,null,"Hauling",{"$nulls":6},{"$f":"IF(ISNUMBER(H48),L48*H48,IF(ISNUMBER(J48),J48,IF(J48=\"RATE ONLY\",LOWER(\"RATE ONLY\"),\" \")))","v":" "}]
[]
["IHDR2",null,"C1.7.2.2",null,null,"Hauling material to spoil and off-loading it at a designated spoil or stockpile area:",{"$nulls":6},{"$f":"IF(ISNUMBER(H50),L50*H50,IF(ISNUMBER(J50),J50,IF(J50=\"RATE ONLY\",LOWER(\"RATE ONLY\"),\" \")))","v":" "}]
[]
["Item",null,null,"(b)",null,"Soil and gravel material","m³-km",{"$nulls":4},{"v":4.5,"d":"4.50"},{"$f":"IF(ISNUMBER(H52),L52*H52,IF(ISNUMBER(J52),J52,IF(J52=\"RATE ONLY\",LOWER(\"RATE ONLY\"),\" \")))","v":" "}]
[]
[]
[]
["#BillEnd#"]
["#BillEnd#","TOTAL CARRIED FORWARD TO SUMMARY",{"$nulls":10},{"$f":"SUBTOTAL(9,M$7:M53)","v":0}]
["#BillEnd#"]

{"sheet":"11.3","index":44,"n_rows":13,"n_cols":13,"rows_kept":13,"hidden":true}
["#BillSheet#"]
["#BillSheet#","C11.3","GUIDE BLOCKS AND KILOMETRE MARKERS",{"$nulls":3},"\n",null,null,"SCHEDULE A",{"$f":"SUBTOTAL(9,M$7:M980)","v":0},null,{"$f":"J2","v":"SCHEDULE A"}]
["#BillSheet#"]
["ColHDR"]
["ColHDR","ITEM",{"$nulls":3},"DESCRIPTION","UNIT","QTY","RATE","AMT",null,"RATE","AMOUNT"]
["ColHDR"]
[{"$nulls":5},"GUIDE BLOCKS AND KILOMETRE MARKERS"]
["IHDR1","C11.3.1",{"$nulls":3},"Guide blocks","No.",{"$nulls":5},{"$f":"IF(ISNUMBER(H8),L8*H8,IF(ISNUMBER(J8),J8,IF(J8=\"RATE ONLY\",LOWER(\"RATE ONLY\"),\" \")))","v":" "}]
["IHDR1","C11.3.2",{"$nulls":3},"Kilometre markers","No.",{"$nulls":4},{"v":425,"d":"425.00"},{"$f":"IF(ISNUMBER(H9),L9*H9,IF(ISNUMBER(J9),J9,IF(J9=\"RATE ONLY\",LOWER(\"RATE ONLY\"),\" \")))","v":" "}]
["IHDR1","C11.3.3",{"$nulls":3},"Kilometre markers mounted on concrete reinforced pipes (diameter to be specified)","No.",{"$nulls":5},{"$f":"IF(ISNUMBER(H10),L10*H10,IF(ISNUMBER(J10),J10,IF(J10=\"RATE ONLY\",LOWER(\"RATE ONLY\"),\" \")))","v":" "}]
["#BillEnd#"]
["#BillEnd#","TOTAL CARRIED FORWARD TO SUMMARY",{"$nulls":10},{"$f":"SUBTOTAL(9,M$9:M10)","v":0}]
["#BillEnd#"]

{"sheet":"11.4","index":45,"n_rows":169,"n_cols":13,"rows_kept":169,"hidden":true}
["#BillSheet#"]
["#BillSheet#","C11.4","ROAD RESTRAINT SYSTEMS",{"$nulls":3},"\n",null,null,"SCHEDULE A",{"$f":"SUBTOTAL(9,M$7:M1132)","v":0},null,{"$f":"J2","v":"SCHEDULE A"}]
["#BillSheet#"]
["ColHDR"]
["ColHDR","ITEM",{"$nulls":3},"DESCRIPTION","UNIT","QTY","RATE","AMT",null,"RATE","AMOUNT"]
["ColHDR"]
[{"$nulls":5},"ROAD RESTRAINT SYSTEMS"]
["IHDR1","C11.4.1",{"$nulls":3},"Erecting of guardrails at 3,81 m spacing:",{"$nulls":6},{"$f":"IF(ISNUMBER(H8),L8*H8,IF(ISNUMBER(J8),J8,IF(J8=\"RATE ONLY\",LOWER(\"RATE ONLY\"),\" \")))","v":" "}]
[]
["IHDR2",null,"C11.4.1.1",null,null,"Complete galvanized system compliant to SANS 1350:",{"$nulls":6},{"$f":"IF(ISNUMBER(H10),L10*H10,IF(ISNUMBER(J10),J10,IF(J10=\"RATE ONLY\",LOWER(\"RATE ONLY\"),\" \")))","v":" "}]
[]
["Item",null,null,"(a)",null,"On timber posts (see DWG no 113142-0-DRG-RR-04-0009)","m",{"$nulls":4},{"v":415,"d":"415.00"},{"$f":"IF(ISNUMBER(H12),L12*H12,IF(ISNUMBER(J12),J12,IF(J12=\"RATE ONLY\",LOWER(\"RATE ONLY\"),\" \")))","v":" "}]
[]
["Item",null,null,"(b)",null,"On steel posts used at specific locations (see DWG no 113142-0-DRG-RR-04-0010) ","m",{"$nulls":4},{"v":490,"d":"490.00"},{"$f":"IF(ISNUMBER(H14),L14*H14,IF(ISNUMBER(J14),J14,IF(J14=\"RATE ONLY\",LOWER(\"RATE ONLY\"),\" \")))","v":" "}]
[]
["Item",null,null,"(c)",null,"On concrete or other surfaces, with spacer blocks but without posts (Drawing reference)","m",{"$nulls":5},{"$f":"IF(ISNUMBER(H16),L16*H16,IF(ISNUMBER(J16),J16,IF(J16=\"RATE ONLY\",LOWER(\"RATE ONLY\"),\" \")))","v":" "}]
["Item",null,null,"(d)",null,"Extra over C11.4.1.1(a) and C11.4.1.1(b) for excavating holes of posts using labour enhanced methods (soft and intermediate)","m",{"$nulls":5}," "]
["IHDR2",null,"C11.4.1.2",null,null,"Terminal sections for 3,81 m guardrails comprising of:",{"$nulls":6},{"$f":"IF(ISNUMBER(H18),L18*H18,IF(ISNUMBER(J18),J18,IF(J18=\"RATE ONLY\",LOWER(\"RATE ONLY\"),\" \")))","v":" "}]
[]
["Item",null,null,"(a)",null,"End wings to SANS 1350","No.",{"$nulls":4},{"v":600,"d":"600.00"},{"$f":"IF(ISNUMBER(H20),L20*H20,IF(ISNUMBER(J20),J20,IF(J20=\"RATE ONLY\",LOWER(\"RATE ONLY\"),\" \")))","v":" "}]
[]
["Item",null,null,"(b)",null,"Bullnoses to SANS 1350","No.",{"$nulls":5}," "]
["Item",null,null,"(c)",null,"Bridge adapters to SANS 1350","No.",{"$nulls":4},{"v":650,"d":"650.00"},{"$f":"IF(ISNUMBER(H23),L23*H23,IF(ISNUMBER(J23),J23,IF(J23=\"RATE ONLY\",LOWER(\"RATE ONLY\"),\" \")))","v":" "}]
[]
["IHDR3",null,null,"(d)",null,"End treatments where single guardrail sections are specified (see DWG no 113142-0-DRG-RR-04-0006/7) ",{"$nulls":6},{"$f":"IF(ISNUMBER(H25),L25*H25,IF(ISNUMBER(J25),J25,IF(J25=\"RATE ONLY\",LOWER(\"RATE ONLY\"),\" \")))","v":" "}]
[]
["Item",{"$nulls":3},"(i)","Type A: L = 15,24 m","No.",{"$nulls":4},{"v":3600,"d":"3,600.00"},{"$f":"IF(ISNUMBER(H27),L27*H27,IF(ISNUMBER(J27),J27,IF(J27=\"RATE ONLY\",LOWER(\"RATE ONLY\"),\" \")))","v":" "}]
[]
["Item",{"$nulls":3},"(ii)","Type C: L = 19,05 m","No.",{"$nulls":4},{"v":4500,"d":"4,500.00"},{"$f":"IF(ISNUMBER(H29),L29*H29,IF(ISNUMBER(J29),J29,IF(J29=\"RATE ONLY\",LOWER(\"RATE ONLY\"),\" \")))","v":" "}]
[]
["Item",{"$nulls":3},"(iii)","Type E: L = 7,62 m","No.",{"$nulls":4},{"v":2740,"d":"2,740.00"},{"$f":"IF(ISNUMBER(H31),L31*H31,IF(ISNUMBER(J31),J31,IF(J31=\"RATE ONLY\",LOWER(\"RATE ONLY\"),\" \")))","v":" "}]
[]
["IHDR3",null,null,"(e)",null,"End treatments where double guardrail sections are specified (see DWG no 113142-0-DRG-RR-04-0006/7) ",{"$nulls":6},{"$f":"IF(ISNUMBER(H33),L33*H33,IF(ISNUMBER(J33),J33,IF(J33=\"RATE ONLY\",LOWER(\"RATE ONLY\"),\" \")))","v":" "}]
[]
["Item",{"$nulls":3},"(i)","Type A: L = 19,05 m","No.",{"$nulls":4},{"v":11300,"d":"11,300.00"},{"$f":"IF(ISNUMBER(H35),L35*H35,IF(ISNUMBER(J35),J35,IF(J35=\"RATE ONLY\",LOWER(\"RATE ONLY\"),\" \")))","v":" "}]
[]
["Item",{"$nulls":3},"(ii)","Type B: L = 19,05 m","No.",{"$nulls":4},{"v":11300,"d":"11,300.00"},{"$f":"IF(ISNUMBER(H37),L37*H37,IF(ISNUMBER(J37),J37,IF(J37=\"RATE ONLY\",LOWER(\"RATE ONLY\"),\" \")))","v":" "}]
[]
["Item",{"$nulls":3},"(iii)","Type D: L = 11,678 m","No.",{"$nulls":4},{"v":6930,"d":"6,930.00"},{"$f":"IF(ISNUMBER(H39),L39*H39,IF(ISNUMBER(J39),J39,IF(J39=\"RATE ONLY\",LOWER(\"RATE ONLY\"),\" \")))","v":" "}]
[]
["Item",{"$nulls":3},"(iv)","Type F: L = 7,4 m","No.",{"$nulls":4},{"v":4400,"d":"4,400.00"},{"$f":"IF(ISNUMBER(H41),L41*H41,IF(ISNUMBER(J41),J41,IF(J41=\"RATE ONLY\",LOWER(\"RATE ONLY\"),\" \")))","v":" "}]
[]
["Item",null,null,"(f)",null,"Bridge adaptors (including extra rails and posts) (Drawing reference)","No.",{"$nulls":5},{"$f":"IF(ISNUMBER(H43),L43*H43,IF(ISNUMBER(J43),J43,IF(J43=\"RATE ONLY\",LOWER(\"RATE ONLY\"),\" \")))","v":" "}]
["Item",null,null,"(g)",null,"Extra over C11.4.1.2(d) and C11.4.1.2(e) for excavating holes for posts using labour enhanced methods (soft and intermediate)","No.",{"$nulls":5},{"$f":"IF(ISNUMBER(H44),L44*H44,IF(ISNUMBER(J44),J44,IF(J44=\"RATE ONLY\",LOWER(\"RATE ONLY\"),\" \")))","v":" "}]
["IHDR1","C11.4.2",{"$nulls":3},"Performance based vehicle restraint systems:",{"$nulls":6},{"$f":"IF(ISNUMBER(H45),L45*H45,IF(ISNUMBER(J45),J45,IF(J45=\"RATE ONLY\",LOWER(\"RATE ONLY\"),\" \")))","v":" "}]
[]
["IHDR2",null,"C11.4.2.1",null,null,"Complete longitudinal barrier system to EN 1317 or AASHTO MASH or NCHRP350 as alternative where no MASH product is available:",{"$nulls":6},{"$f":"IF(ISNUMBER(H47),L47*H47,IF(ISNUMBER(J47),J47,IF(J47=\"RATE ONLY\",LOWER(\"RATE ONLY\"),\" \")))","v":" "}]
[]
["Item",null,null,"(a)",null,"Guardrail system (state criteria including containment level & working width)","m",{"$nulls":5}," "]
["Item",null,null,"(b)",null,"Cable barrier system (state criteria including containment level & working width)","m",{"$nulls":5}," "]
["Item",null,null,"(c)",null,"Concrete barrier system (state criteria including containment level & working width)","m",{"$nulls":5}," "]
["Item",null,null,"(d)",null,"Etc for other types, permanent and temporary","m",{"$nulls":5}," "]
["IHDR2",null,"C11.4.2.2",null,null,"Terminal sections for the following to EN 1317 or AASHTO MASH or NCHRP350 as alternative where no MASH product is available:",{"$nulls":6},{"$f":"IF(ISNUMBER(H53),L53*H53,IF(ISNUMBER(J53),J53,IF(J53=\"RATE ONLY\",LOWER(\"RATE ONLY\"),\" \")))","v":" "}]
[]
["Item",null,null,"(a)",null,"End treatments (State criteria EN or MASH and containment level)","No.",{"$nulls":5}," "]
["Item",null,null,"(b)",null,"Crash cushions (State criteria EN or MASH and containment level)","No.",{"$nulls":5}," "]
["Item",null,null,"(c)",null,"Transitions (State criteria EN or MASH and containment level, etc.))","No.",{"$nulls":5}," "]
["Item",null,null,"(d)",null,"Other types (State criteria EN or MASH and containment level, etc.)","No.",{"$nulls":5}," "]
["IHDR2",null,"C11.4.2.3",null,null,"Relocation of temporary systems (Type, EN or MASH, or NCHRP350 as alternative where no MASH product is available, containment level and working width indicated)","m",{"$nulls":5},{"$f":"IF(ISNUMBER(H59),L59*H59,IF(ISNUMBER(J59),J59,IF(J59=\"RATE ONLY\",LOWER(\"RATE ONLY\"),\" \")))","v":" "}]
[]
["IHDR1","C11.4.3",{"$nulls":3},"Project specific concrete barrier systems:",{"$nulls":6},{"$f":"IF(ISNUMBER(H61),L61*H61,IF(ISNUMBER(J61),J61,IF(J61=\"RATE ONLY\",LOWER(\"RATE ONLY\"),\" \")))","v":" "}]
[]
["IHDR2",null,"C11.4.3.1",null,null,"In situ cast concrete",{"$nulls":6},{"$f":"IF(ISNUMBER(H63),L63*H63,IF(ISNUMBER(J63),J63,IF(J63=\"RATE ONLY\",LOWER(\"RATE ONLY\"),\" \")))","v":" "}]
[]
["Item",null,null,"(a)",null,"Endblock (see DWG no 113142-0-DRG-RR-04-0012)","m",{"$nulls":5}," "]
["Item",null,null,"(b)",null,"Barrier (see DWG no 113142-0-DRG-RR-04- 0013)","m",{"$nulls":5}," "]
["IHDR2",null,"C11.4.3.2",null,null,"Precast concrete barriers ",{"$nulls":6},{"$f":"IF(ISNUMBER(H67),L67*H67,IF(ISNUMBER(J67),J67,IF(J67=\"RATE ONLY\",LOWER(\"RATE ONLY\"),\" \")))","v":" "}]
[]
["IHDR2",null,"C11.4.3.3",null,null,"Installation and removal of precast concrete barrier system","No.",{"$nulls":5},{"$f":"IF(ISNUMBER(H69),L69*H69,IF(ISNUMBER(J69),J69,IF(J69=\"RATE ONLY\",LOWER(\"RATE ONLY\"),\" \")))","v":" "}]
[]
["IHDR2",null,"C11.4.3.4",null,null,"Relocating or stacking precast barrier moved in excess of 1,0 km","No.",{"$nulls":5},{"$f":"IF(ISNUMBER(H71),L71*H71,IF(ISNUMBER(J71),J71,IF(J71=\"RATE ONLY\",LOWER(\"RATE ONLY\"),\" \")))","v":" "}]
[]
["IHDR1","C11.4.4",{"$nulls":3},"Extra over for horizontally curved guard rails",{"$nulls":6},{"$f":"IF(ISNUMBER(H73),L73*H73,IF(ISNUMBER(J73),J73,IF(J73=\"RATE ONLY\",LOWER(\"RATE ONLY\"),\" \")))","v":" "}]
[]
["Item",null,"C11.4.4.1",null,null,"Extra over C11.4.1.1 and C11.4.1.2 for horizontally curved guardrails factory bent to a radius of less than 45 m","m",{"$nulls":4},{"v":65,"d":"65.00"},{"$f":"IF(ISNUMBER(H75),L75*H75,IF(ISNUMBER(J75),J75,IF(J75=\"RATE ONLY\",LOWER(\"RATE ONLY\"),\" \")))","v":" "}]
[]
["Item",null,"C11.4.4.2",null,null,"Extra over C11.4.2.1(a) for horizontally curved guard rails factory bent to a radius of less than 45 m","m",{"$nulls":5}," "]
["IHDR1","C11.4.5",{"$nulls":3},"Additional guardrail posts for 3,81 m systems:",{"$nulls":6},{"$f":"IF(ISNUMBER(H78),L78*H78,IF(ISNUMBER(J78),J78,IF(J78=\"RATE ONLY\",LOWER(\"RATE ONLY\"),\" \")))","v":" "}]
[]
["Item",null,"C11.4.5.1",null,null,"Timber","No.",{"$nulls":5},{"$f":"IF(ISNUMBER(H80),L80*H80,IF(ISNUMBER(J80),J80,IF(J80=\"RATE ONLY\",LOWER(\"RATE ONLY\"),\" \")))","v":" "}]
["Item",null,"C11.4.5.2",null,null,"Steel (drawing reference)","No.",{"$nulls":5}," "]
["Item",null,"C11.4.5.3",null,null,"Extra over C11.4.5.1 and C11.4.5.2 for excavating holes of posts using labour enhanced methods","No.",{"$nulls":5}," "]
["IHDR1","C11.4.6",{"$nulls":3},"Reflective plates:",{"$nulls":6},{"$f":"IF(ISNUMBER(H83),L83*H83,IF(ISNUMBER(J83),J83,IF(J83=\"RATE ONLY\",LOWER(\"RATE ONLY\"),\" \")))","v":" "}]
[]
["Item",null,"C11.4.6.1",null,null,"Steel plates","No.",{"$nulls":4},{"v":32,"d":"32.00"},{"$f":"IF(ISNUMBER(H85),L85*H85,IF(ISNUMBER(J85),J85,IF(J85=\"RATE ONLY\",LOWER(\"RATE ONLY\"),\" \")))","v":" "}]
[]
["Item",null,"C11.4.6.2",null,null,"Plastic plates","No.",{"$nulls":5}," "]
["IHDR1","C11.4.7",{"$nulls":3},"Removing existing guardrails","m",{"$nulls":4},{"v":61.5,"d":"61.50"},{"$f":"IF(ISNUMBER(H88),L88*H88,IF(ISNUMBER(J88),J88,IF(J88=\"RATE ONLY\",LOWER(\"RATE ONLY\"),\" \")))","v":" "}]
[]
["IHDR1","C11.4.8",{"$nulls":3},"Renovating guardrail material:",{"$nulls":6},{"$f":"IF(ISNUMBER(H90),L90*H90,IF(ISNUMBER(J90),J90,IF(J90=\"RATE ONLY\",LOWER(\"RATE ONLY\"),\" \")))","v":" "}]
[]
["Item",null,"C11.4.8.1",null,null,"Painting guardrails, end wings and bullnoses","m",{"$nulls":5}," "]
["IHDR1","C11.4.9",{"$nulls":3},"Re-erection of guardrails with recovered or provided material:",{"$nulls":6},{"$f":"IF(ISNUMBER(H93),L93*H93,IF(ISNUMBER(J93),J93,IF(J93=\"RATE ONLY\",LOWER(\"RATE ONLY\"),\" \")))","v":" "}]
[]
["Item",null,"C11.4.9.1",null,null,"Single guardrail","m",{"$nulls":5}," "]
["Item",null,"C11.4.9.2",null,null,"Double guardrail","m",{"$nulls":5}," "]
["Item",null,"C11.4.9.3",null,null,"Extra over C11.4.9.1 and C11.4.9.2 for excavating holes of posts using labour enhanced methods","m",{"$nulls":5}," "]
["IHDR1","C11.4.10",{"$nulls":3},"End treatments to existing guardrails with recovered or provided material:",{"$nulls":6},{"$f":"IF(ISNUMBER(H98),L98*H98,IF(ISNUMBER(J98),J98,IF(J98=\"RATE ONLY\",LOWER(\"RATE ONLY\"),\" \")))","v":" "}]
[]
["Item",null,"C11.4.10.1",null,null,"End wings","No.",{"$nulls":5}," "]
["Item",null,"C11.4.10.2",null,null,"Bullnoses","No.",{"$nulls":5}," "]
["Item",null,"C11.4.10.3",null,null,"Bridge adaptors","No.",{"$nulls":5}," "]
["Item",null,"C11.4.10.4",null,null,"End treatments with single guardrails","No.",{"$nulls":5}," "]
["Item",null,"C11.4.10.5",null,null,"End treatments with double guardrails","No.",{"$nulls":5}," "]
["Item",null,"C11.4.10.6",null,null,"Extra over C11.4.10.4 and C11.4.10.5 for excavating holes of posts using labour enhanced methods (soft and intermediate)","No.",{"$nulls":5}," "]
["IHDR1","C11.4.11",{"$nulls":3},"New material required for the re-erection guardrails with recovered materials:",{"$nulls":6},{"$f":"IF(ISNUMBER(H106),L106*H106,IF(ISNUMBER(J106),J106,IF(J106=\"RATE ONLY\",LOWER(\"RATE ONLY\"),\" \")))","v":" "}]
[]
["Item",null,"C11.4.11.1",null,null,"Guardrails, 3,81 m compliant to SANS 1350","No.",{"$nulls":5}," "]
["Item",null,"C11.4.11.2",null,null,"Timber posts compliant to SANS 457","No.",{"$nulls":5}," "]
["Item",null,"C11.4.11.3",null,null,"Steel posts","No.",{"$nulls":5}," "]
["Item",null,"C11.4.11.4",null,null,"Reflective plates","No.",{"$nulls":5}," "]
["Item",null,"C11.4.11.5",null,null,"Spacer blocks compliant to SANS 457","No.",{"$nulls":5}," "]
["Item",null,"C11.4.11.6",null,null,"Splice bolt complete with nut and washer compliant to SANS 1350","No.",{"$nulls":5}," "]
["Item",null,"C11.4.11.7",null,null,"Post bolt complete with nut and washer compliant to SANS 1350","No.",{"$nulls":5}," "]
["PB"]
["PB","CARRIED FORWARD",{"$nulls":10},{"$f":"SUBTOTAL(9,M$7:M114)","v":0}]
["PB"]
["PB"]
["PB","BROUGHT FORWARD",{"$nulls":10},{"$f":"SUBTOTAL(9,M$7:M117)","v":0}]
["PB"]
["Item",null,"C11.4.11.8",null,null,"Reinforcing plates (reference to drawing)","No.",{"$nulls":5}," "]
["IHDR1","C11.4.12",{"$nulls":3},"Extra over items C11.4.1 and C11.4.2 for drilling and blasting holes for guardrail posts","No.",{"$nulls":4},{"v":370,"d":"370.00"},{"$f":"IF(ISNUMBER(H122),L122*H122,IF(ISNUMBER(J122),J122,IF(J122=\"RATE ONLY\",LOWER(\"RATE ONLY\"),\" \")))","v":" "}]
[]
["IHDR1","C11.4.13",{"$nulls":3},"Steel base plates for guardrail posts on structures","No.",{"$nulls":4},{"v":450,"d":"450.00"},{"$f":"IF(ISNUMBER(H124),L124*H124,IF(ISNUMBER(J124),J124,IF(J124=\"RATE ONLY\",LOWER(\"RATE ONLY\"),\" \")))","v":" "}]
[]
["IHDR1","C11.4.14",{"$nulls":3},"Nailing of gang nail plates on top of timber guardrail posts","No.",{"$nulls":4},{"v":15,"d":"15.00"},{"$f":"IF(ISNUMBER(H126),L126*H126,IF(ISNUMBER(J126),J126,IF(J126=\"RATE ONLY\",LOWER(\"RATE ONLY\"),\" \")))","v":" "}]
[]
["IHDR1","C11.4.15",{"$nulls":3},"Disposal of existing guardrails:",{"$nulls":6},{"$f":"IF(ISNUMBER(H128),L128*H128,IF(ISNUMBER(J128),J128,IF(J128=\"RATE ONLY\",LOWER(\"RATE ONLY\"),\" \")))","v":" "}]
[]
["Item",null,"C11.4.15.1",null,null,"Straight or curved longitudinal guardrails","m",{"$nulls":4},{"v":30,"d":"30.00"},{"$f":"IF(ISNUMBER(H130),L130*H130,IF(ISNUMBER(J130),J130,IF(J130=\"RATE ONLY\",LOWER(\"RATE ONLY\"),\" \")))","v":" "}]
[]
["Item",null,"C11.4.15.2",null,null,"End treatments with single guardrails","m",{"$nulls":4},{"v":35,"d":"35.00"},{"$f":"IF(ISNUMBER(H132),L132*H132,IF(ISNUMBER(J132),J132,IF(J132=\"RATE ONLY\",LOWER(\"RATE ONLY\"),\" \")))","v":" "}]
[]
["Item",null,"C11.4.15.3",null,null,"End treatments with double guardrails","m",{"$nulls":4},{"v":45,"d":"45.00"},{"$f":"IF(ISNUMBER(H134),L134*H134,IF(ISNUMBER(J134),J134,IF(J134=\"RATE ONLY\",LOWER(\"RATE ONLY\"),\" \")))","v":" "}]
{"$rows_empty":32}
["#BillEnd#"]
["#BillEnd#","TOTAL CARRIED FORWARD TO SUMMARY",{"$nulls":10},{"$f":"SUBTOTAL(9,M$7:M135)","v":0}]
["#BillEnd#"]

{"sheet":"11.5","index":46,"n_rows":190,"n_cols":13,"rows_kept":190,"hidden":true}
["#BillSheet#"]
["#BillSheet#","C11.5","FENCING",{"$nulls":3},"\n",null,null,"SCHEDULE A",{"$f":"SUBTOTAL(9,M$7:M1163)","v":{"v":6373160,"d":"6,373,160.00"}},null,{"$f":"J2","v":"SCHEDULE A"}]
["#BillSheet#"]
["ColHDR"]
["ColHDR","ITEM",{"$nulls":3},"DESCRIPTION","UNIT","QTY","RATE","AMT",null,"RATE","AMOUNT"]
["ColHDR"]
[{"$nulls":5},"FENCING"]
["IHDR1","C11.5.1",{"$nulls":3},"Supply and erect new fencing material for new fences and for supplementing material in existing fences which are being repaired or removed:",{"$nulls":6},{"$f":"IF(ISNUMBER(H8),L8*H8,IF(ISNUMBER(J8),J8,IF(J8=\"RATE ONLY\",LOWER(\"RATE ONLY\"),\" \")))","v":" "}]
[]
["IHDR2",null,"C11.5.1.1",null,null,"Zinc-coated barbed wire, high-tensile-grade single-strand 3,2 mm x 2,5 mm oval-shaped wire fully galvanized","km",730,{"$nulls":3},{"v":3300,"d":"3,300.00"},{"$f":"IF(ISNUMBER(H10),L10*H10,IF(ISNUMBER(J10),J10,IF(J10=\"RATE ONLY\",LOWER(\"RATE ONLY\"),\" \")))","v":{"v":2409000,"d":"2,409,000.00"}}]
[]
["IHDR2",null,"C11.5.1.2",null,null,"Zinc-coated smooth fencing wire, high-tensile-grade 3,0 mm dia, fully galvanized","km",10,{"$nulls":3},{"v":2700,"d":"2,700.00"},{"$f":"IF(ISNUMBER(H12),L12*H12,IF(ISNUMBER(J12),J12,IF(J12=\"RATE ONLY\",LOWER(\"RATE ONLY\"),\" \")))","v":{"v":27000,"d":"27,000.00"}}]
[]
["IHDR2",null,"C11.5.1.3",null,null,"Diamond mesh","m²",{"$nulls":5},{"$f":"IF(ISNUMBER(H14),L14*H14,IF(ISNUMBER(J14),J14,IF(J14=\"RATE ONLY\",LOWER(\"RATE ONLY\"),\" \")))","v":" "}]
[]
["IHDR2",null,"C11.5.1.4",null,null,"Wire netting","m²",3600,{"$nulls":3},{"v":45,"d":"45.00"},{"$f":"IF(ISNUMBER(H16),L16*H16,IF(ISNUMBER(J16),J16,IF(J16=\"RATE ONLY\",LOWER(\"RATE ONLY\"),\" \")))","v":{"v":162000,"d":"162,000.00"}}]
[]
["IHDR2",null,"C11.5.1.5",null,null,"Barbed-tape security barrier","km",{"$nulls":5},{"$f":"IF(ISNUMBER(H18),L18*H18,IF(ISNUMBER(J18),J18,IF(J18=\"RATE ONLY\",LOWER(\"RATE ONLY\"),\" \")))","v":" "}]
[]
["IHDR2",null,"C11.5.1.6",null,null,"Hinge joint mesh square","m²",{"$nulls":5},{"$f":"IF(ISNUMBER(H20),L20*H20,IF(ISNUMBER(J20),J20,IF(J20=\"RATE ONLY\",LOWER(\"RATE ONLY\"),\" \")))","v":" "}]
[]
["IHDR2",null,"C11.5.1.7",null,null,"Standards, 2,5kg/m Y-sections:",{"$nulls":6},{"$f":"IF(ISNUMBER(H22),L22*H22,IF(ISNUMBER(J22),J22,IF(J22=\"RATE ONLY\",LOWER(\"RATE ONLY\"),\" \")))","v":" "}]
[]
["Item",null,null,"(a)",null,"1,85 m long","No.",5100,{"$nulls":3},{"v":85,"d":"85.00"},{"$f":"IF(ISNUMBER(H24),L24*H24,IF(ISNUMBER(J24),J24,IF(J24=\"RATE ONLY\",LOWER(\"RATE ONLY\"),\" \")))","v":{"v":433500,"d":"433,500.00"}}]
[]
["Item",null,null,"(b)",null,"3,0 m long","No.",300,{"$nulls":3},{"v":140,"d":"140.00"},{"$f":"IF(ISNUMBER(H26),L26*H26,IF(ISNUMBER(J26),J26,IF(J26=\"RATE ONLY\",LOWER(\"RATE ONLY\"),\" \")))","v":{"v":42000,"d":"42,000.00"}}]
[]
["IHDR2",null,"C11.5.1.8",null,null,"Droppers, 0,56 kg/m ridgeback pattern:",{"$nulls":6},{"$f":"IF(ISNUMBER(H28),L28*H28,IF(ISNUMBER(J28),J28,IF(J28=\"RATE ONLY\",LOWER(\"RATE ONLY\"),\" \")))","v":" "}]
[]
["Item",null,null,"(a)",null,"1,20 m long","No.",23000,{"$nulls":3},{"v":18.5,"d":"18.50"},{"$f":"IF(ISNUMBER(H30),L30*H30,IF(ISNUMBER(J30),J30,IF(J30=\"RATE ONLY\",LOWER(\"RATE ONLY\"),\" \")))","v":{"v":425500,"d":"425,500.00"}}]
[]
["Item",null,null,"(b)",null,"2,25 m long","No.",1120,{"$nulls":3},{"v":31.5,"d":"31.50"},{"$f":"IF(ISNUMBER(H32),L32*H32,IF(ISNUMBER(J32),J32,IF(J32=\"RATE ONLY\",LOWER(\"RATE ONLY\"),\" \")))","v":{"v":35280,"d":"35,280.00"}}]
[]
["IHDR2",null,"C11.5.1.9",null,null,"Straining posts, stays and anchors:",{"$nulls":6},{"$f":"IF(ISNUMBER(H34),L34*H34,IF(ISNUMBER(J34),J34,IF(J34=\"RATE ONLY\",LOWER(\"RATE ONLY\"),\" \")))","v":" "}]
[]
["IHDR3",null,null,"(a)",null,"Vertical:",{"$nulls":6},{"$f":"IF(ISNUMBER(H36),L36*H36,IF(ISNUMBER(J36),J36,IF(J36=\"RATE ONLY\",LOWER(\"RATE ONLY\"),\" \")))","v":" "}]
[]
["Item1",{"$nulls":3},"(i)","Steel straining posts and corner posts, 100 mm outside dia fully galvanized tubular mild steel posts with caps and 3,0 mm thick walls:",null,".",{"$nulls":4},{"$f":"IF(ISNUMBER(H38),L38*H38,IF(ISNUMBER(J38),J38,IF(J38=\"RATE ONLY\",LOWER(\"RATE ONLY\"),\" \")))","v":" "}]
[]
["item1",{"$nulls":4},"(1)  2,13 m long excluding cap","No.",870,{"$nulls":3},{"v":880,"d":"880.00"},{"$f":"IF(ISNUMBER(H40),L40*H40,IF(ISNUMBER(J40),J40,IF(J40=\"RATE ONLY\",LOWER(\"RATE ONLY\"),\" \")))","v":{"v":765600,"d":"765,600.00"}}]
[]
["item1",{"$nulls":4},"(2)  3,0 m long excluding cap","No.",60,{"$nulls":3},{"v":990,"d":"990.00"},{"$f":"IF(ISNUMBER(H42),L42*H42,IF(ISNUMBER(J42),J42,IF(J42=\"RATE ONLY\",LOWER(\"RATE ONLY\"),\" \")))","v":{"v":59400,"d":"59,400.00"}}]
[]
["Item1",{"$nulls":3},"(ii)","Timber straining posts (protection, length and diameter indicated)","No.",{"$nulls":5},{"$f":"IF(ISNUMBER(H44),L44*H44,IF(ISNUMBER(J44),J44,IF(J44=\"RATE ONLY\",LOWER(\"RATE ONLY\"),\" \")))","v":" "}]
["IHDR3",null,null,"(b)",null,"Inclined:",{"$nulls":6},{"$f":"IF(ISNUMBER(H45),L45*H45,IF(ISNUMBER(J45),J45,IF(J45=\"RATE ONLY\",LOWER(\"RATE ONLY\"),\" \")))","v":" "}]
[]
["Item1",{"$nulls":3},"(i)","Steel stays and anchors, 60 mm outside dia fully galvanized tubular mild steel posts and 3,0 mm thick walls:",null,".",{"$nulls":4},{"$f":"IF(ISNUMBER(H47),L47*H47,IF(ISNUMBER(J47),J47,IF(J47=\"RATE ONLY\",LOWER(\"RATE ONLY\"),\" \")))","v":" "}]
[]
["item1",{"$nulls":4},"(1)  2,13 m long, bent and flattended","No.",1250,{"$nulls":3},{"v":720,"d":"720.00"},{"$f":"IF(ISNUMBER(H49),L49*H49,IF(ISNUMBER(J49),J49,IF(J49=\"RATE ONLY\",LOWER(\"RATE ONLY\"),\" \")))","v":{"v":900000,"d":"900,000.00"}}]
[]
["item1",{"$nulls":4},"(2)  3,35 m long, bent and flattended","No.",100,{"$nulls":3},{"v":860,"d":"860.00"},{"$f":"IF(ISNUMBER(H51),L51*H51,IF(ISNUMBER(J51),J51,IF(J51=\"RATE ONLY\",LOWER(\"RATE ONLY\"),\" \")))","v":{"v":86000,"d":"86,000.00"}}]
[]
["Item1",{"$nulls":3},"(ii)","Timber stays and anchors (protection, length and diameter indicated)","No.",{"$nulls":5}," "]
["Item1",{"$nulls":3},"(iii)","Wire stays and anchors, 4,0 mm dia, 4 strands","No.",81,{"$nulls":3},{"v":85,"d":"85.00"},{"$f":"IF(ISNUMBER(H54),L54*H54,IF(ISNUMBER(J54),J54,IF(J54=\"RATE ONLY\",LOWER(\"RATE ONLY\"),\" \")))","v":{"v":6885,"d":"6,885.00"}}]
[]
["IHDR3",null,null,"(c)",null,"Horizontal:",{"$nulls":6},{"$f":"IF(ISNUMBER(H56),L56*H56,IF(ISNUMBER(J56),J56,IF(J56=\"RATE ONLY\",LOWER(\"RATE ONLY\"),\" \")))","v":" "}]
["PB"]
["PB","CARRIED FORWARD",{"$nulls":10},{"$f":"SUBTOTAL(9,M$7:M56)","v":{"v":5352165,"d":"5,352,165.00"}}]
["PB"]
["PB"]
["PB","BROUGHT FORWARD",{"$nulls":10},{"$f":"SUBTOTAL(9,M$7:M59)","v":{"v":5352165,"d":"5,352,165.00"}}]
["PB"]
[]
["Item1",{"$nulls":3},"(i)","Steel stays and anchors, 60 mm outside dia fully galvanized tubular mild steel posts and 3,0 mm thick walls, 2,4 m long bent and flattended as shown","No.",50,{"$nulls":3},{"v":755,"d":"755.00"},{"$f":"IF(ISNUMBER(H64),L64*H64,IF(ISNUMBER(J64),J64,IF(J64=\"RATE ONLY\",LOWER(\"RATE ONLY\"),\" \")))","v":{"v":37750,"d":"37,750.00"}}]
[]
["Item1",{"$nulls":3},"(ii)","Timber stays and anchors (protection, length and diameter indicated)","No.",{"$nulls":5}," "]
["Item1",{"$nulls":3},"(iii)","Wire stays and anchors (diameter and type indicated)","No.",{"$nulls":5}," "]
["IHDR2",null,"C11.5.1.10",null,null,"Extra over items C11.5.1.3; C11.5.1.4 and C11.5.1.6 for stone packing","m",{"$nulls":5},{"$f":"IF(ISNUMBER(H68),L68*H68,IF(ISNUMBER(J68),J68,IF(J68=\"RATE ONLY\",LOWER(\"RATE ONLY\"),\" \")))","v":" "}]
[]
["IHDR2",null,"C11.5.1.11",null,null,"Extra over items C11.5.1.3; C11.5.1.4 and C11.5.1.6 for trenching","m",{"$nulls":5},{"$f":"IF(ISNUMBER(H70),L70*H70,IF(ISNUMBER(J70),J70,IF(J70=\"RATE ONLY\",LOWER(\"RATE ONLY\"),\" \")))","v":" "}]
[]
["IHDR1","C11.5.2",{"$nulls":3},"New gates:",{"$nulls":6},{"$f":"IF(ISNUMBER(H72),L72*H72,IF(ISNUMBER(J72),J72,IF(J72=\"RATE ONLY\",LOWER(\"RATE ONLY\"),\" \")))","v":" "}]
[]
["IHDR2",null,"C11.5.2.1",null,null,"Single leaf:",{"$nulls":6},{"$f":"IF(ISNUMBER(H74),L74*H74,IF(ISNUMBER(J74),J74,IF(J74=\"RATE ONLY\",LOWER(\"RATE ONLY\"),\" \")))","v":" "}]
[]
["Item",null,null,"(a)",null,"4,2 m x 1,4 m with 42.9 mm dia fully galvanized steel tubing and 2,6 mm thick walls","No.",30,{"$nulls":3},{"v":2980,"d":"2,980.00"},{"$f":"IF(ISNUMBER(H76),L76*H76,IF(ISNUMBER(J76),J76,IF(J76=\"RATE ONLY\",LOWER(\"RATE ONLY\"),\" \")))","v":{"v":89400,"d":"89,400.00"}}]
[]
["IHDR2",null,"C11.5.2.2",null,null,"Double leaf - game proof:",{"$nulls":6},{"$f":"IF(ISNUMBER(H78),L78*H78,IF(ISNUMBER(J78),J78,IF(J78=\"RATE ONLY\",LOWER(\"RATE ONLY\"),\" \")))","v":" "}]
[]
["Item",null,null,"(a)",null,"5,0 m x 2,225 m with 42,9 mm dia fully galvanized steel tubing and 2,6 mm thick walls","No.",4,{"$nulls":3},{"v":3550,"d":"3,550.00"},{"$f":"IF(ISNUMBER(H80),L80*H80,IF(ISNUMBER(J80),J80,IF(J80=\"RATE ONLY\",LOWER(\"RATE ONLY\"),\" \")))","v":{"v":14200,"d":"14,200.00"}}]
[]
["IHDR1","C11.5.3",{"$nulls":3},"Moving existing fences and gates:",{"$nulls":6},{"$f":"IF(ISNUMBER(H82),L82*H82,IF(ISNUMBER(J82),J82,IF(J82=\"RATE ONLY\",LOWER(\"RATE ONLY\"),\" \")))","v":" "}]
[]
["IHDR2",null,"C11.5.3.1",null,null,"Fences:",{"$nulls":6},{"$f":"IF(ISNUMBER(H84),L84*H84,IF(ISNUMBER(J84),J84,IF(J84=\"RATE ONLY\",LOWER(\"RATE ONLY\"),\" \")))","v":" "}]
[]
["Item",null,null,"(a)",null,"Stock-proof fences","km",5,{"$nulls":3},{"v":12500,"d":"12,500.00"},{"$f":"IF(ISNUMBER(H86),L86*H86,IF(ISNUMBER(J86),J86,IF(J86=\"RATE ONLY\",LOWER(\"RATE ONLY\"),\" \")))","v":{"v":62500,"d":"62,500.00"}}]
[]
["Item",null,null,"(b)",null,"Vermin-proof fences","km",{"$nulls":5},{"$f":"IF(ISNUMBER(H88),L88*H88,IF(ISNUMBER(J88),J88,IF(J88=\"RATE ONLY\",LOWER(\"RATE ONLY\"),\" \")))","v":" "}]
["Item",null,null,"(c)",null,"Pedestrian fences","km",{"$nulls":5}," "]
["Item",null,null,"(d)",null,"Security fences","km",{"$nulls":5}," "]
["Item",null,null,"(e)",null,"Game fences","km",1,{"$nulls":3},{"v":32500,"d":"32,500.00"},{"$f":"IF(ISNUMBER(H91),L91*H91,IF(ISNUMBER(J91),J91,IF(J91=\"RATE ONLY\",LOWER(\"RATE ONLY\"),\" \")))","v":{"v":32500,"d":"32,500.00"}}]
[]
["IHDR2",null,"C11.5.3.2",null,null,"Gates",{"$nulls":6},{"$f":"IF(ISNUMBER(H93),L93*H93,IF(ISNUMBER(J93),J93,IF(J93=\"RATE ONLY\",LOWER(\"RATE ONLY\"),\" \")))","v":" "}]
[]
["Item",null,null,"(a)",null,"Single leaf","No.",5,{"$nulls":3},{"v":2500,"d":"2,500.00"},{"$f":"IF(ISNUMBER(H95),L95*H95,IF(ISNUMBER(J95),J95,IF(J95=\"RATE ONLY\",LOWER(\"RATE ONLY\"),\" \")))","v":{"v":12500,"d":"12,500.00"}}]
[]
["Item",null,null,"(b)",null,"Double leaf - game proof","No.",2,{"$nulls":3},{"v":2500,"d":"2,500.00"},{"$f":"IF(ISNUMBER(H97),L97*H97,IF(ISNUMBER(J97),J97,IF(J97=\"RATE ONLY\",LOWER(\"RATE ONLY\"),\" \")))","v":{"v":5000,"d":"5,000.00"}}]
[]
["IHDR1","C11.5.4",{"$nulls":3},"Dismantling existing fences and gates:",{"$nulls":6},{"$f":"IF(ISNUMBER(H99),L99*H99,IF(ISNUMBER(J99),J99,IF(J99=\"RATE ONLY\",LOWER(\"RATE ONLY\"),\" \")))","v":" "}]
[]
["IHDR2",null,"C11.5.4.1",null,null,"Fences:",{"$nulls":6},{"$f":"IF(ISNUMBER(H101),L101*H101,IF(ISNUMBER(J101),J101,IF(J101=\"RATE ONLY\",LOWER(\"RATE ONLY\"),\" \")))","v":" "}]
[]
["Item",null,null,"(a)",null,"Stock-proof fences","km",44,{"$nulls":3},{"v":6350,"d":"6,350.00"},{"$f":"IF(ISNUMBER(H103),L103*H103,IF(ISNUMBER(J103),J103,IF(J103=\"RATE ONLY\",LOWER(\"RATE ONLY\"),\" \")))","v":{"v":279400,"d":"279,400.00"}}]
[]
["Item",null,null,"(b)",null,"Vermin-proof fences","km",{"$nulls":5}," "]
["Item",null,null,"(c)",null,"Pedestrian fences","km",{"$nulls":5}," "]
["Item",null,null,"(d)",null,"Security fences","km",{"$nulls":5}," "]
["Item",null,null,"(e)",null,"Game fences","km",4,{"$nulls":3},{"v":9500,"d":"9,500.00"},{"$f":"IF(ISNUMBER(H108),L108*H108,IF(ISNUMBER(J108),J108,IF(J108=\"RATE ONLY\",LOWER(\"RATE ONLY\"),\" \")))","v":{"v":38000,"d":"38,000.00"}}]
[]
["IHDR2",null,"C11.5.4.2",null,null,"Gates:",{"$nulls":6},{"$f":"IF(ISNUMBER(H110),L110*H110,IF(ISNUMBER(J110),J110,IF(J110=\"RATE ONLY\",LOWER(\"RATE ONLY\"),\" \")))","v":" "}]
[]
["Item",null,null,"(a)",null,"Single leaf","No.",20,{"$nulls":3},{"v":730,"d":"730.00"},{"$f":"IF(ISNUMBER(H112),L112*H112,IF(ISNUMBER(J112),J112,IF(J112=\"RATE ONLY\",LOWER(\"RATE ONLY\"),\" \")))","v":{"v":14600,"d":"14,600.00"}}]
[]
["Item",null,null,"(b)",null,"Double leaf - game proof","No.",4,{"$nulls":3},{"v":1250,"d":"1,250.00"},{"$f":"IF(ISNUMBER(H114),L114*H114,IF(ISNUMBER(J114),J114,IF(J114=\"RATE ONLY\",LOWER(\"RATE ONLY\"),\" \")))","v":{"v":5000,"d":"5,000.00"}}]
[]
["IHDR1","C11.5.5",{"$nulls":3},"Providing temporary fences and gates:",{"$nulls":6},{"$f":"IF(ISNUMBER(H116),L116*H116,IF(ISNUMBER(J116),J116,IF(J116=\"RATE ONLY\",LOWER(\"RATE ONLY\"),\" \")))","v":" "}]
[]
["IHDR2",null,"C11.5.5.1",null,null,"Stock-proof fence, 1,4 m high","km",2,{"$nulls":3},{"v":56400,"d":"56,400.00"},{"$f":"IF(ISNUMBER(H118),L118*H118,IF(ISNUMBER(J118),J118,IF(J118=\"RATE ONLY\",LOWER(\"RATE ONLY\"),\" \")))","v":{"v":112800,"d":"112,800.00"}}]
[]
["IHDR2",null,"C11.5.5.2",null,null,"Vermin-proof fences","km",{"$nulls":5},{"$f":"IF(ISNUMBER(H120),L120*H120,IF(ISNUMBER(J120),J120,IF(J120=\"RATE ONLY\",LOWER(\"RATE ONLY\"),\" \")))","v":" "}]
[]
["IHDR2",null,"C11.5.5.3",null,null,"Pedestrian fences","km",{"$nulls":5},{"$f":"IF(ISNUMBER(H122),L122*H122,IF(ISNUMBER(J122),J122,IF(J122=\"RATE ONLY\",LOWER(\"RATE ONLY\"),\" \")))","v":" "}]
["PB"]
["PB","CARRIED FORWARD",{"$nulls":10},{"$f":"SUBTOTAL(9,M$7:M122)","v":{"v":6055815,"d":"6,055,815.00"}}]
["PB"]
["PB"]
["PB","BROUGHT FORWARD",{"$nulls":10},{"$f":"SUBTOTAL(9,M$7:M125)","v":{"v":6055815,"d":"6,055,815.00"}}]
["PB"]
[]
["IHDR2",null,"C11.5.5.4",null,null,"Game fences, 2,25 m high","km",1,{"$nulls":3},{"v":85000,"d":"85,000.00"},{"$f":"IF(ISNUMBER(H130),L130*H130,IF(ISNUMBER(J130),J130,IF(J130=\"RATE ONLY\",LOWER(\"RATE ONLY\"),\" \")))","v":{"v":85000,"d":"85,000.00"}}]
[]
["IHDR2",null,"C11.5.5.5",null,null,"Temporary gates:",{"$nulls":6},{"$f":"IF(ISNUMBER(H132),L132*H132,IF(ISNUMBER(J132),J132,IF(J132=\"RATE ONLY\",LOWER(\"RATE ONLY\"),\" \")))","v":" "}]
[]
["IHDR3",null,null,"(a)",null,"Single leaf",{"$nulls":6},{"$f":"IF(ISNUMBER(H134),L134*H134,IF(ISNUMBER(J134),J134,IF(J134=\"RATE ONLY\",LOWER(\"RATE ONLY\"),\" \")))","v":" "}]
[]
["Item1",{"$nulls":3},"(ii)","4,2 m x 1,4 m","No.",9,{"$nulls":3},{"v":2500,"d":"2,500.00"},{"$f":"IF(ISNUMBER(H136),L136*H136,IF(ISNUMBER(J136),J136,IF(J136=\"RATE ONLY\",LOWER(\"RATE ONLY\"),\" \")))","v":{"v":22500,"d":"22,500.00"}}]
[]
["IHDR3",null,null,"(b)",null,"Double leaf:",{"$nulls":6},{"$f":"IF(ISNUMBER(H138),L138*H138,IF(ISNUMBER(J138),J138,IF(J138=\"RATE ONLY\",LOWER(\"RATE ONLY\"),\" \")))","v":" "}]
[]
["Item1",{"$nulls":3},"(ii)","5,0 m x 2,225 m","No.",1,{"$nulls":3},{"v":3400,"d":"3,400.00"},{"$f":"IF(ISNUMBER(H140),L140*H140,IF(ISNUMBER(J140),J140,IF(J140=\"RATE ONLY\",LOWER(\"RATE ONLY\"),\" \")))","v":{"v":3400,"d":"3,400.00"}}]
[]
["IHDR1","C11.5.6",{"$nulls":3},"Ringbolts for anchoring fencing to structures","No.",81,{"$nulls":3},{"v":145,"d":"145.00"},{"$f":"IF(ISNUMBER(H142),L142*H142,IF(ISNUMBER(J142),J142,IF(J142=\"RATE ONLY\",LOWER(\"RATE ONLY\"),\" \")))","v":{"v":11745,"d":"11,745.00"}}]
[]
["IHDR1","C11.5.7",{"$nulls":3},"Drilling and blasting holes for posts and anchors","No.",150,{"$nulls":3},{"v":650,"d":"650.00"},{"$f":"IF(ISNUMBER(H144),L144*H144,IF(ISNUMBER(J144),J144,IF(J144=\"RATE ONLY\",LOWER(\"RATE ONLY\"),\" \")))","v":{"v":97500,"d":"97,500.00"}}]
[]
["IHDR1","C11.5.8",{"$nulls":3},"Posts fixed horizontally to the bottom of wire mesh for the closing of openings under fences:",{"$nulls":6},{"$f":"IF(ISNUMBER(H146),L146*H146,IF(ISNUMBER(J146),J146,IF(J146=\"RATE ONLY\",LOWER(\"RATE ONLY\"),\" \")))","v":" "}]
[]
["Item",null,"C11.5.8.1",null,null,"Timber posts (diameter indicated)","m",{"$nulls":5},{"$f":"IF(ISNUMBER(H148),L148*H148,IF(ISNUMBER(J148),J148,IF(J148=\"RATE ONLY\",LOWER(\"RATE ONLY\"),\" \")))","v":" "}]
["Item",null,"C11.5.8.2",null,null,"Mild steel pipes (diameter and wall thickness indicated)","m",{"$nulls":5}," "]
["IHDR1","C11.5.9",{"$nulls":3},"Repairing existing fences (Type indicated)","km",{"$nulls":5},{"$f":"IF(ISNUMBER(H150),L150*H150,IF(ISNUMBER(J150),J150,IF(J150=\"RATE ONLY\",LOWER(\"RATE ONLY\"),\" \")))","v":" "}]
[]
["IHDR1","C11.5.10",{"$nulls":3},"Disposal of existing fencing materials:",{"$nulls":6},{"$f":"IF(ISNUMBER(H152),L152*H152,IF(ISNUMBER(J152),J152,IF(J152=\"RATE ONLY\",LOWER(\"RATE ONLY\"),\" \")))","v":" "}]
[]
["IHDR2",null,"C11.5.10.1",null,null,"Stock-proof fences","km",44,{"$nulls":3},{"v":1100,"d":"1,100.00"},{"$f":"IF(ISNUMBER(H154),L154*H154,IF(ISNUMBER(J154),J154,IF(J154=\"RATE ONLY\",LOWER(\"RATE ONLY\"),\" \")))","v":{"v":48400,"d":"48,400.00"}}]
[]
["IHDR2",null,"C11.5.10.2",null,null,"Vermin-proof fences","km",{"$nulls":5},{"$f":"IF(ISNUMBER(H156),L156*H156,IF(ISNUMBER(J156),J156,IF(J156=\"RATE ONLY\",LOWER(\"RATE ONLY\"),\" \")))","v":" "}]
[]
["IHDR2",null,"C11.5.10.3",null,null,"Pedestrian fences","km",{"$nulls":5},{"$f":"IF(ISNUMBER(H158),L158*H158,IF(ISNUMBER(J158),J158,IF(J158=\"RATE ONLY\",LOWER(\"RATE ONLY\"),\" \")))","v":" "}]
[]
["IHDR2",null,"C11.5.10.4",null,null,"Security fences","km",{"$nulls":5},{"$f":"IF(ISNUMBER(H160),L160*H160,IF(ISNUMBER(J160),J160,IF(J160=\"RATE ONLY\",LOWER(\"RATE ONLY\"),\" \")))","v":" "}]
[]
["IHDR2",null,"C11.5.10.5",null,null,"Game fences ","km",4,{"$nulls":3},{"v":2500,"d":"2,500.00"},{"$f":"IF(ISNUMBER(H162),L162*H162,IF(ISNUMBER(J162),J162,IF(J162=\"RATE ONLY\",LOWER(\"RATE ONLY\"),\" \")))","v":{"v":10000,"d":"10,000.00"}}]
[]
["IHDR2",null,"C11.5.10.6",null,null,"Gates:",{"$nulls":6},{"$f":"IF(ISNUMBER(H164),L164*H164,IF(ISNUMBER(J164),J164,IF(J164=\"RATE ONLY\",LOWER(\"RATE ONLY\"),\" \")))","v":" "}]
[]
["Item",null,null,"(a)",null,"Single leaf","No.",20,{"$nulls":3},{"v":350,"d":"350.00"},{"$f":"IF(ISNUMBER(H166),L166*H166,IF(ISNUMBER(J166),J166,IF(J166=\"RATE ONLY\",LOWER(\"RATE ONLY\"),\" \")))","v":{"v":7000,"d":"7,000.00"}}]
[]
["Item",null,null,"(b)",null,"Double leaf - game proof","No.",4,{"$nulls":3},{"v":450,"d":"450.00"},{"$f":"IF(ISNUMBER(H168),L168*H168,IF(ISNUMBER(J168),J168,IF(J168=\"RATE ONLY\",LOWER(\"RATE ONLY\"),\" \")))","v":{"v":1800,"d":"1,800.00"}}]
[{"$nulls":12},{"$f":"IF(ISNUMBER(H169),L169*H169,IF(ISNUMBER(J169),J169,IF(J169=\"RATE ONLY\",LOWER(\"RATE ONLY\"),\" \")))","v":" "}]
["IHDR1","PC11.5.11",{"$nulls":3},"Supply and installation of electronic sliding gate","lump sum",1,{"v":30000,"d":"30,000.00"},{"$f":"I170","v":{"v":30000,"d":"30,000.00"}},null,{"v":30000,"d":"30,000.00"},{"v":30000,"d":"30,000.00"}]
[{"$nulls":12}," "]
["item",{"$nulls":11}," "]
[{"$nulls":12}," "]
[{"$nulls":12}," "]
[{"$nulls":12}," "]
[{"$nulls":12}," "]
[{"$nulls":12}," "]
[{"$nulls":12}," "]
{"$rows_empty":9}
["#BillEnd#"]
["#BillEnd#","TOTAL CARRIED FORWARD TO SUMMARY",{"$nulls":10},{"$f":"SUBTOTAL(9,M$7:M173)","v":{"v":6373160,"d":"6,373,160.00"}}]
["#BillEnd#"]

{"sheet":"11.6","index":47,"n_rows":209,"n_cols":13,"rows_kept":209,"hidden":true}
["#BillSheet#"]
["#BillSheet#","C11.6","ROAD SIGNS",{"$nulls":3},"\n",null,null,"SCHEDULE A",{"$f":"SUBTOTAL(9,M$7:M1177)","v":{"v":1732525,"d":"1,732,525.00"}},null,{"$f":"J2","v":"SCHEDULE A"}]
["#BillSheet#"]
["ColHDR"]
["ColHDR","ITEM",{"$nulls":3},"DESCRIPTION","UNIT","QTY","RATE","AMT",null,"RATE","AMOUNT"]
["ColHDR"]
[{"$nulls":5},"ROAD SIGNS"]
["IHDR1","C11.6.1",{"$nulls":3},"Road signboards with painted or coloured semi-matt background. Symbols, lettering and borders in semi- matt black or in Class I retro-reflective material, where the sign board is constructed from:",{"$nulls":6},{"$f":"IF(ISNUMBER(H8),L8*H8,IF(ISNUMBER(J8),J8,IF(J8=\"RATE ONLY\",LOWER(\"RATE ONLY\"),\" \")))","v":" "}]
[]
["IHDR2",null,"C11.6.1.1",null,null,"Aluminium sheet (2,0 mm thick):",{"$nulls":6},{"$f":"IF(ISNUMBER(H10),L10*H10,IF(ISNUMBER(J10),J10,IF(J10=\"RATE ONLY\",LOWER(\"RATE ONLY\"),\" \")))","v":" "}]
[]
["Item",null,null,"(a)",null,"Area 0 to 0,5 m²","m²",{"$nulls":5},{"$f":"IF(ISNUMBER(H12),L12*H12,IF(ISNUMBER(J12),J12,IF(J12=\"RATE ONLY\",LOWER(\"RATE ONLY\"),\" \")))","v":" "}]
["Item",null,null,"(b)",null,"Area exceeding 0,5 m² but not 2,0 m²","m²",{"$nulls":5}," "]
["Item",null,null,"(c)",null,"Area exceeding 2,0 m² but not 10 m²","m²",{"$nulls":5}," "]
["Item",null,null,"(d)",null,"Area exceeding 10 m² ","m²",{"$nulls":5}," "]
["IHDR2",null,"C11.6.1.2",null,null,"Aluminium composite sheet",{"$nulls":6},{"$f":"IF(ISNUMBER(H16),L16*H16,IF(ISNUMBER(J16),J16,IF(J16=\"RATE ONLY\",LOWER(\"RATE ONLY\"),\" \")))","v":" "}]
[]
["Item",null,null,"(a)",null,"Area 0 to 0,5 m² (indicate plate thickness, 2,0 or 3,0 mm)","m²",{"$nulls":5}," "]
["Item",null,null,"(b)",null,"Area exceeding 0,5 m² but not 2,0 m² (indicate plate thickness, 2,0 or 3,0 mm)","m²",{"$nulls":5}," "]
["Item",null,null,"(c)",null,"Area exceeding 2,0 m² but not 10 m² (3,0 mm plate thickness)","m²",{"$nulls":5}," "]
["Item",null,null,"(d)",null,"Area exceeding 10 m² (3,0 mm plate thickness)","m²",{"$nulls":5}," "]
["IHDR2",null,"C11.6.1.3",null,null,"Prepainted galvanized steel plate:",{"$nulls":6},{"$f":"IF(ISNUMBER(H22),L22*H22,IF(ISNUMBER(J22),J22,IF(J22=\"RATE ONLY\",LOWER(\"RATE ONLY\"),\" \")))","v":" "}]
[]
["Item",null,null,"(a)",null,"Area 0 to 0,5 m²","m²",18,{"$nulls":3},{"v":760,"d":"760.00"},{"$f":"IF(ISNUMBER(H24),L24*H24,IF(ISNUMBER(J24),J24,IF(J24=\"RATE ONLY\",LOWER(\"RATE ONLY\"),\" \")))","v":{"v":13680,"d":"13,680.00"}}]
[]
["Item",null,null,"(b)",null,"Area exceeding 0,5 m² but not 2,0 m²","m²",34,{"$nulls":3},{"v":760,"d":"760.00"},{"$f":"IF(ISNUMBER(H26),L26*H26,IF(ISNUMBER(J26),J26,IF(J26=\"RATE ONLY\",LOWER(\"RATE ONLY\"),\" \")))","v":{"v":25840,"d":"25,840.00"}}]
[]
["Item",null,null,"(c)",null,"Area exceeding 2,0 m² but not 10 m²","m²",{"$nulls":5}," "]
["Item",null,null,"(d)",null,"Area exceeding 10 m² ","m²",{"$nulls":5}," "]
["IHDR2",null,"C11.6.1.4",null,null,"Prepainted galvanized steel profiles (200 mm high panels):",{"$nulls":6},{"$f":"IF(ISNUMBER(H30),L30*H30,IF(ISNUMBER(J30),J30,IF(J30=\"RATE ONLY\",LOWER(\"RATE ONLY\"),\" \")))","v":" "}]
[]
["Item",null,null,"(a)",null,"Area 0 to 0,5 m²","m²",{"$nulls":5}," "]
["Item",null,null,"(b)",null,"Area exceeding 0,5 m² but not 2,0 m²","m²",38,{"$nulls":3},{"v":1100,"d":"1,100.00"},{"$f":"IF(ISNUMBER(H33),L33*H33,IF(ISNUMBER(J33),J33,IF(J33=\"RATE ONLY\",LOWER(\"RATE ONLY\"),\" \")))","v":{"v":41800,"d":"41,800.00"}}]
[]
["Item",null,null,"(c)",null,"Area exceeding 2,0 m² but not 10 m²","m²",131,{"$nulls":3},{"v":1100,"d":"1,100.00"},{"$f":"IF(ISNUMBER(H35),L35*H35,IF(ISNUMBER(J35),J35,IF(J35=\"RATE ONLY\",LOWER(\"RATE ONLY\"),\" \")))","v":{"v":144100,"d":"144,100.00"}}]
[]
["Item",null,null,"(d)",null,"Area exceeding 10 m² ","m²",30,{"$nulls":3},{"v":1100,"d":"1,100.00"},{"$f":"IF(ISNUMBER(H37),L37*H37,IF(ISNUMBER(J37),J37,IF(J37=\"RATE ONLY\",LOWER(\"RATE ONLY\"),\" \")))","v":{"v":33000,"d":"33,000.00"}}]
[]
["IHDR2",null,"C11.6.1.5",null,null,"Other material (details indicated):",{"$nulls":6},{"$f":"IF(ISNUMBER(H39),L39*H39,IF(ISNUMBER(J39),J39,IF(J39=\"RATE ONLY\",LOWER(\"RATE ONLY\"),\" \")))","v":" "}]
[]
["Item",null,null,"(a)",null,"Area 0 to 0,5 m²","m²",{"$nulls":5}," "]
["Item",null,null,"(b)",null,"Area exceeding 0,5 m² but not 2,0 m²","m²",{"$nulls":5}," "]
["Item",null,null,"(c)",null,"Area exceeding 2,0 m² but not 10 m²","m²",{"$nulls":5}," "]
["Item",null,null,"(d)",null,"Area exceeding 10 m² ","m²",{"$nulls":5}," "]
["IHDR2",null,"C11.6.1.6",null,null,"Extra over items C11.6.1.1 to C11.6.1.4 for attaching signboards to overhead gantry structures and overhead to bridges","m²",{"$nulls":5},{"$f":"IF(ISNUMBER(H45),L45*H45,IF(ISNUMBER(J45),J45,IF(J45=\"RATE ONLY\",LOWER(\"RATE ONLY\"),\" \")))","v":" "}]
[]
["IHDR2",null,"C11.6.1.7",null,null,"Regulatory signs, permanent:",{"$nulls":6},{"$f":"IF(ISNUMBER(H47),L47*H47,IF(ISNUMBER(J47),J47,IF(J47=\"RATE ONLY\",LOWER(\"RATE ONLY\"),\" \")))","v":" "}]
[]
["Item",null,null,"(a)",null,"600 mm diameter (signboard material, background and symbol retro-reflective class indicated)","No.",{"$nulls":5}," "]
["Item",null,null,"(b)",null,"900 mm diameter, 1.4 mm thick pre-painted galvanized steel plate, Class III background and symbols","No.",6,{"$nulls":3},{"v":1050,"d":"1,050.00"},{"$f":"IF(ISNUMBER(H50),L50*H50,IF(ISNUMBER(J50),J50,IF(J50=\"RATE ONLY\",LOWER(\"RATE ONLY\"),\" \")))","v":{"v":6300,"d":"6,300.00"}}]
[]
["Item",null,null,"(c)",null,"1200 mm diameter, 1.4 mm thick pre-painted galvanized steel plate, Class III background and symbols","No.",76,{"$nulls":3},{"v":1150,"d":"1,150.00"},{"$f":"IF(ISNUMBER(H52),L52*H52,IF(ISNUMBER(J52),J52,IF(J52=\"RATE ONLY\",LOWER(\"RATE ONLY\"),\" \")))","v":{"v":87400,"d":"87,400.00"}}]
[]
["IHDR2",null,"C11.6.1.8",null,null,"Regulatory signs, temporary:",{"$nulls":6},{"$f":"IF(ISNUMBER(H54),L54*H54,IF(ISNUMBER(J54),J54,IF(J54=\"RATE ONLY\",LOWER(\"RATE ONLY\"),\" \")))","v":" "}]
[]
["Item",null,null,"(a)",null,"600 mm diameter (signboard material, background and symbol retro-reflective class indicated)","No.",{"$nulls":5},{"$f":"IF(ISNUMBER(H56),L56*H56,IF(ISNUMBER(J56),J56,IF(J56=\"RATE ONLY\",LOWER(\"RATE ONLY\"),\" \")))","v":" "}]
["Item",null,null,"(b)",null,"900 mm diameter (signboard material, background and symbol retro-reflective class indicated)","No.",{"$nulls":5}," "]
["Item",null,null,"(c)",null,"1200 mm diameter, 1.4 mm thick pre-painted galvanized steel plate, Class III background and symbols","No.",{"$nulls":5},{"$f":"IF(ISNUMBER(H58),L58*H58,IF(ISNUMBER(J58),J58,IF(J58=\"RATE ONLY\",LOWER(\"RATE ONLY\"),\" \")))","v":" "}]
["IHDR2",null,"C11.6.1.9",null,null,"Warning signs, permanent:",{"$nulls":6},{"$f":"IF(ISNUMBER(H59),L59*H59,IF(ISNUMBER(J59),J59,IF(J59=\"RATE ONLY\",LOWER(\"RATE ONLY\"),\" \")))","v":" "}]
[]
["Item",null,null,"(a)",null,"600 mm size (signboard material, background and symbol retro-reflective class indicated)","No.",{"$nulls":5}," "]
["Item",null,null,"(b)",null,"900 mm size (signboard material, background and symbol retro-reflective class indicated)","No.",{"$nulls":5}," "]
["Item",null,null,"(c)",null,"1200 mm size (signboard material, background and symbol retro-reflective class I indicated)","No.",{"$nulls":5}," "]
["Item",null,null,"(d)",null,"1500mm size, 1.4 mm thick pre-painted galvanized steel plate, Class III background and symbols","No.",53,{"$nulls":3},{"v":1400,"d":"1,400.00"},{"$f":"IF(ISNUMBER(H64),L64*H64,IF(ISNUMBER(J64),J64,IF(J64=\"RATE ONLY\",LOWER(\"RATE ONLY\"),\" \")))","v":{"v":74200,"d":"74,200.00"}}]
[]
["IHDR2",null,"C11.6.1.10",null,null,"Warning signs, temporary:",{"$nulls":6},{"$f":"IF(ISNUMBER(H66),L66*H66,IF(ISNUMBER(J66),J66,IF(J66=\"RATE ONLY\",LOWER(\"RATE ONLY\"),\" \")))","v":" "}]
[]
["Item",null,null,"(a)",null,"600 mm size (signboard material, background and symbol retro-reflective class indicated)","No.",{"$nulls":5}," "]
["Item",null,null,"(b)",null,"900 mm size (signboard material, background and symbol retro-reflective class indicated)","No.",{"$nulls":5}," "]
["Item",null,null,"(c)",null,"1200 mm size (signboard material, background and symbol retro-reflective class indicated)","No.",{"$nulls":5}," "]
["Item",null,null,"(d)",null,"1500 mm size, 1.4 mm thick pre-painted galvanized steel plate, Class III background and symbols","No.",{"$nulls":5},{"$f":"IF(ISNUMBER(H71),L71*H71,IF(ISNUMBER(J71),J71,IF(J71=\"RATE ONLY\",LOWER(\"RATE ONLY\"),\" \")))","v":" "}]
["IHDR2",null,"C11.6.1.11",null,null,"Supplementary plates to permanent regulatory or warning signs, 1.4 mm thick pre-painted galvanized steel plate, Class III background and symbols","m²",7,{"$nulls":3},{"v":760,"d":"760.00"},{"$f":"IF(ISNUMBER(H72),L72*H72,IF(ISNUMBER(J72),J72,IF(J72=\"RATE ONLY\",LOWER(\"RATE ONLY\"),\" \")))","v":{"v":5320,"d":"5,320.00"}}]
[]
["IHDR2",null,"C11.6.1.12",null,null,"Supplementary plates to temporary regulatory or warning signs, 1.4 mm thick pre-painted galvanized steel plate, Class III background and symbols","m²",{"$nulls":5},{"$f":"IF(ISNUMBER(H74),L74*H74,IF(ISNUMBER(J74),J74,IF(J74=\"RATE ONLY\",LOWER(\"RATE ONLY\"),\" \")))","v":" "}]
[]
["IHDR1","C11.6.2",{"$nulls":3},"Extra over on item C11.6.1 for using:",{"$nulls":6},{"$f":"IF(ISNUMBER(H76),L76*H76,IF(ISNUMBER(J76),J76,IF(J76=\"RATE ONLY\",LOWER(\"RATE ONLY\"),\" \")))","v":" "}]
[]
["IHDR2",null,"C11.6.2.1",null,null,"Background of retro-reflective material:",{"$nulls":6},{"$f":"IF(ISNUMBER(H78),L78*H78,IF(ISNUMBER(J78),J78,IF(J78=\"RATE ONLY\",LOWER(\"RATE ONLY\"),\" \")))","v":" "}]
[]
["Item",null,null,"(a)",null,"Class I","m²",{"$nulls":5}," "]
["Item",null,null,"(b)",null,"Class III","m²",400,{"$nulls":3},{"v":385,"d":"385.00"},{"$f":"IF(ISNUMBER(H81),L81*H81,IF(ISNUMBER(J81),J81,IF(J81=\"RATE ONLY\",LOWER(\"RATE ONLY\"),\" \")))","v":{"v":154000,"d":"154,000.00"}}]
[]
["Item",null,null,"(c)",null,"Class IV specify a) or b)","m²",{"$nulls":5}," "]
["IHDR2",null,"C11.6.2.2",null,null,"Lettering, symbols, numbers, arrows, emblems and borders of retro-reflective material:",{"$nulls":6},{"$f":"IF(ISNUMBER(H84),L84*H84,IF(ISNUMBER(J84),J84,IF(J84=\"RATE ONLY\",LOWER(\"RATE ONLY\"),\" \")))","v":" "}]
[]
["Item",null,null,"(a)",null,"Class III","m²",201,{"$nulls":3},{"v":385,"d":"385.00"},{"$f":"IF(ISNUMBER(H86),L86*H86,IF(ISNUMBER(J86),J86,IF(J86=\"RATE ONLY\",LOWER(\"RATE ONLY\"),\" \")))","v":{"v":77385,"d":"77,385.00"}}]
[]
["PB"]
["PB","CARRIED FORWARD",{"$nulls":10},{"$f":"SUBTOTAL(9,M$7:M87)","v":{"v":663025,"d":"663,025.00"}}]
["PB"]
["PB"]
["PB","BROUGHT FORWARD",{"$nulls":10},{"$f":"SUBTOTAL(9,M$7:M90)","v":{"v":663025,"d":"663,025.00"}}]
["PB"]
["Item",null,null,"(b)",null,"Class IV specify a) or b)","m²",{"$nulls":5}," "]
["IHDR1","C11.6.3",{"$nulls":3},"Road sign supports (overhead road sign structures excluded):",{"$nulls":6},{"$f":"IF(ISNUMBER(H95),L95*H95,IF(ISNUMBER(J95),J95,IF(J95=\"RATE ONLY\",LOWER(\"RATE ONLY\"),\" \")))","v":" "}]
[]
["IHDR2",null,"C11.6.3.1",null,null,"Steel tubing (diameter and wall thickness indicated)","t",{"$nulls":5},{"$f":"IF(ISNUMBER(H97),L97*H97,IF(ISNUMBER(J97),J97,IF(J97=\"RATE ONLY\",LOWER(\"RATE ONLY\"),\" \")))","v":" "}]
[]
["IHDR2",null,"C11.6.3.2",null,null,"Timber:",{"$nulls":6},{"$f":"IF(ISNUMBER(H99),L99*H99,IF(ISNUMBER(J99),J99,IF(J99=\"RATE ONLY\",LOWER(\"RATE ONLY\"),\" \")))","v":" "}]
[]
["Item",null,null,"(a)",null,"125 mm dia","m",1471,{"$nulls":3},{"v":125,"d":"125.00"},{"$f":"IF(ISNUMBER(H101),L101*H101,IF(ISNUMBER(J101),J101,IF(J101=\"RATE ONLY\",LOWER(\"RATE ONLY\"),\" \")))","v":{"v":183875,"d":"183,875.00"}}]
[]
["Item",null,null,"(b)",null,"150 mm dia","m",232,{"$nulls":3},{"v":150,"d":"150.00"},{"$f":"IF(ISNUMBER(H103),L103*H103,IF(ISNUMBER(J103),J103,IF(J103=\"RATE ONLY\",LOWER(\"RATE ONLY\"),\" \")))","v":{"v":34800,"d":"34,800.00"}}]
[]
["Item",null,null,"(c)",null,"175 mm dia","m",202,{"$nulls":3},{"v":175,"d":"175.00"},{"$f":"IF(ISNUMBER(H105),L105*H105,IF(ISNUMBER(J105),J105,IF(J105=\"RATE ONLY\",LOWER(\"RATE ONLY\"),\" \")))","v":{"v":35350,"d":"35,350.00"}}]
[]
["Item",null,null,"(c)",null,"200 mm dia","m",167,{"$nulls":3},{"v":200,"d":"200.00"},{"$f":"IF(ISNUMBER(H107),L107*H107,IF(ISNUMBER(J107),J107,IF(J107=\"RATE ONLY\",LOWER(\"RATE ONLY\"),\" \")))","v":{"v":33400,"d":"33,400.00"}}]
[]
["IHDR1","C11.6.4",{"$nulls":3},"Kilometre markers:",{"$nulls":6},{"$f":"IF(ISNUMBER(H109),L109*H109,IF(ISNUMBER(J109),J109,IF(J109=\"RATE ONLY\",LOWER(\"RATE ONLY\"),\" \")))","v":" "}]
[]
["Item",null,"C11.6.4.1",null,null,"Kilometre markers on posts, 1,4 mm thick pre-painted galvanized steel plate, 1,8 m long, 2,0 mm thick, 50 mm x 50 mm galvanized square tubing post (see DWG. No 113142-0-DRG-RR-04-0037)","No.",264,{"$nulls":3},{"v":425,"d":"425.00"},{"$f":"IF(ISNUMBER(H111),L111*H111,IF(ISNUMBER(J111),J111,IF(J111=\"RATE ONLY\",LOWER(\"RATE ONLY\"),\" \")))","v":{"v":112200,"d":"112,200.00"}}]
[]
["Item",null,"C11.6.4.2",null,null,"Replace marker boards on existing kilometre posts","m²",{"$nulls":5},{"$f":"IF(ISNUMBER(H113),L113*H113,IF(ISNUMBER(J113),J113,IF(J113=\"RATE ONLY\",LOWER(\"RATE ONLY\"),\" \")))","v":" "}]
["IHDR1","C11.6.5",{"$nulls":3},"Excavation and backfilling for road sign supports (not applicable to kilometre posts):",{"$nulls":6},{"$f":"IF(ISNUMBER(H114),L114*H114,IF(ISNUMBER(J114),J114,IF(J114=\"RATE ONLY\",LOWER(\"RATE ONLY\"),\" \")))","v":" "}]
[]
["Item",null,"C11.6.5.1",null,null,"Excavating soft material and backfilling","m³",235,{"$nulls":3},{"v":435,"d":"435.00"},{"$f":"IF(ISNUMBER(H116),L116*H116,IF(ISNUMBER(J116),J116,IF(J116=\"RATE ONLY\",LOWER(\"RATE ONLY\"),\" \")))","v":{"v":102225,"d":"102,225.00"}}]
[]
["Item",null,"C11.6.5.2",null,null,"Excavating soft or intermediate material and backfilling using labour enhanced construction methods","m³",{"$nulls":5}," "]
["Item",null,"C11.6.5.3",null,null,"Extra over item C11.6.5.1 and C11.6.5.2 for cement-treated soil backfill","m³",235,{"$nulls":3},{"v":410,"d":"410.00"},{"$f":"IF(ISNUMBER(H119),L119*H119,IF(ISNUMBER(J119),J119,IF(J119=\"RATE ONLY\",LOWER(\"RATE ONLY\"),\" \")))","v":{"v":96350,"d":"96,350.00"}}]
[]
["Item",null,"C11.6.5.4",null,null,"Extra over item C11.6.5.1 for hard material excavation","m³",59,{"$nulls":3},{"v":680,"d":"680.00"},{"$f":"IF(ISNUMBER(H121),L121*H121,IF(ISNUMBER(J121),J121,IF(J121=\"RATE ONLY\",LOWER(\"RATE ONLY\"),\" \")))","v":{"v":40120,"d":"40,120.00"}}]
[]
["Item",null,"C11.6.5.5",null,null,"Imported backfill material from commercial sources","m³",{"$nulls":5}," "]
["IHDR1","C11.6.6",{"$nulls":3},"Dismantling, storing and re-erecting road signs with a surface area of:",{"$nulls":6},{"$f":"IF(ISNUMBER(H124),L124*H124,IF(ISNUMBER(J124),J124,IF(J124=\"RATE ONLY\",LOWER(\"RATE ONLY\"),\" \")))","v":" "}]
[]
["Item",null,"C11.6.6.1",null,null,"Area 0 to 0,5 m²","m²",{"$nulls":5}," "]
["Item",null,"C11.6.6.2",null,null,"Area exceeding 0,5 m² but not 2,0 m²","m²",{"$nulls":5}," "]
["Item",null,"C11.6.6.3",null,null,"Exceeding 2,0 m² but not 10 m²","m²",{"$nulls":5}," "]
["Item",null,"C11.6.6.4",null,null,"Exceeding 10 m²","m²",{"$nulls":5}," "]
["IHDR1","C11.6.7",{"$nulls":3},"Dismantling and storing of road signs and overhead signs:",{"$nulls":6},{"$f":"IF(ISNUMBER(H130),L130*H130,IF(ISNUMBER(J130),J130,IF(J130=\"RATE ONLY\",LOWER(\"RATE ONLY\"),\" \")))","v":" "}]
[]
["IHDR2",null,"C11.6.7.1",null,null,"Dismantling and storing of road signs with a surface area of:",{"$nulls":6},{"$f":"IF(ISNUMBER(H132),L132*H132,IF(ISNUMBER(J132),J132,IF(J132=\"RATE ONLY\",LOWER(\"RATE ONLY\"),\" \")))","v":" "}]
[]
["Item",null,null,"(a)",null,"Area 0 to 0,5 m²","m²",50,{"$nulls":3},{"v":270,"d":"270.00"},{"$f":"IF(ISNUMBER(H134),L134*H134,IF(ISNUMBER(J134),J134,IF(J134=\"RATE ONLY\",LOWER(\"RATE ONLY\"),\" \")))","v":{"v":13500,"d":"13,500.00"}}]
[]
["Item",null,null,"(b)",null,"Area exceeding 0,5 m² but not 2,0 m²","m²",70,{"$nulls":3},{"v":305,"d":"305.00"},{"$f":"IF(ISNUMBER(H136),L136*H136,IF(ISNUMBER(J136),J136,IF(J136=\"RATE ONLY\",LOWER(\"RATE ONLY\"),\" \")))","v":{"v":21350,"d":"21,350.00"}}]
[]
["Item",null,null,"(c)",null,"Exceeding 2,0 m² but not 10 m² ","m²",100,{"$nulls":3},{"v":360,"d":"360.00"},{"$f":"IF(ISNUMBER(H138),L138*H138,IF(ISNUMBER(J138),J138,IF(J138=\"RATE ONLY\",LOWER(\"RATE ONLY\"),\" \")))","v":{"v":36000,"d":"36,000.00"}}]
[]
["Item",null,null,"(d)",null,"Exceeding 10 m²","m²",70,{"$nulls":3},{"v":450,"d":"450.00"},{"$f":"IF(ISNUMBER(H140),L140*H140,IF(ISNUMBER(J140),J140,IF(J140=\"RATE ONLY\",LOWER(\"RATE ONLY\"),\" \")))","v":{"v":31500,"d":"31,500.00"}}]
[]
["IHDR2",null,"C11.6.7.2",null,null,"Dismantling and storing of overhead signs with a surface area of:",{"$nulls":6},{"$f":"IF(ISNUMBER(H142),L142*H142,IF(ISNUMBER(J142),J142,IF(J142=\"RATE ONLY\",LOWER(\"RATE ONLY\"),\" \")))","v":" "}]
[]
["Item",null,null,"(a)",null,"Area exceeding 0 m² but not 2,0 m²","m²",{"$nulls":5},{"$f":"IF(ISNUMBER(H144),L144*H144,IF(ISNUMBER(J144),J144,IF(J144=\"RATE ONLY\",LOWER(\"RATE ONLY\"),\" \")))","v":" "}]
["Item",null,null,"(b)",null,"Exceeding 2,0 m² but not 10 m²","m²",{"$nulls":5},{"$f":"IF(ISNUMBER(H145),L145*H145,IF(ISNUMBER(J145),J145,IF(J145=\"RATE ONLY\",LOWER(\"RATE ONLY\"),\" \")))","v":" "}]
["Item",null,null,"(c)",null,"Exceeding 10 m² ","m²",{"$nulls":5},{"$f":"IF(ISNUMBER(H146),L146*H146,IF(ISNUMBER(J146),J146,IF(J146=\"RATE ONLY\",LOWER(\"RATE ONLY\"),\" \")))","v":" "}]
["IHDR1","C11.6.8",{"$nulls":3},"Danger plates at culverts/structures:",{"$nulls":6},{"$f":"IF(ISNUMBER(H147),L147*H147,IF(ISNUMBER(J147),J147,IF(J147=\"RATE ONLY\",LOWER(\"RATE ONLY\"),\" \")))","v":" "}]
[]
["PB"]
["PB","CARRIED FORWARD",{"$nulls":10},{"$f":"SUBTOTAL(9,M$7:M148)","v":{"v":1403695,"d":"1,403,695.00"}}]
["PB"]
["PB"]
["PB","BROUGHT FORWARD",{"$nulls":10},{"$f":"SUBTOTAL(9,M$7:M151)","v":{"v":1403695,"d":"1,403,695.00"}}]
["PB"]
["Item",null,"C11.6.8.1",null,null,"Size 150 x 600 mm (state post type and reflective material)","No.",{"$nulls":5},{"$f":"IF(ISNUMBER(H155),L155*H155,IF(ISNUMBER(J155),J155,IF(J155=\"RATE ONLY\",LOWER(\"RATE ONLY\"),\" \")))","v":" "}]
["Item",null,"C11.6.8.2",null,null,"Size 200 x 800mm, 2,35 mm long, 2,0 mm thick, 50 mm x 50 mm galvanized square tubing post with Class III reflectivity","No.",518,{"$nulls":3},{"v":535,"d":"535.00"},{"$f":"IF(ISNUMBER(H156),L156*H156,IF(ISNUMBER(J156),J156,IF(J156=\"RATE ONLY\",LOWER(\"RATE ONLY\"),\" \")))","v":{"v":277130,"d":"277,130.00"}}]
[]
["Item",null,"C11.6.8.3",null,null,"Size 300 x 1200mm, 2.35 mm long, 125 mm diameter timber post with Class III reflectivity","No.",16,{"$nulls":3},{"v":700,"d":"700.00"},{"$f":"IF(ISNUMBER(H158),L158*H158,IF(ISNUMBER(J158),J158,IF(J158=\"RATE ONLY\",LOWER(\"RATE ONLY\"),\" \")))","v":{"v":11200,"d":"11,200.00"}}]
[]
["IHDR1","C11.6.9",{"$nulls":3},"Installation of traffic signals:",{"$nulls":6},{"$f":"IF(ISNUMBER(H160),L160*H160,IF(ISNUMBER(J160),J160,IF(J160=\"RATE ONLY\",LOWER(\"RATE ONLY\"),\" \")))","v":" "}]
[]
["Item",null,"C11.6.9.1",null,null,"Specialist installation of traffic signals","PC sum",{"$nulls":5}," "]
["Item3",null,"C11.6.9.2",null,null,"Handling cost, profit and all other charges of sub item C11.6.9.1","%",{"$nulls":5}," "]
["IHDR1","C11.6.10",{"$nulls":3},"Disposing of road signs with a surface area of:",{"$nulls":6},{"$f":"IF(ISNUMBER(H164),L164*H164,IF(ISNUMBER(J164),J164,IF(J164=\"RATE ONLY\",LOWER(\"RATE ONLY\"),\" \")))","v":" "}]
[]
["Item",null,"C11.6.10.1",null,null,"Area 0 to 0,5 m²","m²",50,{"$nulls":3},{"v":110,"d":"110.00"},{"$f":"IF(ISNUMBER(H166),L166*H166,IF(ISNUMBER(J166),J166,IF(J166=\"RATE ONLY\",LOWER(\"RATE ONLY\"),\" \")))","v":{"v":5500,"d":"5,500.00"}}]
[]
["Item",null,"C11.6.10.2",null,null,"Area exceeding 0,5 m² but not 2,0 m²","m²",70,{"$nulls":3},{"v":120,"d":"120.00"},{"$f":"IF(ISNUMBER(H168),L168*H168,IF(ISNUMBER(J168),J168,IF(J168=\"RATE ONLY\",LOWER(\"RATE ONLY\"),\" \")))","v":{"v":8400,"d":"8,400.00"}}]
[]
["Item",null,"C11.6.10.3",null,null,"Exceeding 2,0 m² but not 10 m²","m²",100,{"$nulls":3},{"v":140,"d":"140.00"},{"$f":"IF(ISNUMBER(H170),L170*H170,IF(ISNUMBER(J170),J170,IF(J170=\"RATE ONLY\",LOWER(\"RATE ONLY\"),\" \")))","v":{"v":14000,"d":"14,000.00"}}]
[]
["Item",null,"C11.6.10.4",null,null,"Exceeding 10 m² ","m²",70,{"$nulls":3},{"v":180,"d":"180.00"},{"$f":"IF(ISNUMBER(H172),L172*H172,IF(ISNUMBER(J172),J172,IF(J172=\"RATE ONLY\",LOWER(\"RATE ONLY\"),\" \")))","v":{"v":12600,"d":"12,600.00"}}]
[]
["IHDR1","C11.6.11",{"$nulls":3},"Disposing of overhead road signs:",{"$nulls":6},{"$f":"IF(ISNUMBER(H174),L174*H174,IF(ISNUMBER(J174),J174,IF(J174=\"RATE ONLY\",LOWER(\"RATE ONLY\"),\" \")))","v":" "}]
[]
["Item",null,"C11.6.11.1",null,null,"Up to 10 m²","m²",{"$nulls":5}," "]
["Item",null,"C11.6.11.2",null,null,"Exceeding 10 m²","m²",{"$nulls":5}," "]
{"$rows_empty":29}
["#BillEnd#"]
["#BillEnd#","TOTAL CARRIED FORWARD TO SUMMARY",{"$nulls":10},{"$f":"SUBTOTAL(9,M$7:M177)","v":{"v":1732525,"d":"1,732,525.00"}}]
["#BillEnd#"]

{"sheet":"11.7","index":48,"n_rows":203,"n_cols":10,"rows_kept":203}
["#BillSheet#"]
["#BillSheet#","C11.7","ROAD MARKINGS AND ROAD STUDS",{"$nulls":3},"\n",null,null,"SCHEDULE A"]
["#BillSheet#"]
["ColHDR"]
["ColHDR","ITEM",{"$nulls":3},"DESCRIPTION","UNIT","QTY","RATE","AMT"]
["ColHDR"]
[{"$nulls":5},"ROAD MARKINGS AND ROAD STUDS"]
["IHDR1","C11.7.1",{"$nulls":3},"Road marking:"]
[]
["Item",null,"C11.7.1.1",null,null,"White lines broken or unbroken (paint type and width of line indicated)","km"]
["Item",null,"C11.7.1.2",null,null,"Yellow lines broken or unbroken (paint type and width of line indicated)","km"]
["Item",null,"C11.7.1.3",null,null,"Red lines broken or unbroken (paint type and width of line indicated)","km"]
["Item",null,"C11.7.1.4",null,null,"White lettering and symbols (paint type indicated)","m²"]
["Item",null,"C11.7.1.5",null,null,"Yellow lettering and symbols (paint type indicated)","m²"]
["Item",null,"C11.7.1.6",null,null,"Red lettering and symbols (paint type indicated)","m²"]
["Item",null,"C11.7.1.7",null,null,"Transverse lines, painted island and arrestor bed markings (any colour) (paint type indicated)","m²"]
["Item",null,"C11.7.1.8",null,null,"Labour enhanced hand painted white lines broken or unbroken (paint type and width of line indicated)","m²"]
["Item",null,"C11.7.1.9",null,null,"Labour enhanced hand painted yellow lines broken or unbroken (paint type and width of line indicated)","m²"]
["Item",null,"C11.7.1.10",null,null,"Labour enhanced hand painted red lines broken or unbroken (paint type and width of line indicated)","km"]
["Item",null,"C11.7.1.11",null,null,"Labour enhanced hand painted white lettering and symbols (paint type indicated)","m²"]
["Item",null,"C11.7.1.12",null,null,"Labour enhanced hand painted yellow lettering and symbols (paint type indicated)","m²"]
["Item",null,"C11.7.1.13",null,null,"Labour enhanced hand painted transverse lines, painted island and arrestor bed markings (any colour) (paint type indicated)","m²"]
["Item",null,"C11.7.1.14",null,null,"Labour enhanced hand painted kerb markings (any colour) (paint type indicated)","m²"]
["Item",null,"C11.7.1.15",null,null,"Labour enhanced hand operated pressure applied machine white lines broken or unbroken (paint type and width of line indicated)","km"]
["Item",null,"C11.7.1.16",null,null,"Labour enhanced hand operated pressure applied machine yellow lines broken or unbroken (paint type and width of line indicated)","km"]
["Item",null,"C11.7.1.17",null,null,"Labour enhanced hand operated pressure applied machine red lines broken or unbroken (paint type and width of line indicated)","km"]
["Item",null,"C11.7.1.18",null,null,"Labour enhanced hand operated pressure applied machine white lettering and symbols (paint type indicated)","m²"]
["Item",null,"C11.7.1.19",null,null,"Labour enhanced hand operated pressure applied machine yellow lettering and symbols (paint type indicated)","m²"]
["Item",null,"C11.7.1.20",null,null,"Labour enhanced hand operated pressure applied machine transverse lines, painted island and arrestor bed markings (any colour) (paint type indicated)","m²"]
["IHDR1","C11.7.2",{"$nulls":3},"Retro-reflective road marking:"]
[]
["IHDR2",null,"C11.7.2.1",null,null,"White lines broken or unbroken (Type 1 - water borne)"]
[]
["Item",null,null,"(a)",null,"100 mm wide","km",26.25,null,{"$f":"IF(ISNUMBER(H34),H34*I34,IF(H34=\"-\",\"rate only\",\" \"))","v":0}]
[]
["Item",null,null,"(b)",null,"150 mm wide","km",110,null,{"$f":"IF(ISNUMBER(H36),H36*I36,IF(H36=\"-\",\"rate only\",\" \"))","v":0}]
[]
["Item",null,null,"(c)",null,"200 mm wide","km",0.8,null,{"$f":"IF(ISNUMBER(H38),H38*I38,IF(H38=\"-\",\"rate only\",\" \"))","v":0}]
[]
["Item",null,null,"(d)",null,"300 mm wide","km",5.7,null,{"$f":"IF(ISNUMBER(H40),H40*I40,IF(H40=\"-\",\"rate only\",\" \"))","v":0}]
[]
["Item",null,null,"(e)",null,"500 mm wide","km",0.25,null,{"$f":"IF(ISNUMBER(H42),H42*I42,IF(H42=\"-\",\"rate only\",\" \"))","v":0}]
[]
["IHDR2",null,"C11.7.2.2",null,null,"Yellow lines broken or unbroken (Type 1 - water borne)"]
[]
["Item",null,null,"(a)",null,"100 mm wide","km",0.05,null,{"$f":"IF(ISNUMBER(H46),H46*I46,IF(H46=\"-\",\"rate only\",\" \"))","v":0}]
[]
["Item",null,null,"(b)",null,"150 mm wide","km",109.5,null,{"$f":"IF(ISNUMBER(H48),H48*I48,IF(H48=\"-\",\"rate only\",\" \"))","v":0}]
[]
["IHDR2",null,"C11.7.2.3",null,null,"Red lines broken or unbroken (Type 1 - water borne)"]
[]
["Item",null,null,"(a)",null,"150 mm wide","km",0.65,null,{"$f":"IF(ISNUMBER(H52),H52*I52,IF(H52=\"-\",\"rate only\",\" \"))","v":0}]
[]
["IHDR2",null,"C11.7.2.4",null,null,"White lettering and symbols (Type 1 - water borne)","m²",900,null,{"$f":"IF(ISNUMBER(H54),H54*I54,IF(H54=\"-\",\"rate only\",\" \"))","v":0}]
[]
["IHDR2",null,"C11.7.2.5",null,null,"Yellow lettering and symbols (Type 1 - water borne)","m²",240,null,{"$f":"IF(ISNUMBER(H56),H56*I56,IF(H56=\"-\",\"rate only\",\" \"))","v":0}]
[]
["IHDR2",null,"C11.7.2.6",null,null,"Red lettering and symbols (paint type indicated)","m²"]
[]
["IHDR2",null,"C11.7.2.7",null,null,"Transverse lines, painted island and arrestor bed markings (any colour) (Type 1 - water borne)","m²",7300,null,{"$f":"IF(ISNUMBER(H60),H60*I60,IF(H60=\"-\",\"rate only\",\" \"))","v":0}]
[]
["IHDR2",null,"C11.7.2.8",null,null,"Hand painted white lines broken or unbroken (paint type and width of line indicated)","km"]
[]
["IHDR2",null,"C11.7.2.9",null,null,"Hand painted yellow lines broken or unbroken (paint type and width of line indicated)","km"]
[]
["IHDR2",null,"C11.7.2.10",null,null,"Hand painted red lines broken or unbroken (paint type and width of line indicated)","km"]
[]
["IHDR2",null,"C11.7.2.11",null,null,"Hand painted white lettering and symbols (paint type indicated)","m²"]
[]
["IHDR2",null,"C11.7.2.12",null,null,"Hand painted yellow lettering and symbols (paint type indicated)","m²"]
[]
["IHDR2",null,"C11.7.2.13",null,null,"Hand painted transverse lines, painted island and arrestor bed markings (any colour) (paint type indicated)","m²"]
[]
["IHDR2",null,"C11.7.2.14",null,null,"Hand operated pressure applied machine white lines broken or unbroken (paint type and width of line indicated)","km"]
[]
["IHDR2",null,"C11.7.2.15",null,null,"Hand operated pressure applied machine yellow lines broken or unbroken (paint type and width of line indicated)","km"]
[]
["IHDR2",null,"C11.7.2.16",null,null,"Hand operated pressure applied machine red lines broken or unbroken (paint type and width of line indicated)","km"]
[]
["IHDR2",null,"C11.7.2.17",null,null,"Hand operated pressure applied machine white lettering and symbols (paint type indicated)","m²"]
[]
["IHDR2",null,"C11.7.2.18",null,null,"Hand operated pressure applied machine yellow lettering and symbols (paint type indicated)","m²"]
[]
["IHDR2",null,"C11.7.2.19",null,null,"Hand operated pressure applied machine transverse lines, painted island and arrestor bed markings (any colour) (paint type indicated)","m²"]
[]
["IHDR1","PC11.7.3",{"$nulls":3},"Thermoplastic road marking:"]
[]
["Item",null,"C11.7.3.1",null,null,"Thermoplastic road marking, broken or unbroken"]
["Item",null,null,"(a)",null,"100 mm (white)","km",26.25,null,{"$f":"IF(ISNUMBER(H89),H89*I89,IF(H89=\"-\",\"rate only\",\" \"))","v":0}]
[]
["Item",null,null,"(b)",null,"150 mm (white)","km",110,null,{"$f":"IF(ISNUMBER(H91),H91*I91,IF(H91=\"-\",\"rate only\",\" \"))","v":0}]
[]
["Item",null,null,"(c)",null,"200 mm (white)","km",0.8,null,{"$f":"IF(ISNUMBER(H93),H93*I93,IF(H93=\"-\",\"rate only\",\" \"))","v":0}]
[]
["Item",null,null,"(d)",null,"300 mm (white)","km",5.7,null,{"$f":"IF(ISNUMBER(H95),H95*I95,IF(H95=\"-\",\"rate only\",\" \"))","v":0}]
[]
["Item",null,null,"(e)",null,"500 mm (white)","km",0.25,null,{"$f":"IF(ISNUMBER(H97),H97*I97,IF(H97=\"-\",\"rate only\",\" \"))","v":0}]
[]
["Item",null,null,"(f)",null,"100 mm (yellow)","km",0.05,null,{"$f":"IF(ISNUMBER(H99),H99*I99,IF(H99=\"-\",\"rate only\",\" \"))","v":0}]
[]
["Item",null,null,"(g)",null,"150mm (yellow)","km",109.5,null,{"$f":"IF(ISNUMBER(H101),H101*I101,IF(H101=\"-\",\"rate only\",\" \"))","v":0}]
[]
["Item",null,null,"(h)",null,"150mm (red)","km",0.65,null,{"$f":"IF(ISNUMBER(H103),H103*I103,IF(H103=\"-\",\"rate only\",\" \"))","v":0}]
[]
["Item",null,"C11.7.3.2",null,null,"Performance based thermoplastic road marking, broken or unbroken (colour and width of line indicated)","km"]
["Item",null,"C11.7.3.3",null,null,"Reduced payment for thermoplastic road marking, white lines, broken or unbroken (width of line indicated):","km"]
["Item",null,"C11.7.3.4",null,null,"Reduced payment for thermoplastic road marking, yellow lines, broken or unbroken (width of line indicated):","km"]
["IHDR1","C11.7.4",{"$nulls":3},"Cold plastic road marking material:"]
[]
["Item",null,"C11.7.4.1",null,null,"White lettering and symbols","m²",900,null,{"$f":"IF(ISNUMBER(H110),H110*I110,IF(H110=\"-\",\"rate only\",\" \"))","v":0}]
[]
["Item",null,"C11.7.4.2",null,null,"Yellow lettering and symbols","m²",240,null,{"$f":"IF(ISNUMBER(H112),H112*I112,IF(H112=\"-\",\"rate only\",\" \"))","v":0}]
[]
["Item",null,"C11.7.4.3",null,null,"Red lettering and symbols","m²"]
["Item",null,"C11.7.4.4",null,null,"Transverse lines, painted island and arrestor bed markings (any colour)","m²",7300,null,{"$f":"IF(ISNUMBER(H115),H115*I115,IF(H115=\"-\",\"rate only\",\" \"))","v":0}]
["PB"]
["PB","CARRIED FORWARD",{"$nulls":7},{"$f":"SUM(J30:J115)","v":{"v":0,"d":"0.00"}}]
["PB"]
["PB"]
["PB","BROUGHT FORWARD",{"$nulls":7},{"$f":"J117","v":{"v":0,"d":"0.00"}}]
["PB"]
[null,"C11.7.5",{"$nulls":3},"Variations in rate of application:"]
[]
["Item",null,"C11.7.5.1",null,null,"White paint","litre","-",null,{"$f":"IF(ISNUMBER(H124),H124*I124,IF(H124=\"-\",\"rate only\",\" \"))","v":"rate only"}]
[]
["Item",null,"C11.7.5.2",null,null,"Yellow paint","litre","-",null,{"$f":"IF(ISNUMBER(H126),H126*I126,IF(H126=\"-\",\"rate only\",\" \"))","v":"rate only"}]
[]
["Item",null,"C11.7.5.3",null,null,"Red paint","litre","-",null,{"$f":"IF(ISNUMBER(H128),H128*I128,IF(H128=\"-\",\"rate only\",\" \"))","v":"rate only"}]
[]
["Item",null,"C11.7.5.4",null,null,"Retro-reflective beads","kg","-",null,{"$f":"IF(ISNUMBER(H130),H130*I130,IF(H130=\"-\",\"rate only\",\" \"))","v":"rate only"}]
[]
["Item",null,"C11.7.5.5",null,null,"Thermoplastic material, all colours","kg","-",null,{"$f":"IF(ISNUMBER(H132),H132*I132,IF(H132=\"-\",\"rate only\",\" \"))","v":"rate only"}]
[]
["Item",null,"C11.7.5.6",null,null,"Cold plastic marking material, all colours","kg","-",null,{"$f":"IF(ISNUMBER(H134),H134*I134,IF(H134=\"-\",\"rate only\",\" \"))","v":"rate only"}]
[]
["IHDR1","C11.7.6",{"$nulls":3},"Pre formed road marking tape:"]
[]
["Item",null,"C11.7.6.1",null,null,"White (specify width)","m"]
["Item",null,"C11.7.6.2",null,null,"Yellow (specify width)","m"]
["Item",null,"C11.7.6.3",null,null,"Red (specify width)","m"]
["IHDR1","C11.7.7",{"$nulls":3},"Road studs:"]
[]
["IHDR2",null,"C11.7.7.1",null,null,"Permanent road studs compliant to SANS 1442 (type & colours stated)","No."]
[]
["IHDR2",null,"C11.7.7.2",null,null,"Permanent road studs compliant to SANS 1463 "]
[]
["Item",null,null,"(a)",null,"Bi-directional, amber/red (Class RSA-1)","No.",6050,null,{"$f":"IF(ISNUMBER(H147),H147*I147,IF(H147=\"-\",\"rate only\",\" \"))","v":0}]
[]
["Item",null,null,"(b)",null,"Bi-directional, red/red (Class - RSA-2)","No.",7600,null,{"$f":"IF(ISNUMBER(H149),H149*I149,IF(H149=\"-\",\"rate only\",\" \"))","v":0}]
[]
["Item",null,null,"(c)",null,"Bi-directional, white/red (Class RSA-2)","No.",6000,null,{"$f":"IF(ISNUMBER(H151),H151*I151,IF(H151=\"-\",\"rate only\",\" \"))","v":0}]
[]
["Item"]
[]
["IHDR2",null,"C11.7.7.3",null,null,"Temporary road studs compliant to SANS 1442 or 1463 (Class RSA-T)"]
[]
["Item",null,null,"(a)",null,"Bi-directional lenses (all colour combinations)","No."]
["Item",null,null,"(b)",null,"Uni-directional lenses (all colours)","No."]
["IHDR2",null,"C11.7.7.4",null,null,"Solar powered road studs (No of LED’s & colours stated)","No."]
[]
["IHDR2",null,"C11.7.7.5",null,null,"Provision of temporary and permanent road studs","prov sum"]
[]
["Item3",null,"C11.7.7.6",null,null,"Handling cost, profit and all other charges of sub item C11.7.7.5","%"]
["IHDR2",null,"C11.7.7.7",null,null,"Installation only of surface bonded road studs with anchor shanks","No."]
[]
["IHDR2",null,"C11.7.7.8",null,null,"Installation only of surface bonded road studs without anchor shanks","No."]
[]
["IHDR2",null,"C11.7.7.9",null,null,"Installation only of embedded glass road studs","No."]
[]
["IHDR2",null,"C11.7.7.10",null,null,"Installation only of temporary stick on road studs (including removal)","No."]
[]
["IHDR1","C11.7.8",{"$nulls":3},"Setting out and premarking the lines (excluding traffic island markings, lettering and symbols)","km",350,null,{"$f":"IF(ISNUMBER(H172),H172*I172,IF(H172=\"-\",\"rate only\",\" \"))","v":0}]
[]
["IHDR1","C11.7.9",{"$nulls":3},"Re-establishing the painting unit during the defects notification period and at other instances on instruction of the Engineer","No.",1,null,{"$f":"IF(ISNUMBER(H174),H174*I174,IF(H174=\"-\",\"rate only\",\" \"))","v":0}]
[]
["IHDR1","C11.7.10",{"$nulls":3},"Removal of existing, temporary or final road markings by:"]
[]
["Item",null,"C11.7.10.1",null,null,"Sandblasting","m²"]
["Item",null,"C11.7.10.2",null,null,"Water-jetting","m²"]
["Item",null,"C11.7.10.3",null,null,"Overpainting as temporary measure","m²"]
["IHDR1","C11.7.11",{"$nulls":3},"Removal of existing road studs","No.",18000,null,{"$f":"IF(ISNUMBER(H181),H181*I181,IF(H181=\"-\",\"rate only\",\" \"))","v":0}]
{"$rows_empty":19}
["#BillEnd#"]
["#BillEnd#","TOTAL CARRIED FORWARD TO SUMMARY",{"$nulls":7},{"$f":"SUM(J119:J200)","v":{"v":0,"d":"0.00"}}]
["#BillEnd#"]

{"sheet":"11.8","index":49,"n_rows":178,"n_cols":13,"rows_kept":178,"hidden":true}
["#BillSheet#"]
["#BillSheet#","C11.8","LANDSCAPING AND PLANTING PLANTS",{"$nulls":3},"\n",null,null,"SCHEDULE A",{"$f":"SUBTOTAL(9,M$7:M1159)","v":{"v":19331516,"d":"19,331,516.00"}},null,{"$f":"J2","v":"SCHEDULE A"}]
["#BillSheet#"]
["ColHDR"]
["ColHDR","ITEM",{"$nulls":3},"DESCRIPTION","UNIT","QTY","RATE","AMT",null,"RATE","AMOUNT"]
["ColHDR"]
[{"$nulls":5},"LANDSCAPING AND PLANTING PLANTS"]
["IHDR1","C11.8.1",{"$nulls":3},"Trimming:",{"$nulls":6},{"$f":"IF(ISNUMBER(H8),L8*H8,IF(ISNUMBER(J8),J8,IF(J8=\"RATE ONLY\",LOWER(\"RATE ONLY\"),\" \")))","v":" "}]
[]
["item",null,"C11.8.1.1",null,null,"Machine trimming","m²",1300,{"$nulls":3},1.75,{"$f":"IF(ISNUMBER(H10),L10*H10,IF(ISNUMBER(J10),J10,IF(J10=\"RATE ONLY\",LOWER(\"RATE ONLY\"),\" \")))","v":{"v":2275,"d":"2,275.00"}}]
[]
["item",null,"C11.8.1.2",null,null,"Hand trimming","m²",4500,{"$nulls":3},{"v":3.1,"d":"3.10"},{"$f":"IF(ISNUMBER(H12),L12*H12,IF(ISNUMBER(J12),J12,IF(J12=\"RATE ONLY\",LOWER(\"RATE ONLY\"),\" \")))","v":{"v":13950,"d":"13,950.00"}}]
[]
["IHDR1","C11.8.2",{"$nulls":3},"Trimming using machines for trimming or shaping (alternative to subitem C11.8.1.1):",{"$nulls":6},{"$f":"IF(ISNUMBER(H14),L14*H14,IF(ISNUMBER(J14),J14,IF(J14=\"RATE ONLY\",LOWER(\"RATE ONLY\"),\" \")))","v":" "}]
[]
["item",null,"C11.8.2.1",null,null,"Bulldozer","hour",{"$nulls":5},{"$f":"IF(ISNUMBER(H16),L16*H16,IF(ISNUMBER(J16),J16,IF(J16=\"RATE ONLY\",LOWER(\"RATE ONLY\"),\" \")))","v":" "}]
["item",null,"C11.8.2.2",null,null,"Motor grader","hour",{"$nulls":5}," "]
["IHDR1","C11.8.3",{"$nulls":3},"Preparing the areas for grassing:",{"$nulls":6},{"$f":"IF(ISNUMBER(H18),L18*H18,IF(ISNUMBER(J18),J18,IF(J18=\"RATE ONLY\",LOWER(\"RATE ONLY\"),\" \")))","v":" "}]
[]
["IHDR2",null,"C11.8.3.1",null,null,"Ripping","ha",5,{"$nulls":3},{"v":2670,"d":"2,670.00"},{"$f":"IF(ISNUMBER(H20),L20*H20,IF(ISNUMBER(J20),J20,IF(J20=\"RATE ONLY\",LOWER(\"RATE ONLY\"),\" \")))","v":{"v":13350,"d":"13,350.00"}}]
[]
["IHDR2",null,"C11.8.3.2",null,null,"Scarifying for loosening topsoil","ha",140,{"$nulls":3},{"v":2490,"d":"2,490.00"},{"$f":"IF(ISNUMBER(H22),L22*H22,IF(ISNUMBER(J22),J22,IF(J22=\"RATE ONLY\",LOWER(\"RATE ONLY\"),\" \")))","v":{"v":348600,"d":"348,600.00"}}]
[]
["IHDR2",null,"C11.8.3.3",null,null,"Topsoiling within the road reserve where the following materials are used:",{"$nulls":6},{"$f":"IF(ISNUMBER(H24),L24*H24,IF(ISNUMBER(J24),J24,IF(J24=\"RATE ONLY\",LOWER(\"RATE ONLY\"),\" \")))","v":" "}]
[]
["Item",null,null,"(a)",null,"Topsoil obtained from within the road reserve or borrow areas","m³",31350,{"$nulls":3},{"v":65,"d":"65.00"},{"$f":"IF(ISNUMBER(H26),L26*H26,IF(ISNUMBER(J26),J26,IF(J26=\"RATE ONLY\",LOWER(\"RATE ONLY\"),\" \")))","v":{"v":2037750,"d":"2,037,750.00"}}]
[]
["Item",null,null,"(b)",null,"Topsoil obtained from commercial sources by the Contractor","m³",200,{"$nulls":3},{"v":155,"d":"155.00"},{"$f":"IF(ISNUMBER(H28),L28*H28,IF(ISNUMBER(J28),J28,IF(J28=\"RATE ONLY\",LOWER(\"RATE ONLY\"),\" \")))","v":{"v":31000,"d":"31,000.00"}}]
[]
["IHDR2",null,"C11.8.3.4",null,null,"Topsoiling of borrowpits by using topsoil obtained from borrow areas or from the road reserve","m³",200800,{"$nulls":3},{"v":45,"d":"45.00"},{"$f":"IF(ISNUMBER(H30),L30*H30,IF(ISNUMBER(J30),J30,IF(J30=\"RATE ONLY\",LOWER(\"RATE ONLY\"),\" \")))","v":{"v":9036000,"d":"9,036,000.00"}}]
[]
["IHDR2",null,"C11.8.3.5",null,null,"Providing and applying chemical fertilisers and/or soil-improvement material:",{"$nulls":6},{"$f":"IF(ISNUMBER(H32),L32*H32,IF(ISNUMBER(J32),J32,IF(J32=\"RATE ONLY\",LOWER(\"RATE ONLY\"),\" \")))","v":" "}]
[]
["Item",null,null,"(a)",null,"Lime","t",44,{"$nulls":3},{"v":945,"d":"945.00"},{"$f":"IF(ISNUMBER(H34),L34*H34,IF(ISNUMBER(J34),J34,IF(J34=\"RATE ONLY\",LOWER(\"RATE ONLY\"),\" \")))","v":{"v":41580,"d":"41,580.00"}}]
[]
["Item",null,null,"(b)",null,"Superphosphate","t",44,{"$nulls":3},{"v":5000,"d":"5,000.00"},{"$f":"IF(ISNUMBER(H36),L36*H36,IF(ISNUMBER(J36),J36,IF(J36=\"RATE ONLY\",LOWER(\"RATE ONLY\"),\" \")))","v":{"v":220000,"d":"220,000.00"}}]
[]
["Item",null,null,"(c)",null,"Limestone ammonium nitrate","t",15,{"$nulls":3},{"v":4700,"d":"4,700.00"},{"$f":"IF(ISNUMBER(H38),L38*H38,IF(ISNUMBER(J38),J38,IF(J38=\"RATE ONLY\",LOWER(\"RATE ONLY\"),\" \")))","v":{"v":70500,"d":"70,500.00"}}]
[]
["Item",null,null,"(d)",null,"2:3:2 (22)","t",22,{"$nulls":3},{"v":4250,"d":"4,250.00"},{"$f":"IF(ISNUMBER(H40),L40*H40,IF(ISNUMBER(J40),J40,IF(J40=\"RATE ONLY\",LOWER(\"RATE ONLY\"),\" \")))","v":{"v":93500,"d":"93,500.00"}}]
[]
["Item",null,null,"(e)",null,"3:2:1 (25)","t",22,{"$nulls":3},{"v":5450,"d":"5,450.00"},{"$f":"IF(ISNUMBER(H42),L42*H42,IF(ISNUMBER(J42),J42,IF(J42=\"RATE ONLY\",LOWER(\"RATE ONLY\"),\" \")))","v":{"v":119900,"d":"119,900.00"}}]
[]
["Item",null,null,"(f)",null,"Monophosphate","t",22,{"$nulls":3},{"v":6150,"d":"6,150.00"},{"$f":"IF(ISNUMBER(H44),L44*H44,IF(ISNUMBER(J44),J44,IF(J44=\"RATE ONLY\",LOWER(\"RATE ONLY\"),\" \")))","v":{"v":135300,"d":"135,300.00"}}]
[]
["Item",null,null,"(g)",null,"Ureum","t",7,{"$nulls":3},{"v":5900,"d":"5,900.00"},{"$f":"IF(ISNUMBER(H46),L46*H46,IF(ISNUMBER(J46),J46,IF(J46=\"RATE ONLY\",LOWER(\"RATE ONLY\"),\" \")))","v":{"v":41300,"d":"41,300.00"}}]
[]
["Item",null,null,"(h)",null,"Potassium chloride (50)","t",5,{"$nulls":3},{"v":5900,"d":"5,900.00"},{"$f":"IF(ISNUMBER(H48),L48*H48,IF(ISNUMBER(J48),J48,IF(J48=\"RATE ONLY\",LOWER(\"RATE ONLY\"),\" \")))","v":{"v":29500,"d":"29,500.00"}}]
[]
["IHDR1","C11.8.4",{"$nulls":3},"Grassing:",{"$nulls":6},{"$f":"IF(ISNUMBER(H50),L50*H50,IF(ISNUMBER(J50),J50,IF(J50=\"RATE ONLY\",LOWER(\"RATE ONLY\"),\" \")))","v":" "}]
[]
["IHDR2",null,"C11.8.4.1",null,null,"The planting of grass cuttings (type of grass indicated)","ha",{"$nulls":5},{"$f":"IF(ISNUMBER(H52),L52*H52,IF(ISNUMBER(J52),J52,IF(J52=\"RATE ONLY\",LOWER(\"RATE ONLY\"),\" \")))","v":" "}]
[]
["IHDR2",null,"C11.8.4.2",null,null,"Sodding by using the following types of sods:",{"$nulls":6},{"$f":"IF(ISNUMBER(H54),L54*H54,IF(ISNUMBER(J54),J54,IF(J54=\"RATE ONLY\",LOWER(\"RATE ONLY\"),\" \")))","v":" "}]
[]
["Item",null,null,"(a)",null,"Nursery sods (Kikuyu)","m²",50500,{"$nulls":3},{"v":29.5,"d":"29.50"},{"$f":"IF(ISNUMBER(H56),L56*H56,IF(ISNUMBER(J56),J56,IF(J56=\"RATE ONLY\",LOWER(\"RATE ONLY\"),\" \")))","v":{"v":1489750,"d":"1,489,750.00"}}]
[]
["Item",null,null,"(b)",null,"Veld sods","m²",230,{"$nulls":3},{"v":21.2,"d":"21.20"},{"$f":"IF(ISNUMBER(H58),L58*H58,IF(ISNUMBER(J58),J58,IF(J58=\"RATE ONLY\",LOWER(\"RATE ONLY\"),\" \")))","v":{"v":4876,"d":"4,876.00"}}]
[]
["PB"]
["PB","CARRIED FORWARD",{"$nulls":10},{"$f":"SUBTOTAL(9,M$7:M59)","v":{"v":13729131,"d":"13,729,131.00"}}]
["PB"]
["PB"]
["PB","BROUGHT FORWARD",{"$nulls":10},{"$f":"SUBTOTAL(9,M$7:M62)","v":{"v":13729131,"d":"13,729,131.00"}}]
["PB"]
["IHDR2",null,"C11.8.4.3",null,null,"Hydroseeding:",{"$nulls":6},{"$f":"IF(ISNUMBER(H66),L66*H66,IF(ISNUMBER(J66),J66,IF(J66=\"RATE ONLY\",LOWER(\"RATE ONLY\"),\" \")))","v":" "}]
[]
["Item",null,null,"(a)",null,"Providing an approved seed mixture for hydroseeding","kg",5900,{"$nulls":3},{"v":85,"d":"85.00"},{"$f":"IF(ISNUMBER(H68),L68*H68,IF(ISNUMBER(J68),J68,IF(J68=\"RATE ONLY\",LOWER(\"RATE ONLY\"),\" \")))","v":{"v":501500,"d":"501,500.00"}}]
[]
["Item",null,null,"(b)",null,"Providing an approved mulch","kg",5900,{"$nulls":3},{"v":4,"d":"4.00"},{"$f":"IF(ISNUMBER(H70),L70*H70,IF(ISNUMBER(J70),J70,IF(J70=\"RATE ONLY\",LOWER(\"RATE ONLY\"),\" \")))","v":{"v":23600,"d":"23,600.00"}}]
[]
["Item",null,null,"(c)",null,"Hydroseeding","ha",140,{"$nulls":3},{"v":2940,"d":"2,940.00"},{"$f":"IF(ISNUMBER(H72),L72*H72,IF(ISNUMBER(J72),J72,IF(J72=\"RATE ONLY\",LOWER(\"RATE ONLY\"),\" \")))","v":{"v":411600,"d":"411,600.00"}}]
[]
["IHDR2",null,"C11.8.4.4",null,null,"Planting grass seed with an approved grass-planting machine","ha",{"$nulls":5},{"$f":"IF(ISNUMBER(H74),L74*H74,IF(ISNUMBER(J74),J74,IF(J74=\"RATE ONLY\",LOWER(\"RATE ONLY\"),\" \")))","v":" "}]
[]
["IHDR2",null,"C11.8.4.5",null,null,"Hand sowing","m²",1000,{"$nulls":3},{"v":2.4,"d":"2.40"},{"$f":"IF(ISNUMBER(H76),L76*H76,IF(ISNUMBER(J76),J76,IF(J76=\"RATE ONLY\",LOWER(\"RATE ONLY\"),\" \")))","v":{"v":2400,"d":"2,400.00"}}]
[]
["IHDR2",null,"C11.8.4.6",null,null,"Other methods (specify)",{"$nulls":6},{"$f":"IF(ISNUMBER(H78),L78*H78,IF(ISNUMBER(J78),J78,IF(J78=\"RATE ONLY\",LOWER(\"RATE ONLY\"),\" \")))","v":" "}]
[]
["IHDR1","C11.8.5",{"$nulls":3},"Watering the grass when established by topsoiling only","kilolitre",1700,{"$nulls":3},{"v":40,"d":"40.00"},{"$f":"IF(ISNUMBER(H80),L80*H80,IF(ISNUMBER(J80),J80,IF(J80=\"RATE ONLY\",LOWER(\"RATE ONLY\"),\" \")))","v":{"v":68000,"d":"68,000.00"}}]
[]
["IHDR1","C11.8.6",{"$nulls":3},"Watering the already planted grass, trees and shrubs during the growing season","kilolitre",300,{"$nulls":3},{"v":40,"d":"40.00"},{"$f":"IF(ISNUMBER(H82),L82*H82,IF(ISNUMBER(J82),J82,IF(J82=\"RATE ONLY\",LOWER(\"RATE ONLY\"),\" \")))","v":{"v":12000,"d":"12,000.00"}}]
[]
["IHDR1","C11.8.7",{"$nulls":3},"Mowing the grass","ha",18,{"$nulls":3},{"v":3470,"d":"3,470.00"},{"$f":"IF(ISNUMBER(H84),L84*H84,IF(ISNUMBER(J84),J84,IF(J84=\"RATE ONLY\",LOWER(\"RATE ONLY\"),\" \")))","v":{"v":62460,"d":"62,460.00"}}]
[]
["IHDR1","C11.8.8",{"$nulls":3},"Anti-erosion compound or hydraulic mulches:",{"$nulls":6},{"$f":"IF(ISNUMBER(H86),L86*H86,IF(ISNUMBER(J86),J86,IF(J86=\"RATE ONLY\",LOWER(\"RATE ONLY\"),\" \")))","v":" "}]
[]
["item",null,"C11.8.8.1",null,null,"Earthbound or similar approved","kg",4600,{"$nulls":3},{"v":4.5,"d":"4.50"},{"$f":"IF(ISNUMBER(H88),L88*H88,IF(ISNUMBER(J88),J88,IF(J88=\"RATE ONLY\",LOWER(\"RATE ONLY\"),\" \")))","v":{"v":20700,"d":"20,700.00"}}]
[]
["IHDR1","C11.8.9",{"$nulls":3},"Trees and shrubs:",{"$nulls":6},{"$f":"IF(ISNUMBER(H90),L90*H90,IF(ISNUMBER(J90),J90,IF(J90=\"RATE ONLY\",LOWER(\"RATE ONLY\"),\" \")))","v":" "}]
[]
["IHDR2",null,"C11.8.9.1",null,null,"Providing trees and shrubs:",{"$nulls":6},{"$f":"IF(ISNUMBER(H92),L92*H92,IF(ISNUMBER(J92),J92,IF(J92=\"RATE ONLY\",LOWER(\"RATE ONLY\"),\" \")))","v":" "}]
[]
["Item",null,null,"(a)",null,"Trees (types and size/mass indicated)","No.",{"$nulls":5},{"$f":"IF(ISNUMBER(H94),L94*H94,IF(ISNUMBER(J94),J94,IF(J94=\"RATE ONLY\",LOWER(\"RATE ONLY\"),\" \")))","v":" "}]
["Item",null,null,"(b)",null,"Shrubs (types and size/mass indicated)","No.",{"$nulls":5},{"$f":"IF(ISNUMBER(H95),L95*H95,IF(ISNUMBER(J95),J95,IF(J95=\"RATE ONLY\",LOWER(\"RATE ONLY\"),\" \")))","v":" "}]
["IHDR2",null,"C11.8.9.2",null,null,"Planting and establishing:",{"$nulls":6},{"$f":"IF(ISNUMBER(H96),L96*H96,IF(ISNUMBER(J96),J96,IF(J96=\"RATE ONLY\",LOWER(\"RATE ONLY\"),\" \")))","v":" "}]
[]
["Item",null,null,"(a)",null,"Trees, all types and sizes","No.",{"$nulls":5},{"$f":"IF(ISNUMBER(H98),L98*H98,IF(ISNUMBER(J98),J98,IF(J98=\"RATE ONLY\",LOWER(\"RATE ONLY\"),\" \")))","v":" "}]
["Item",null,null,"(b)",null,"Shrubs, all types and sizes","No.",{"$nulls":5},{"$f":"IF(ISNUMBER(H99),L99*H99,IF(ISNUMBER(J99),J99,IF(J99=\"RATE ONLY\",LOWER(\"RATE ONLY\"),\" \")))","v":" "}]
["IHDR1","C11.8.10",{"$nulls":3},"Unspecified work for landscaping","prov sum",1,{"v":50000,"d":"50,000.00"},{"$f":"H100*I100","v":{"v":50000,"d":"50,000.00"}},null,{"v":50000,"d":"50,000.00"},{"$f":"IF(ISNUMBER(H100),L100*H100,IF(ISNUMBER(J100),J100,IF(J100=\"RATE ONLY\",LOWER(\"RATE ONLY\"),\" \")))","v":{"v":50000,"d":"50,000.00"}}]
[]
["IHDR1","C11.8.11",{"$nulls":3},"Weeding all grass-seeded areas and the grass when established by topsoiling only","ha",30,{"$nulls":3},{"v":4250,"d":"4,250.00"},{"$f":"IF(ISNUMBER(H102),L102*H102,IF(ISNUMBER(J102),J102,IF(J102=\"RATE ONLY\",LOWER(\"RATE ONLY\"),\" \")))","v":{"v":127500,"d":"127,500.00"}}]
[]
["IHDR1","C11.8.12",{"$nulls":3},"Removal of undesirable vegetation","m²",50,{"$nulls":3},{"v":50,"d":"50.00"},{"$f":"IF(ISNUMBER(H104),L104*H104,IF(ISNUMBER(J104),J104,IF(J104=\"RATE ONLY\",LOWER(\"RATE ONLY\"),\" \")))","v":{"v":2500,"d":"2,500.00"}}]
[]
["IHDR","C11.8/ C1.6",{"$nulls":3},"CLEARING AND GRUBBING",{"$nulls":6},{"$f":"IF(ISNUMBER(H106),L106*H106,IF(ISNUMBER(J106),J106,IF(J106=\"RATE ONLY\",LOWER(\"RATE ONLY\"),\" \")))","v":" "}]
[]
["IHDR1",null,"C1.6.9",null,null,"Conservation of topsoil:",{"$nulls":6},{"$f":"IF(ISNUMBER(H108),L108*H108,IF(ISNUMBER(J108),J108,IF(J108=\"RATE ONLY\",LOWER(\"RATE ONLY\"),\" \")))","v":" "}]
[]
["item",null,"C1.6.9.1",null,null,"Stockpiling topsoil","m³",31350,{"$nulls":3},{"v":22,"d":"22.00"},{"$f":"IF(ISNUMBER(H110),L110*H110,IF(ISNUMBER(J110),J110,IF(J110=\"RATE ONLY\",LOWER(\"RATE ONLY\"),\" \")))","v":{"v":689700,"d":"689,700.00"}}]
[]
["item",null,"C1.6.9.2",null,null,"Windrowing topsoil","m³",200800,{"$nulls":3},{"v":13.5,"d":"13.50"},{"$f":"IF(ISNUMBER(H112),L112*H112,IF(ISNUMBER(J112),J112,IF(J112=\"RATE ONLY\",LOWER(\"RATE ONLY\"),\" \")))","v":{"v":2710800,"d":"2,710,800.00"}}]
[]
["IHDR","C11.8/ C1.7",{"$nulls":3},"LOADING AND HAULING",{"$nulls":6},{"$f":"IF(ISNUMBER(H114),L114*H114,IF(ISNUMBER(J114),J114,IF(J114=\"RATE ONLY\",LOWER(\"RATE ONLY\"),\" \")))","v":" "}]
[]
["IHDR1",null,"C1.7.1",null,null,"Loading",{"$nulls":6},{"$f":"IF(ISNUMBER(H116),L116*H116,IF(ISNUMBER(J116),J116,IF(J116=\"RATE ONLY\",LOWER(\"RATE ONLY\"),\" \")))","v":" "}]
[]
["Item",null,"C1.7.1.1",null,null,"Loading from stockpile using machines and some hand labour where necessary","m³",31250,{"$nulls":3},{"v":2.5,"d":"2.50"},{"$f":"IF(ISNUMBER(H118),L118*H118,IF(ISNUMBER(J118),J118,IF(J118=\"RATE ONLY\",LOWER(\"RATE ONLY\"),\" \")))","v":{"v":78125,"d":"78,125.00"}}]
[]
["IHDR1",null,"C1.7.2",null,null,"Hauling",{"$nulls":6},{"$f":"IF(ISNUMBER(H120),L120*H120,IF(ISNUMBER(J120),J120,IF(J120=\"RATE ONLY\",LOWER(\"RATE ONLY\"),\" \")))","v":" "}]
["PB"]
["PB","CARRIED FORWARD",{"$nulls":10},{"$f":"SUBTOTAL(9,M$7:M120)","v":{"v":18490016,"d":"18,490,016.00"}}]
["PB"]
["PB"]
["PB","BROUGHT FORWARD",{"$nulls":10},{"$f":"SUBTOTAL(9,M$7:M123)","v":{"v":18490016,"d":"18,490,016.00"}}]
["PB"]
[]
["IHDR2",null,"C1.7.2.1",null,null,"Hauling material for use in the Works and off-loading it on the site of the Works:",{"$nulls":6},{"$f":"IF(ISNUMBER(H128),L128*H128,IF(ISNUMBER(J128),J128,IF(J128=\"RATE ONLY\",LOWER(\"RATE ONLY\"),\" \")))","v":" "}]
[]
["Item",null,null,"(a)",null,"Soil, gravel, crushed stone and pavement layer material","m³-km",187000,{"$nulls":3},{"v":4.5,"d":"4.50"},{"$f":"IF(ISNUMBER(H130),L130*H130,IF(ISNUMBER(J130),J130,IF(J130=\"RATE ONLY\",LOWER(\"RATE ONLY\"),\" \")))","v":{"v":841500,"d":"841,500.00"}}]
[]
["IHDR2",null,"C1.7.2.2",null,null,"Hauling material to spoil and off-loading it at a designated spoil or stockpile area:",{"$nulls":6},{"$f":"IF(ISNUMBER(H132),L132*H132,IF(ISNUMBER(J132),J132,IF(J132=\"RATE ONLY\",LOWER(\"RATE ONLY\"),\" \")))","v":" "}]
[]
["Item",null,null,"(b)",null,"Soil and gravel material","m³-km",{"$nulls":5},{"$f":"IF(ISNUMBER(H134),L134*H134,IF(ISNUMBER(J134),J134,IF(J134=\"RATE ONLY\",LOWER(\"RATE ONLY\"),\" \")))","v":" "}]
{"$rows_empty":41}
["#BillEnd#"]
["#BillEnd#","TOTAL CARRIED FORWARD TO SUMMARY",{"$nulls":10},{"$f":"SUBTOTAL(9,M$7:M134)","v":{"v":19331516,"d":"19,331,516.00"}}]
["#BillEnd#"]

{"sheet":"11.9","index":50,"n_rows":86,"n_cols":10,"rows_kept":86}
["#BillSheet#"]
["#BillSheet#","C11.9","FINISHING THE ROAD AND ROAD RESERVE AND TREATING OLD ROADS",{"$nulls":6},"SCHEDULE A"]
["#BillSheet#"]
["ColHDR"]
["ColHDR","ITEM",{"$nulls":3},"DESCRIPTION","UNIT","QTY","RATE","AMT"]
["ColHDR"]
[{"$nulls":5},"FINISHING THE ROAD AND ROAD RESERVE AND TREATING OLD ROADS"]
["IHDR1","C11.9.1",{"$nulls":3},"Finishing the road and road reserve:"]
[]
["IHDR2",null,"C11.9.1.1",null,null,"Dual carriageway road","km",32,null,{"$f":"IF(ISNUMBER(H10),H10*I10,IF(H10=\"-\",\"rate only\",\" \"))","v":0}]
[]
["IHDR2",null,"C11.9.1.2",null,null,"Single carriageway road","km",27.5,null,{"$f":"IF(ISNUMBER(H12),H12*I12,IF(H12=\"-\",\"rate only\",\" \"))","v":0}]
[]
["item"]
[]
["item",null,null,"(b)",null,"Gravel roads (including service and access roads)","km"]
["IHDR1","C11.9.2",{"$nulls":3},"Treatment of old roads and temporary deviations:"]
[]
["IHDR2",null,"PC11.9.2.1",null,null,"Conventional construction methods"]
[]
["item",null,null,"(a)",null,"Roads with bituminous surfacing","km"]
["item",null,null,"(b)",null,"Gravel roads (including service and access roads)","km"]
["IHDR2",null,"C11.9.2.2",null,null,"By hand only","km"]
[]
["IHDR1","PC11.9.3",{"$nulls":3},"Provision of rest area shelters, furniture and platforms as indicated on the typical drawings"]
[]
["item",null,"PC11.9.3.1",null,null,"Table 1200 mm diameter","No."]
["item",null,"PC11.9.3.2",null,null,"Stool 400 mm diameter","No."]
["item",null,"PC11.9.3.3",null,null,"Refuse bin consisting of empty 210 ℓ drum mounted on hinges between two points","No."]
["item",null,"PC11.9.3.4",null,null,"Brick paving 100 mm thick constructed in a 3.2 m diameter circle around each table","m²"]
{"$rows_empty":53}
["#BillEnd#"]
["#BillEnd#","TOTAL CARRIED FORWARD TO SUMMARY",{"$nulls":7},{"$f":"SUM(J8:J83)","v":{"v":0,"d":"0.00"}}]
["#BillEnd#"]

{"sheet":"12.1","index":51,"n_rows":79,"n_cols":13,"rows_kept":79,"hidden":true}
["#BillSheet#"]
["#BillSheet#","C12.1","PILING",{"$nulls":3},"\n",null,null,"SCHEDULE A",{"$f":"SUBTOTAL(9,M$7:M1032)","v":0},null,{"$f":"J2","v":"SCHEDULE A"}]
["#BillSheet#"]
["ColHDR"]
["ColHDR","ITEM",{"$nulls":3},"DESCRIPTION","UNIT","QTY","RATE","AMT",null,"RATE","AMOUNT"]
["ColHDR"]
[{"$nulls":5},"PILING"]
["IHDR1","C12.1.1",{"$nulls":3},"Additional foundation investigations","prov sum",{"$nulls":5},{"$f":"IF(ISNUMBER(H8),L8*H8,IF(ISNUMBER(J8),J8,IF(J8=\"RATE ONLY\",LOWER(\"RATE ONLY\"),\" \")))","v":" "}]
["IHDR1","C12.1.2",{"$nulls":3},"Access and drainage:",{"$nulls":6}," "]
["Item",null,"C12.1.2.1",null,null,"Access","lump sum",{"$nulls":5}," "]
["Item",null,"C12.1.2.2",null,null,"Drainage by pumping or other means","lump sum",{"$nulls":5}," "]
["IHDR1","C12.1.3",{"$nulls":3},"Establishment on site for piling (piling location and type indicated)","lump sum",{"$nulls":5}," "]
["IHDR1","C12.1.4",{"$nulls":3},"Moving to, and setting up equipment at each position for installing piles (pile type indicated)","No.",{"$nulls":5}," "]
["IHDR1","C12.1.5",{"$nulls":3},"Augered or bored holes (type specified) for piles with a diameter of (diameter indicated) through material situated within the following successive depth ranges:",{"$nulls":6}," "]
["IHDR2",null,"C12.1.5.1",null,null,"Augered holes:",{"$nulls":6}," "]
["Item",null,null,"(a)",null,"0 m up to 10 m provided for in pay item C12.1.6","m",{"$nulls":5}," "]
["Item",null,null,"(b)",null,"Exceeding 10 m and up to 15 m","m",{"$nulls":5}," "]
["Item",null,null,"(c)",null,"Etc in increments of 5,0 m depths","m",{"$nulls":5}," "]
["IHDR2",null,"C12.1.5.2",null,null,"Bored piles:",{"$nulls":6}," "]
["Item",null,null,"(a)",null,"0 m up to 10 m","m",{"$nulls":5}," "]
["Item",null,null,"(b)",null,"Exceeding 10 m and up to 15 m","m",{"$nulls":5}," "]
["Item",null,null,"(c)",null,"Etc in increments of 5,0 m depths","m",{"$nulls":5}," "]
["IHDR1","C12.1.6",{"$nulls":3},"Extra over item C12.1.5 irrespective of the depth, to form augered and bored pile holes through identified materials consisting of:",{"$nulls":6}," "]
["Item",null,"C12.1.6.1",null,null,"Coarse gravel with a matrix content of less than (max. percentage indicated)","m",{"$nulls":5}," "]
["Item",null,"C12.1.6.2",null,null,"Boulders (description of and maximum size indicated)","m",{"$nulls":5}," "]
["Item",null,"C12.1.6.3",null,null,"Rock formation (description and class of rock indicated)","m",{"$nulls":5}," "]
["IHDR1","C12.1.7",{"$nulls":3},"Driving temporary casing for driven displacement piling systems (system indicated) for forming holes for piles with a diameter of (diameter indicated) through material situated within the following successive depth ranges:",{"$nulls":6}," "]
["Item",null,"C12.1.7.1",null,null,"0 m up to 10 m","m",{"$nulls":5}," "]
["Item",null,"C12.1.7.2",null,null,"Exceeding 10 m and up to 15 m","m",{"$nulls":5}," "]
["Item",null,"C12.1.7.3",null,null,"Etc in increments of 5,0 m depths","m",{"$nulls":5}," "]
["IHDR1","C12.1.8",{"$nulls":3},"Forming augered or bored pile holes through unidentified materials","prov sum",{"$nulls":5}," "]
["IHDR1","C12.1.9",{"$nulls":3},"Forming augered or bored pile holes through obstructions","prov sum",{"$nulls":5}," "]
["IHDR1","C12.1.10",{"$nulls":3},"Provision for and maintenance of bentonite head for underslurry piles","lump sum",{"$nulls":5}," "]
["IHDR1","C12.1.11",{"$nulls":3},"Installing and removing temporary casings in augered holes for piles of (diameter indicated)","m",{"$nulls":5}," "]
["IHDR1","C12.1.12",{"$nulls":3},"Installing permanent pile casing for piles of (diameter and pile type indicated)","m",{"$nulls":5}," "]
["IHDR1","C12.1.13",{"$nulls":3},"Extra over items C12.1.5 and C12.1.7 for raking of piles:",{"$nulls":6}," "]
["Item",null,"C12.1.13.1",null,null,"Holes for piles of (diameter and rake indicated)","m",{"$nulls":5}," "]
["Item",null,"C12.1.13.2",null,null,"Temporary casing for driven displacement pile systems (diameter and rake indicated)","m",{"$nulls":5}," "]
["IHDR1","C12.1.14",{"$nulls":3},"Forming bulbous bases for piles of (diameter indicated)","No.",{"$nulls":5}," "]
["IHDR1","C12.1.15",{"$nulls":3},"Steel reinforcement in cast in situ piles:",{"$nulls":6},{"$f":"IF(ISNUMBER(H40),L40*H40,IF(ISNUMBER(J40),J40,IF(J40=\"RATE ONLY\",LOWER(\"RATE ONLY\"),\" \")))","v":" "}]
["Item",null,"C12.1.15.1",null,null,"Mild-steel bars (type indicated)","t",{"$nulls":5}," "]
["Item",null,"C12.1.15.2",null,null,"High-yield-stress-steel bars (type indicated)","t",{"$nulls":5}," "]
["IHDR1","C12.1.16",{"$nulls":3},"Cast in situ concrete in piles, underreams, bulbous bases and sockets (class of concrete indicated)","m³",{"$nulls":5}," "]
["IHDR1","C12.1.17",{"$nulls":3},"Extra over item C12.1.16 for concrete cast underwater","m³",{"$nulls":5}," "]
["IHDR1","C12.1.18",{"$nulls":3},"Manufacturing, supplying and delivering prefabricated piles (type and size indicated)","m",{"$nulls":5}," "]
["IHDR1","C12.1.19",{"$nulls":3},"Installation of prefabricated piles (type and size indicated) through material situated within the following successive depth ranges:",{"$nulls":6}," "]
["Item",null,"C12.1.19.1",null,null,"0 m up to 10 m","m",{"$nulls":5}," "]
["Item",null,"C12.1.19.2",null,null,"Exceeding 10 m and up to 15 m","m",{"$nulls":5}," "]
["Item",null,"C12.1.19.3",null,null,"Etc in increments of 5,0 m depths","m",{"$nulls":5}," "]
["IHDR1","C12.1.20",{"$nulls":3},"Installation of self-drilling micropiles (size indicated) through material situated within the following successive depth ranges:",{"$nulls":6}," "]
["Item",null,"C12.1.20.1",null,null,"0 m up to 9,0 m","m",{"$nulls":5}," "]
["Item",null,"C12.1.20.2",null,null,"Exceeding 9,0 m and up to 15 m","m",{"$nulls":5}," "]
["Item",null,"C12.1.20.3",null,null,"Etc in increments of 3,0 m depths","m",{"$nulls":5}," "]
["IHDR1","C12.1.21",{"$nulls":3},"Driving temporary casings for driven displacement in piling systems or install prefabricated piles through identified or unidentified materials","prov sum",{"$nulls":5}," "]
["IHDR1","C12.1.22",{"$nulls":3},"Extra over item C12.1.19 for raking of prefabricated piles (type, size and rake indicated)","m",{"$nulls":5}," "]
["IHDR1","C12.1.23",{"$nulls":3},"Splicing/coupling prefabricated piles for lengthening (size of pile indicated)","No.",{"$nulls":5}," "]
["IHDR1","C12.1.24",{"$nulls":3},"Stripping/cutting the pile heads (type and diameter/size of pile indicated)","No.",{"$nulls":5}," "]
["IHDR1","C12.1.25",{"$nulls":3},"Establishment on site for the load testing of piles","lump sum",{"$nulls":5}," "]
["IHDR1","C12.1.26",{"$nulls":3},"Load tests on piles (compression/tension test, diameter/ size, specified, working load and pile type indicated)","No.",{"$nulls":5}," "]
["IHDR1","C12.1.27",{"$nulls":3},"Establishment on site for core drilling","lump sum",{"$nulls":5}," "]
["IHDR1","C12.1.28",{"$nulls":3},"Moving equipment to and assembling at each location where cores are to be drilled","No.",{"$nulls":5}," "]
["IHDR1","C12.1.29",{"$nulls":3},"Drilling the cores (diameter indicated) in:",{"$nulls":6}," "]
["IHDR2",null,"C12.1.29.1",null,null,"Concrete","m",{"$nulls":5}," "]
["IHDR2",null,"C12.1.29.2",null,null,"Founding formation:",{"$nulls":6}," "]
["Item",null,null,"(a)",null,"Irrespective of hardness","m",{"$nulls":5}," "]
["IHDR1","C12.1.30",{"$nulls":3},"Standing time for pile-installation frame","hour",{"$nulls":5}," "]
["IHDR1","C12.1.31",{"$nulls":3},"Pile Integrity Testing on augered/bored piles:",{"$nulls":6}," "]
["Item",null,"C12.1.31.1",null,null,"Providing and installing (diameter indicated) mild steel tubes for “Cross Hole Sonic Logging” in all designated piles","m",{"$nulls":5}," "]
["Item",null,"C12.1.31.2",null,null,"Carrying out of Impact Frequency Response (IFR) measurements or Sonic Tapping tests and interpretation of results (per pile diameter)","No.",{"$nulls":5}," "]
["Item",null,"C12.1.31.3",null,null,"Cross-Hole Sonic Logging tests and interpreted results (per pile diameter)","m",{"$nulls":5}," "]
["Item",null,"C12.1.31.4",null,null,"Base integrity tests (per designated pile)","No.",{"$nulls":5}," "]
["IHDR1","C12.1.32",{"$nulls":3},"Lateral support to excavations:",{"$nulls":6},{"$f":"IF(ISNUMBER(H72),L72*H72,IF(ISNUMBER(J72),J72,IF(J72=\"RATE ONLY\",LOWER(\"RATE ONLY\"),\" \")))","v":" "}]
["IHDR2",null,"C12.1.32.1",null,null,"At location (to be indicated):",{"$nulls":6},{"$f":"IF(ISNUMBER(H73),L73*H73,IF(ISNUMBER(J73),J73,IF(J73=\"RATE ONLY\",LOWER(\"RATE ONLY\"),\" \")))","v":" "}]
["Item",null,null,"(a)",null,"0 to 3,0 m depth","m²",{"$nulls":5},{"$f":"IF(ISNUMBER(H74),L74*H74,IF(ISNUMBER(J74),J74,IF(J74=\"RATE ONLY\",LOWER(\"RATE ONLY\"),\" \")))","v":" "}]
["Item",null,null,"(b)",null,"3,0 to 6,0 m depth","m²",{"$nulls":5},{"$f":"IF(ISNUMBER(H75),L75*H75,IF(ISNUMBER(J75),J75,IF(J75=\"RATE ONLY\",LOWER(\"RATE ONLY\"),\" \")))","v":" "}]
["IHDR2",null,"C12.1.32.2",null,null,"At other locations (As indicated)","m²",{"$nulls":5},{"$f":"IF(ISNUMBER(H76),L76*H76,IF(ISNUMBER(J76),J76,IF(J76=\"RATE ONLY\",LOWER(\"RATE ONLY\"),\" \")))","v":" "}]
["#BillEnd#"]
["#BillEnd#","TOTAL CARRIED FORWARD TO SUMMARY",{"$nulls":10},{"$f":"SUBTOTAL(9,M$9:M76)","v":0}]
["#BillEnd#"]

{"sheet":"12.2","index":52,"n_rows":35,"n_cols":13,"rows_kept":35,"hidden":true}
["#BillSheet#"]
["#BillSheet#","C12.2","GROUND ANCHORS",{"$nulls":3},"\n",null,null,"SCHEDULE A",{"$f":"SUBTOTAL(9,M$7:M1014)","v":0},null,{"$f":"J2","v":"SCHEDULE A"}]
["#BillSheet#"]
["ColHDR"]
["ColHDR","ITEM",{"$nulls":3},"DESCRIPTION","UNIT","QTY","RATE","AMT",null,"RATE","AMOUNT"]
["ColHDR"]
[{"$nulls":5},"GROUND ANCHORS"]
["IHDR1","C12.2.1",{"$nulls":3},"Establishment on site for anchoring","lump sum",{"$nulls":5},{"$f":"IF(ISNUMBER(H8),L8*H8,IF(ISNUMBER(J8),J8,IF(J8=\"RATE ONLY\",LOWER(\"RATE ONLY\"),\" \")))","v":" "}]
["IHDR1","C12.2.2",{"$nulls":3},"Re-establishment on site for additional work (type indicated)","lump sum",{"$nulls":5}," "]
["IHDR1","C12.2.3",{"$nulls":3},"Provision of access to anchor positions","lump sum",{"$nulls":5}," "]
["IHDR1","C12.2.4",{"$nulls":3},"Moving to, and setting up the equipment for drilling the holes at each position","No.",{"$nulls":5}," "]
["IHDR1","C12.2.5",{"$nulls":3},"Drill holes with a diameter of (diameter indicated) to the specified depths and inclinations","m",{"$nulls":5}," "]
["IHDR1","C12.2.6",{"$nulls":3},"Installation of permanent casing (size and length indicated)","m",{"$nulls":5}," "]
["IHDR1","C12.2.7",{"$nulls":3},"Water tests","No.",{"$nulls":5}," "]
["IHDR1","C12.2.8",{"$nulls":3},"Grouting and re-drilling the holes","m",{"$nulls":5}," "]
["IHDR1","C12.2.9",{"$nulls":3},"Cable anchor tendons:",{"$nulls":6}," "]
["Item",null,"C12.2.9.1",null,null,"Free anchor length","MN-m",{"$nulls":5},{"$f":"IF(ISNUMBER(H17),L17*H17,IF(ISNUMBER(J17),J17,IF(J17=\"RATE ONLY\",LOWER(\"RATE ONLY\"),\" \")))","v":" "}]
["Item",null,"C12.2.9.2",null,null,"Fixed anchor length","MN-m",{"$nulls":5}," "]
["IHDR1","C12.2.10",{"$nulls":3},"Anchorages and couplers:",{"$nulls":6},{"$f":"IF(ISNUMBER(H19),L19*H19,IF(ISNUMBER(J19),J19,IF(J19=\"RATE ONLY\",LOWER(\"RATE ONLY\"),\" \")))","v":" "}]
["Item",null,"C12.2.10.1",null,null,"Anchorage at jacking end","MN",{"$nulls":5}," "]
["Item",null,"C12.2.10.2",null,null,"Coupler at jacking end","MN",{"$nulls":5}," "]
["IHDR1","C12.2.11",{"$nulls":3},"Encasing the anchorages at the jacking end in concrete","No.",{"$nulls":5},{"$f":"IF(ISNUMBER(H22),L22*H22,IF(ISNUMBER(J22),J22,IF(J22=\"RATE ONLY\",LOWER(\"RATE ONLY\"),\" \")))","v":" "}]
["IHDR1","C12.2.12",{"$nulls":3},"Performance monitoring of anchors:",{"$nulls":6},{"$f":"IF(ISNUMBER(H23),L23*H23,IF(ISNUMBER(J23),J23,IF(J23=\"RATE ONLY\",LOWER(\"RATE ONLY\"),\" \")))","v":" "}]
["Item",null,"C12.2.12.1",null,null,"Establishment of lift-off testing team and equipment","lump sum",{"$nulls":5}," "]
["Item",null,"C12.2.12.2",null,null,"Lift-off tests","No.",{"$nulls":5}," "]
["IHDR1","C12.2.13",{"$nulls":3},"Establishment on the site for drilling of rockbolts, dowels, soil nails or mechanical anchors (type indicated)","lump sum",{"$nulls":5},{"$f":"IF(ISNUMBER(H26),L26*H26,IF(ISNUMBER(J26),J26,IF(J26=\"RATE ONLY\",LOWER(\"RATE ONLY\"),\" \")))","v":" "}]
["IHDR1","C12.2.14",{"$nulls":3},"Move to and set up at each rockbolt, dowel, soil nail or mechanical anchor position","No.",{"$nulls":5}," "]
["IHDR1","C12.2.15",{"$nulls":3},"Install, grout and protect soil nails or rock bolts (lengths indicated)","No.",{"$nulls":5}," "]
["IHDR1","C12.2.16",{"$nulls":3},"Extra over for tensioning soil nails or rockbolts","No.",{"$nulls":5}," "]
["IHDR1","C12.2.17",{"$nulls":3},"Apply rock bolt protection and camouflage","No.",{"$nulls":5}," "]
["IHDR1","C12.2.18",{"$nulls":3},"Move to and set up at each mechanical driven tipping anchor/ mechanical screw anchor position (type indicated)","No.",{"$nulls":5}," "]
["IHDR1","C12.2.19",{"$nulls":3},"Install mechanically driven tipping anchors / mechanical screw anchors (type and lengths indicated)","No.",{"$nulls":5}," "]
["#BillEnd#"]
["#BillEnd#","TOTAL CARRIED FORWARD TO SUMMARY",{"$nulls":10},{"$f":"SUBTOTAL(9,M$10:M32)","v":0}]
["#BillEnd#"]

{"sheet":"12.3","index":53,"n_rows":83,"n_cols":13,"rows_kept":83,"hidden":true}
[]
["#BillSheet#","C12.3 ","GROUND IMPROVEMENT",{"$nulls":3},"\n",null,null,"SCHEDULE A",{"$f":"SUBTOTAL(9,M$7:M1063)","v":0},null,{"$f":"J2","v":"SCHEDULE A"}]
[]
["ColHDR"]
["ColHDR","ITEM",{"$nulls":3},"DESCRIPTION","UNIT","QTY","RATE","AMT",null,"RATE","AMOUNT"]
["ColHDR"]
[{"$nulls":5},"GROUND IMPROVEMENT"]
["IHDR1","C12.3.1",{"$nulls":3},"Site Establishment:",{"$nulls":6},{"$f":"IF(ISNUMBER(H8),L8*H8,IF(ISNUMBER(J8),J8,IF(J8=\"RATE ONLY\",LOWER(\"RATE ONLY\"),\" \")))","v":" "}]
["Item",null,"C12.3.1.1",null,null,"Geotechnical Grouting","lump sum",{"$nulls":5},{"$f":"IF(ISNUMBER(H9),L9*H9,IF(ISNUMBER(J9),J9,IF(J9=\"RATE ONLY\",LOWER(\"RATE ONLY\"),\" \")))","v":" "}]
["Item",null,"C12.3.1.2",null,null,"Jet Grouting","lump sum",{"$nulls":5}," "]
["Item",null,"C12.3.1.3",null,null,"Compaction Grouting","lump sum",{"$nulls":5}," "]
["Item",null,"C12.3.1.4",null,null,"Dynamic compaction","lump sum",{"$nulls":5}," "]
["Item",null,"C12.3.1.5",null,null,"Rapid impact compaction","lump sum",{"$nulls":5}," "]
["Item",null,"C12.3.1.6",null,null,"Vibration compaction","lump sum",{"$nulls":5}," "]
["Item",null,"C12.3.1.7",null,null,"Underpinning","lump sum",{"$nulls":5}," "]
["Item",null,"C12.3.1.8",null,null,"Preloading","lump sum",{"$nulls":5}," "]
["Item",null,"C12.3.1.9",null,null,"Basal reinforcement","lump sum",{"$nulls":5}," "]
["IHDR1","C12.3.2",{"$nulls":3},"Moving to and setting up equipment at each position for:",{"$nulls":6},{"$f":"IF(ISNUMBER(H18),L18*H18,IF(ISNUMBER(J18),J18,IF(J18=\"RATE ONLY\",LOWER(\"RATE ONLY\"),\" \")))","v":" "}]
["Item",null,"C12.3.1.1",null,null,"Geotechnical Grouting","No.",{"$nulls":5}," "]
["Item",null,"C12.3.1.2",null,null,"Jet Grouting","No.",{"$nulls":5}," "]
["Item",null,"C12.3.1.3",null,null,"Compaction Grouting","No.",{"$nulls":5}," "]
["Item",null,"C12.3.1.4",null,null,"Dynamic compaction","No.",{"$nulls":5}," "]
["Item",null,"C12.3.1.5",null,null,"Rapid impact compaction","No.",{"$nulls":5}," "]
["Item",null,"C12.3.1.6",null,null,"Vibration compaction","No.",{"$nulls":5}," "]
["Item",null,"C12.3.1.7",null,null,"Underpinning","No.",{"$nulls":5}," "]
["Item",null,"C12.3.1.8",null,null,"Preloading","No.",{"$nulls":5}," "]
["Item",null,"C12.3.1.9",null,null,"Basal treatment","No.",{"$nulls":5}," "]
["IHDR1","C12.3.3",{"$nulls":3},"Setting out of works at treatment positions","No.",{"$nulls":5},{"$f":"IF(ISNUMBER(H28),L28*H28,IF(ISNUMBER(J28),J28,IF(J28=\"RATE ONLY\",LOWER(\"RATE ONLY\"),\" \")))","v":" "}]
["IHDR1","C12.3.4",{"$nulls":3},"Grouting (Cement):",{"$nulls":6},{"$f":"IF(ISNUMBER(H29),L29*H29,IF(ISNUMBER(J29),J29,IF(J29=\"RATE ONLY\",LOWER(\"RATE ONLY\"),\" \")))","v":" "}]
["Item",null,"C12.3.4.1",null,null,"Geotechnical Grouting","kg",{"$nulls":5}," "]
["Item",null,"C12.3.4.2",null,null,"Jet Grouting","kg",{"$nulls":5}," "]
["Item",null,"C12.3.4.3",null,null,"Compaction Grouting","kg",{"$nulls":5}," "]
["IHDR1","C12.3.5",{"$nulls":3},"Grouting (Fillers and Additives):",{"$nulls":6},{"$f":"IF(ISNUMBER(H33),L33*H33,IF(ISNUMBER(J33),J33,IF(J33=\"RATE ONLY\",LOWER(\"RATE ONLY\"),\" \")))","v":" "}]
["Item",null,"C12.3.5.1",null,null,"Sand","kg",{"$nulls":5}," "]
["Item",null,"C12.3.5.2",null,null,"Bentonite","kg",{"$nulls":5}," "]
["Item",null,"C12.3.5.3",null,null,"Other fillers (specify)","kg",{"$nulls":5}," "]
["IHDR1","C12.3.6",{"$nulls":3},"Drilling of holes for geotechnical /compaction grouting (diameter and inclination indicated)","m",{"$nulls":5},{"$f":"IF(ISNUMBER(H37),L37*H37,IF(ISNUMBER(J37),J37,IF(J37=\"RATE ONLY\",LOWER(\"RATE ONLY\"),\" \")))","v":" "}]
["IHDR1","C12.3.7",{"$nulls":3},"Extra over for drilling through reinforced concrete","m",{"$nulls":5}," "]
["IHDR1","C12.3.8",{"$nulls":3},"Drilling holes for jet grouting to specified depths (depth ranges and inclinations to be specified)","m",{"$nulls":5}," "]
["IHDR1","C12.3.9",{"$nulls":3},"Installation of casing (diameter and inclination indicated)","m",{"$nulls":5}," "]
["IHDR1","C12.3.10",{"$nulls":3},"Installation of standpipes for geotechnical grouting","No.",{"$nulls":5}," "]
["IHDR1","C12.3.11",{"$nulls":3},"Injection Grouting (type indicated)","m³",{"$nulls":5}," "]
["IHDR1","C12.3.12",{"$nulls":3},"Extra-over items 12.3.4 and 12.3.5 for stage grouting (specify up-or downstage)","No.",{"$nulls":5}," "]
["IHDR1","C12.3.13",{"$nulls":3},"Extra-over items 12.3.4 and 12.3.5 for jet grouting of widened sections or mushroom heads (position and width to be specified)","No.",{"$nulls":5}," "]
["IHDR1","C12.3.14",{"$nulls":3},"Exposing test jet grouted columns","No.",{"$nulls":5}," "]
["IHDR1","C12.3.15",{"$nulls":3},"Coring of jet grouted columns",{"$nulls":6}," "]
["Item",null,"C12.3.15.1",null,null,"Setting up over completed jet grouted columns","No.",{"$nulls":5}," "]
["Item",null,"C12.3.15.2",null,null,"Drilling and core recovery (size indicated)","m",{"$nulls":5}," "]
["Item",null,"C12.3.15.3",null,null,"Provision of core boxes","No.",{"$nulls":5}," "]
["IHDR1","C12.3.16",{"$nulls":3},"Removal of jetting and drilling spoil","m³-km",{"$nulls":5},{"$f":"IF(ISNUMBER(H50),L50*H50,IF(ISNUMBER(J50),J50,IF(J50=\"RATE ONLY\",LOWER(\"RATE ONLY\"),\" \")))","v":" "}]
["IHDR1","C12.3.17",{"$nulls":3},"Performing dynamic compaction over (specify distance) utilising a (indicate mass) ton pounder:",{"$nulls":6},{"$f":"IF(ISNUMBER(H51),L51*H51,IF(ISNUMBER(J51),J51,IF(J51=\"RATE ONLY\",LOWER(\"RATE ONLY\"),\" \")))","v":" "}]
["Item",null,"C12.3.17.1",null,null,"Primary prints","blows",{"$nulls":5}," "]
["Item",null,"C12.3.17.2",null,null,"Secondary prints","blows",{"$nulls":5}," "]
["Item",null,"C12.3.17.3",null,null,"Ironing prints","blows",{"$nulls":5}," "]
["IHDR1","C12.3.18",{"$nulls":3},"Variation in number of blows:",{"$nulls":6},{"$f":"IF(ISNUMBER(H55),L55*H55,IF(ISNUMBER(J55),J55,IF(J55=\"RATE ONLY\",LOWER(\"RATE ONLY\"),\" \")))","v":" "}]
["Item",null,"C12.3.18.1",null,null,"Primary prints","blows",{"$nulls":5},{"$f":"IF(ISNUMBER(H56),L56*H56,IF(ISNUMBER(J56),J56,IF(J56=\"RATE ONLY\",LOWER(\"RATE ONLY\"),\" \")))","v":" "}]
["Item",null,"C12.3.18.2",null,null,"Secondary prints","blows",{"$nulls":5}," "]
["Item",null,"C12.3.18.3",null,null,"Ironing prints","blows",{"$nulls":5}," "]
["IHDR1","C12.3.19",{"$nulls":3},"Importing G7 quality material from approved sources","m³",{"$nulls":5},{"$f":"IF(ISNUMBER(H59),L59*H59,IF(ISNUMBER(J59),J59,IF(J59=\"RATE ONLY\",LOWER(\"RATE ONLY\"),\" \")))","v":" "}]
["IHDR1","C12.3.20",{"$nulls":3},"Importing dump rock for forming stone columns by dynamic compaction from approved sources","m³",{"$nulls":5}," "]
["IHDR1","C12.3.21",{"$nulls":3},"Importing crushed rock for vibratory replacement from approved sources","m³",{"$nulls":5}," "]
["IHDR1","C12.3.22",{"$nulls":3},"Water acceptance testing (permeability tests as specified)","No.",{"$nulls":5}," "]
["IHDR1","C12.3.23",{"$nulls":3},"Plate load tests","No.",{"$nulls":5}," "]
["IHDR1","C12.3.24",{"$nulls":3},"Establishment on site for:",{"$nulls":6}," "]
["Item",null,"C12.3.24.1",null,null,"DCP testing (depth indicated)","lump sum",{"$nulls":5}," "]
["Item",null,"C12.3.24.2",null,null,"CPT testing (depth indicated)","lump sum",{"$nulls":5}," "]
["Item",null,"C12.3.24.3",null,null,"DPSH testing (depth indicated)","lump sum",{"$nulls":5}," "]
["IHDR1","C12.3.25",{"$nulls":3},"DCP, CPT and DPSH testing:",{"$nulls":6},{"$f":"IF(ISNUMBER(H68),L68*H68,IF(ISNUMBER(J68),J68,IF(J68=\"RATE ONLY\",LOWER(\"RATE ONLY\"),\" \")))","v":" "}]
["Item",null,"C12.3.25.1",null,null,"DCP testing (depth indicated)","No.",{"$nulls":5}," "]
["Item",null,"C12.3.25.2",null,null,"CPT testing (depth indicated)","No.",{"$nulls":5}," "]
["Item",null,"C12.3.25.3",null,null,"DPSH testing (depth indicated)","No.",{"$nulls":5}," "]
["IHDR1","C12.3.26",{"$nulls":3},"Continuous surface wave testing (CSW)","No.",{"$nulls":5},{"$f":"IF(ISNUMBER(H72),L72*H72,IF(ISNUMBER(J72),J72,IF(J72=\"RATE ONLY\",LOWER(\"RATE ONLY\"),\" \")))","v":" "}]
["IHDR1","C12.3.27",{"$nulls":3},"Monitoring of instruments and earthworks by survey","month",{"$nulls":5}," "]
["IHDR1","C12.3.28",{"$nulls":3},"Supply and install rod settlement gauges","No.",{"$nulls":5}," "]
["IHDR1","C12.3.29",{"$nulls":3},"Supply and install standpipe piezometers","No.",{"$nulls":5}," "]
["IHDR1","C12.3.30",{"$nulls":3},"Supply and install pneumatic piezometers (lengths indicated)","No.",{"$nulls":5}," "]
["IHDR1","C12.3.31",{"$nulls":3},"Supply and install inclinometer monitoring systems (lengths indicated)","m",{"$nulls":5}," "]
["IHDR1","C12.3.32",{"$nulls":3},"Supply and install pressure measuring loadcells (type and make specified)","No.",{"$nulls":5}," "]
["IHDR1","C12.3.33",{"$nulls":3},"Supply and install geosynthetic for basal reinforcements","m²",{"$nulls":5}," "]
["IHDR1","C12.3.34",{"$nulls":3},"Supply and placement of 125 mm protection layer","m³",{"$nulls":5}," "]
["#BillEnd#"]
["#BillEnd#","TOTAL CARRIED FORWARD TO SUMMARY",{"$nulls":10},{"$f":"SUBTOTAL(9,M$11:M80)","v":0}]
["#BillEnd#"]

{"sheet":"12.4","index":54,"n_rows":42,"n_cols":13,"rows_kept":42,"hidden":true}
[]
["#BillSheet#","C12.4","LATERAL SUPPORT",{"$nulls":3},"\n",null,null,"SCHEDULE A",{"$f":"SUBTOTAL(9,M$7:M1029)","v":0},null,{"$f":"J2","v":"SCHEDULE A"}]
[]
["ColHDR"]
["ColHDR","ITEM",{"$nulls":3},"DESCRIPTION","UNIT","QTY","RATE","AMT",null,"RATE","AMOUNT"]
["ColHDR"]
[{"$nulls":5},"LATERAL SUPPORT"]
["IHDR1","C12.4.1",{"$nulls":3},"Site Establishment:",{"$nulls":6},{"$f":"IF(ISNUMBER(H8),L8*H8,IF(ISNUMBER(J8),J8,IF(J8=\"RATE ONLY\",LOWER(\"RATE ONLY\"),\" \")))","v":" "}]
["Item",null,"C12.4.1.1",null,null,"Sheet Piling","lump sum",{"$nulls":5},{"$f":"IF(ISNUMBER(H9),L9*H9,IF(ISNUMBER(J9),J9,IF(J9=\"RATE ONLY\",LOWER(\"RATE ONLY\"),\" \")))","v":" "}]
["Item",null,"C12.4.1.2",null,null,"Diaphragm Walls","lump sum",{"$nulls":5}," "]
["IHDR1","C12.4.2",{"$nulls":3},"Moving to and setting up equipment at sections or sites to be defined:",{"$nulls":6},{"$f":"IF(ISNUMBER(H11),L11*H11,IF(ISNUMBER(J11),J11,IF(J11=\"RATE ONLY\",LOWER(\"RATE ONLY\"),\" \")))","v":" "}]
["Item",null,"C12.4.2.1",null,null,"Sheet Piling","No.",{"$nulls":5}," "]
["Item",null,"C12.4.2.2",null,null,"Diaphragm Walls","No.",{"$nulls":5}," "]
["IHDR1","C12.4.3",{"$nulls":3},"Setting out of works at sheet piling or diaphragm panel positions","m",{"$nulls":5},{"$f":"IF(ISNUMBER(H14),L14*H14,IF(ISNUMBER(J14),J14,IF(J14=\"RATE ONLY\",LOWER(\"RATE ONLY\"),\" \")))","v":" "}]
["IHDR1","C12.4.4",{"$nulls":3},"Sheet pile driving (individual sheet pile type or sheet panel extent specified)","m²",{"$nulls":5},{"$f":"IF(ISNUMBER(H15),L15*H15,IF(ISNUMBER(J15),J15,IF(J15=\"RATE ONLY\",LOWER(\"RATE ONLY\"),\" \")))","v":" "}]
["IHDR1","C12.4.5",{"$nulls":3},"Sheet pile extraction","m²",{"$nulls":5},{"$f":"IF(ISNUMBER(H16),L16*H16,IF(ISNUMBER(J16),J16,IF(J16=\"RATE ONLY\",LOWER(\"RATE ONLY\"),\" \")))","v":" "}]
["IHDR1","C12.4.6",{"$nulls":3},"Sheet pile and diaphragm wall supports (as specified):",{"$nulls":6},{"$f":"IF(ISNUMBER(H17),L17*H17,IF(ISNUMBER(J17),J17,IF(J17=\"RATE ONLY\",LOWER(\"RATE ONLY\"),\" \")))","v":" "}]
["Item",null,"C12.4.6.1",null,null,"Props","No.",{"$nulls":5}," "]
["Item",null,"C12.4.6.2",null,null,"Anchors","No.",{"$nulls":5}," "]
["Item",null,"C12.4.6.3",null,null,"Tie-bars","No.",{"$nulls":5}," "]
["IHDR1","C12.4.7",{"$nulls":3},"Sheet pile grouting:",{"$nulls":6},{"$f":"IF(ISNUMBER(H21),L21*H21,IF(ISNUMBER(J21),J21,IF(J21=\"RATE ONLY\",LOWER(\"RATE ONLY\"),\" \")))","v":" "}]
["Item",null,"C12.4.7.1",null,null,"Chemical grouting","kg",{"$nulls":5}," "]
["Item",null,"C12.4.7.2",null,null,"Jet grouting","kg",{"$nulls":5}," "]
["Item",null,"C12.4.7.3",null,null,"Compaction grouting","kg",{"$nulls":5}," "]
["IHDR1","C12.4.8",{"$nulls":3},"Concrete placed by tremie under slurry in diaphragm walls (class of concrete indicated)","m³",{"$nulls":5},{"$f":"IF(ISNUMBER(H25),L25*H25,IF(ISNUMBER(J25),J25,IF(J25=\"RATE ONLY\",LOWER(\"RATE ONLY\"),\" \")))","v":" "}]
["IHDR1","C12.4.9",{"$nulls":3},"Partial Excavation of Panels","m³",{"$nulls":5},{"$f":"IF(ISNUMBER(H26),L26*H26,IF(ISNUMBER(J26),J26,IF(J26=\"RATE ONLY\",LOWER(\"RATE ONLY\"),\" \")))","v":" "}]
["IHDR1","C12.4.10",{"$nulls":3},"Cement, additives, bentonite, aggregate and fillers:",{"$nulls":6},{"$f":"IF(ISNUMBER(H27),L27*H27,IF(ISNUMBER(J27),J27,IF(J27=\"RATE ONLY\",LOWER(\"RATE ONLY\"),\" \")))","v":" "}]
["Item",null,"C12.4.10.1",null,null,"Cement","kg",{"$nulls":5}," "]
["Item",null,"C12.4.10.2",null,null,"Bentonite","kg",{"$nulls":5}," "]
["Item",null,"C12.4.10.3",null,null,"Fine/ coarse aggregate (specify)","kg",{"$nulls":5}," "]
["Item",null,"C12.4.10.4",null,null,"Other fillers (specify)","kg",{"$nulls":5}," "]
["IHDR1","C12.4.11",{"$nulls":3},"Bentonite slurry re-use","m³",{"$nulls":5},{"$f":"IF(ISNUMBER(H32),L32*H32,IF(ISNUMBER(J32),J32,IF(J32=\"RATE ONLY\",LOWER(\"RATE ONLY\"),\" \")))","v":" "}]
["IHDR1","C12.4.12",{"$nulls":3},"Steel reinforcement","t",{"$nulls":5},{"$f":"IF(ISNUMBER(H33),L33*H33,IF(ISNUMBER(J33),J33,IF(J33=\"RATE ONLY\",LOWER(\"RATE ONLY\"),\" \")))","v":" "}]
["IHDR1","C12.4.13",{"$nulls":3},"Exposing tops of selected concrete panels","No.",{"$nulls":5},{"$f":"IF(ISNUMBER(H34),L34*H34,IF(ISNUMBER(J34),J34,IF(J34=\"RATE ONLY\",LOWER(\"RATE ONLY\"),\" \")))","v":" "}]
["IHDR1","C12.4.14",{"$nulls":3},"Coring of concrete panels:",{"$nulls":6},{"$f":"IF(ISNUMBER(H35),L35*H35,IF(ISNUMBER(J35),J35,IF(J35=\"RATE ONLY\",LOWER(\"RATE ONLY\"),\" \")))","v":" "}]
["Item",null,"C12.4.14.1",null,null,"Setting up at completed panels","No.",{"$nulls":5}," "]
["Item",null,"C12.4.14.2",null,null,"Drilling and core recovery (size indicated)","m",{"$nulls":5}," "]
["Item",null,"C12.4.14.3",null,null,"Provision of core boxes","No.",{"$nulls":5}," "]
["Item",null,"C12.4.14.4",null,null,"Extra-over for inclined drilling","m",{"$nulls":5}," "]
["#BillEnd#"]
["#BillEnd#","TOTAL CARRIED FORWARD TO SUMMARY",{"$nulls":10},{"$f":"SUBTOTAL(9,M$11:M39)","v":0}]
["#BillEnd#"]

{"sheet":"12.5","index":55,"n_rows":29,"n_cols":13,"rows_kept":29,"hidden":true}
["#BillSheet#"]
["#BillSheet#","C12.5","SHOTCRETE",{"$nulls":3},"\n",null,null,"SCHEDULE A",{"$f":"SUBTOTAL(9,M$7:M1016)","v":0},null,{"$f":"J2","v":"SCHEDULE A"}]
["#BillSheet#"]
["ColHDR"]
["ColHDR","ITEM",{"$nulls":3},"DESCRIPTION","UNIT","QTY","RATE","AMT",null,"RATE","AMOUNT"]
["ColHDR"]
[{"$nulls":5},"SHOTCRETE"]
["IHDR1","C12.5.1",{"$nulls":3},"Establishment on site","lump sum",{"$nulls":5},{"$f":"IF(ISNUMBER(H8),L8*H8,IF(ISNUMBER(J8),J8,IF(J8=\"RATE ONLY\",LOWER(\"RATE ONLY\"),\" \")))","v":" "}]
["IHDR1","C12.5.2",{"$nulls":3},"Surface preparation for shotcreting","m²",{"$nulls":5},{"$f":"IF(ISNUMBER(H9),L9*H9,IF(ISNUMBER(J9),J9,IF(J9=\"RATE ONLY\",LOWER(\"RATE ONLY\"),\" \")))","v":" "}]
["IHDR1","C12.5.3",{"$nulls":3},"Supply and installation of reinforcement:",{"$nulls":6},{"$f":"IF(ISNUMBER(H10),L10*H10,IF(ISNUMBER(J10),J10,IF(J10=\"RATE ONLY\",LOWER(\"RATE ONLY\"),\" \")))","v":" "}]
[{"$nulls":5},"Note: The numbering of the items below differs from the spec. Spec numbering is incorrect"]
["Item",null,"C12.5.3.1",null,null,"Welded steel mesh fabric (Ref. 395)","m²",{"$nulls":5},{"$f":"IF(ISNUMBER(H12),L12*H12,IF(ISNUMBER(J12),J12,IF(J12=\"RATE ONLY\",LOWER(\"RATE ONLY\"),\" \")))","v":" "}]
["Item",null,"C12.5.3.2",null,null,"Fibre (type indicated)","kg",{"$nulls":5}," "]
["Item",null,"C12.5.3.3",null,null,"Other special reinforcement systems as specified","m²",{"$nulls":5}," "]
["IHDR1","C12.5.4",{"$nulls":3},"Shotcrete (of specified thickness or volume):",{"$nulls":6},{"$f":"IF(ISNUMBER(H15),L15*H15,IF(ISNUMBER(J15),J15,IF(J15=\"RATE ONLY\",LOWER(\"RATE ONLY\"),\" \")))","v":" "}]
["Item",null,"C12.5.4.1",null,null,"Flash/base coat (unreinforced) (specify thickness)","m²",{"$nulls":5}," "]
["Item",null,"C12.5.4.2",null,null,"Intermediate coat/s (specify thickness and number of layers)","m²",{"$nulls":5}," "]
["Item",null,"C12.5.4.3",null,null,"Final coat (specify thickness, pigmentation and finish)","m²",{"$nulls":5}," "]
["Item",null,"C12.5.4.4",null,null,"Dental shotcrete","m²",{"$nulls":5}," "]
["IHDR1","C12.5.5",{"$nulls":3},"Removal to spoil of material trimmed from slope","m³-km",{"$nulls":5},{"$f":"IF(ISNUMBER(H20),L20*H20,IF(ISNUMBER(J20),J20,IF(J20=\"RATE ONLY\",LOWER(\"RATE ONLY\"),\" \")))","v":" "}]
["IHDR1","C12.5.6",{"$nulls":3},"Edge finishing of shotcrete","m",{"$nulls":5},{"$f":"IF(ISNUMBER(H21),L21*H21,IF(ISNUMBER(J21),J21,IF(J21=\"RATE ONLY\",LOWER(\"RATE ONLY\"),\" \")))","v":" "}]
["IHDR1","C12.5.7",{"$nulls":3},"Geopipe collectors and weepholes:",{"$nulls":6},{"$f":"IF(ISNUMBER(H22),L22*H22,IF(ISNUMBER(J22),J22,IF(J22=\"RATE ONLY\",LOWER(\"RATE ONLY\"),\" \")))","v":" "}]
["Item",null,"C12.5.7.1",null,null,"50 mm diameter U-PVC weephole piping (specify length and class)","No.",{"$nulls":5}," "]
["Item",null,"C12.5.7.2",null,null,"Geopipe collectors (specify type, diameter and class)","m",{"$nulls":5}," "]
["Item",null,"C12.5.7.3",null,null,"Other piping (specify type, diameter and class)","m",{"$nulls":5}," "]
["IHDR1","C12.5.8",{"$nulls":3},"Geocomposite/geosynthetic drain as specified","m",{"$nulls":5},{"$f":"IF(ISNUMBER(H26),L26*H26,IF(ISNUMBER(J26),J26,IF(J26=\"RATE ONLY\",LOWER(\"RATE ONLY\"),\" \")))","v":" "}]
["#BillEnd#"]
["#BillEnd#","TOTAL CARRIED FORWARD TO SUMMARY",{"$nulls":10},{"$f":"SUBTOTAL(9,M$10:M26)","v":0}]
["#BillEnd#"]

{"sheet":"12.6","index":56,"n_rows":48,"n_cols":13,"rows_kept":48,"hidden":true}
["#BillSheet#"]
["#BillSheet#","C12.6","MECHANICALLY STABILISED EARTHWALLS AND GABIONS",{"$nulls":3},"\n",null,null,"SCHEDULE A",{"$f":"SUBTOTAL(9,M$7:M1035)","v":0},null,{"$f":"J2","v":"SCHEDULE A"}]
["#BillSheet#"]
["ColHDR"]
["ColHDR","ITEM",{"$nulls":3},"DESCRIPTION","UNIT","QTY","RATE","AMT",null,"RATE","AMOUNT"]
["ColHDR"]
[{"$nulls":5},"MECHANICALLY STABILISED EARTHWALLS AND GABIONS"]
["IHDR1","C12.6.1",{"$nulls":3},"Establishment on site for MSE:",{"$nulls":6},{"$f":"IF(ISNUMBER(H8),L8*H8,IF(ISNUMBER(J8),J8,IF(J8=\"RATE ONLY\",LOWER(\"RATE ONLY\"),\" \")))","v":" "}]
["Item",null,"C12.6.1.1",null,null,"For reinforced concrete facing","lump sum",{"$nulls":5}," "]
["Item",null,"C12.6.1.2",null,null,"For concrete block wall facing","lump sum",{"$nulls":5}," "]
["Item",null,"C12.6.1.3",null,null,"For metallic facing","lump sum",{"$nulls":5}," "]
["IHDR1","C12.6.2",{"$nulls":3},"Excavation for wall base foundation","m³",{"$nulls":5}," "]
["IHDR1","C12.6.3",{"$nulls":3},"Concrete for wall base foundation","m³",{"$nulls":5}," "]
["IHDR1","C12.6.4",{"$nulls":3},"Reinforcing steel in wall base foundation:",{"$nulls":6}," "]
["Item",null,"C12.6.4.1",null,null,"Mild steel","t",{"$nulls":5}," "]
["Item",null,"C12.6.4.2",null,null,"High tensile steel","t",{"$nulls":5}," "]
["IHDR1","C12.6.5",{"$nulls":3},"Preparation of surface for laying metallic strips or geosynthetic","m²",{"$nulls":5},{"$f":"IF(ISNUMBER(H17),L17*H17,IF(ISNUMBER(J17),J17,IF(J17=\"RATE ONLY\",LOWER(\"RATE ONLY\"),\" \")))","v":" "}]
["IHDR1","C12.6.6",{"$nulls":3},"Metallic reinforcing strips (section dimension indicated)","m",{"$nulls":5}," "]
["IHDR1","C12.6.7",{"$nulls":3},"Metallic reinforcing mesh (section dimension indicated)","m²",{"$nulls":5}," "]
["IHDR1","C12.6.8",{"$nulls":3},"Polymer/ Geosynthetic reinforcing strips (section dimension indicated)","m",{"$nulls":5}," "]
["IHDR1","C12.6.9",{"$nulls":3},"Polymer/ Geosynthetic reinforcing sheet as specified","m²",{"$nulls":5}," "]
["IHDR1","C12.6.10",{"$nulls":3},"Fixing mechanism to facings:",{"$nulls":6}," "]
["Item",null,"C12.6.10.1",null,null,"Strips","No.",{"$nulls":5},{"$f":"IF(ISNUMBER(H23),L23*H23,IF(ISNUMBER(J23),J23,IF(J23=\"RATE ONLY\",LOWER(\"RATE ONLY\"),\" \")))","v":" "}]
["Item",null,"C12.6.10.2",null,null,"Sheets","m",{"$nulls":5}," "]
["IHDR1","C12.6.11",{"$nulls":3},"Backfill (material type and compaction requirements indicated)","m³",{"$nulls":5}," "]
["IHDR1","C12.6.12",{"$nulls":3},"Facings (type, size and thickness indicated):",{"$nulls":6}," "]
["Item",null,"C12.6.12.1",null,null,"For reinforced concrete panel facing","m²",{"$nulls":5}," "]
["Item",null,"C12.6.12.2",null,null,"For concrete block wall facing","m²",{"$nulls":5}," "]
["Item",null,"C12.6.12.3",null,null,"For metallic facing","m²",{"$nulls":5}," "]
["IHDR1","C12.6.13",{"$nulls":3},"Drainage (type and size indicated)","No.",{"$nulls":5}," "]
["IHDR1","C12.6.14",{"$nulls":3},"Foundation trench excavation:",{"$nulls":6}," "]
["IHDR2",null,"C12.6.14.1",null,null,"Excavating all material situated within the following depth ranges below the surface level",{"$nulls":6}," "]
["Item",null,null,"(a)",null,"0 m to 1,5 m","m³",{"$nulls":5}," "]
["Item",null,null,"(b)",null,"Exceeding 1,5 m and up to 3,0 m","m³",{"$nulls":5}," "]
["Item",null,null,"(c)",null,"Etc, in increments of 1,5 m","m³",{"$nulls":5}," "]
["IHDR2",null,"C12.6.14.2",null,null,"Extra over sub-item C12.6.14.1 for excavation in hard material, irrespective of depth","m³",{"$nulls":5}," "]
["IHDR2",null,"C12.6.14.3",null,null,"Excavating soft material within 1,5 m below the surface level using labour enhancement construction methods","m³",{"$nulls":5}," "]
["IHDR2",null,"C12.6.14.4",null,null,"Excavating intermediate material within 1,5 m below the surface level using labour enhancement construction methods","m³",{"$nulls":5}," "]
["IHDR1","C12.6.15",{"$nulls":3},"Surface preparation for bedding the gabions","m²",{"$nulls":5}," "]
["IHDR1","C12.6.16",{"$nulls":3},"Gabions and mattresses:",{"$nulls":6}," "]
["Item",null,"C12.6.16.1",null,null,"Galvanized gabion boxes (dimensions of box)","m³",{"$nulls":5}," "]
["Item",null,"C12.6.16.2",null,null,"Polymer coated gabion boxes (dimensions of box)","m³",{"$nulls":5}," "]
["Item",null,"C12.6.16.3",null,null,"Galvanized gabion mattresses (dimensions of mattress)","m³",{"$nulls":5}," "]
["Item",null,"C12.6.16.4",null,null,"Polymer coated gabion mattresses (dimensions of mattress)","m³",{"$nulls":5}," "]
["IHDR1","C12.6.17",{"$nulls":3},"Geotextile (type indicated)","m²",{"$nulls":5}," "]
["#BillEnd#"]
["#BillEnd#","TOTAL CARRIED FORWARD TO SUMMARY",{"$nulls":10},{"$f":"SUBTOTAL(9,M$11:M45)","v":0}]
["#BillEnd#"]

{"sheet":"12.7","index":57,"n_rows":17,"n_cols":13,"rows_kept":17,"hidden":true}
["#BillSheet#"]
["#BillSheet#","C12.7","TRENCHLESS METHODS",{"$nulls":3},"\n",null,null,"SCHEDULE A",{"$f":"SUBTOTAL(9,M$7:M1004)","v":0},null,{"$f":"J2","v":"SCHEDULE A"}]
["#BillSheet#"]
["ColHDR"]
["ColHDR","ITEM",{"$nulls":3},"DESCRIPTION","UNIT","QTY","RATE","AMT",null,"RATE","AMOUNT"]
["ColHDR"]
[{"$nulls":5},"TRENCHLESS METHODS"]
["IHDR1","C12.7.1",{"$nulls":3},"Establishment on site for: (indicate type of operation: Pipe Jacking, Horizontal directional drilling, Pipe Ramming, or Micro-tunnelling)","lump sum",{"$nulls":5},{"$f":"IF(ISNUMBER(H8),L8*H8,IF(ISNUMBER(J8),J8,IF(J8=\"RATE ONLY\",LOWER(\"RATE ONLY\"),\" \")))","v":" "}]
["IHDR1","C12.7.2",{"$nulls":3},"Moving to and setting up equipment at each position for (indicate type of operation)","No.",{"$nulls":5}," "]
["IHDR1","C12.7.3",{"$nulls":3},"Installing holes (diameter, lining type indicated) to required length for (indicate type of operation)","m",{"$nulls":5}," "]
["IHDR1","C12.7.4",{"$nulls":3},"Penetrating unidentified obstructions/services (indicate type of operation, i.e. Pipe Jacking, Horizontal directional drilling, Pipe Ramming or Micro-tunnelling) for penetration of:",{"$nulls":6}," "]
["Item",null,"C12.7.4.1",null,null,"Steel or iron","m",{"$nulls":5}," "]
["Item",null,"C12.7.4.2",null,null,"Concrete","m",{"$nulls":5}," "]
["Item",null,"C12.7.4.3",null,null,"Rock of UCS > 3 Mpa","m",{"$nulls":5}," "]
["#BillEnd#"]
["#BillEnd#","TOTAL CARRIED FORWARD TO SUMMARY",{"$nulls":10},{"$f":"SUBTOTAL(9,M$10:M14)","v":0}]
["#BillEnd#"]

{"sheet":"12.8","index":58,"n_rows":29,"n_cols":13,"rows_kept":29,"hidden":true}
["#BillSheet#"]
["#BillSheet#","C12.8","GROUND DRAINAGE",{"$nulls":3},"\n",null,null,"SCHEDULE A",{"$f":"SUBTOTAL(9,M$7:M1016)","v":0},null,{"$f":"J2","v":"SCHEDULE A"}]
["#BillSheet#"]
["ColHDR"]
["ColHDR","ITEM",{"$nulls":3},"DESCRIPTION","UNIT","QTY","RATE","AMT",null,"RATE","AMOUNT"]
["ColHDR"]
[{"$nulls":5},"GROUND DRAINAGE"]
["IHDR1","C12.8.1",{"$nulls":3},"Establishment on site for:",{"$nulls":6},{"$f":"IF(ISNUMBER(H8),L8*H8,IF(ISNUMBER(J8),J8,IF(J8=\"RATE ONLY\",LOWER(\"RATE ONLY\"),\" \")))","v":" "}]
["Item",null,"C12.8.1.1",null,null,"Well point construction","lump sum",{"$nulls":5},{"$f":"IF(ISNUMBER(H9),L9*H9,IF(ISNUMBER(J9),J9,IF(J9=\"RATE ONLY\",LOWER(\"RATE ONLY\"),\" \")))","v":" "}]
["Item",null,"C12.8.1.2",null,null,"Horizontal drains","lump sum",{"$nulls":5},{"$f":"IF(ISNUMBER(H10),L10*H10,IF(ISNUMBER(J10),J10,IF(J10=\"RATE ONLY\",LOWER(\"RATE ONLY\"),\" \")))","v":" "}]
["Item",null,"C12.8.1.3",null,null,"Vertical drains (all types)","lump sum",{"$nulls":5},{"$f":"IF(ISNUMBER(H11),L11*H11,IF(ISNUMBER(J11),J11,IF(J11=\"RATE ONLY\",LOWER(\"RATE ONLY\"),\" \")))","v":" "}]
["Item",null,"C12.8.1.4",null,null,"Geosynthetic/Blanket drains","lump sum",{"$nulls":5},{"$f":"IF(ISNUMBER(H12),L12*H12,IF(ISNUMBER(J12),J12,IF(J12=\"RATE ONLY\",LOWER(\"RATE ONLY\"),\" \")))","v":" "}]
["IHDR1","C12.8.2",{"$nulls":3},"Provision of access to drain positions (type indicated)","lump sum",{"$nulls":5},{"$f":"IF(ISNUMBER(H13),L13*H13,IF(ISNUMBER(J13),J13,IF(J13=\"RATE ONLY\",LOWER(\"RATE ONLY\"),\" \")))","v":" "}]
["IHDR1","C12.8.3",{"$nulls":3},"Moving to, and setting up the equipment for drilling the holes at each well /horizontal/ sand drain position (type indicated)","No.",{"$nulls":5}," "]
["IHDR1","C12.8.4",{"$nulls":3},"Moving to, and setting up the equipment for installing vertical drains at each drain position (size and type of drain indicated)","No.",{"$nulls":5}," "]
["IHDR1","C12.8.5",{"$nulls":3},"Drill holes for wells (diameter indicated) to the required depth","m",{"$nulls":5}," "]
["IHDR1","C12.8.6",{"$nulls":3},"Drill holes for horizontal drains (inclination and diameter indicated) to the required depth","m",{"$nulls":5}," "]
["IHDR1","C12.8.7",{"$nulls":3},"Drill holes for vertical sand drains (diameter indicated) to the required depth","m",{"$nulls":5}," "]
["IHDR1","C12.8.8",{"$nulls":3},"Pre- drilling of holes for vertical drains (diameter indicated) to the required depth","m",{"$nulls":5}," "]
["IHDR1","C12.8.9",{"$nulls":3},"Installation of slotted drainage pipes for wells (size indicated)","m",{"$nulls":5}," "]
["IHDR1","C12.8.10",{"$nulls":3},"Installation of slotted drainage pipes for horizontal drains (size indicated)","m",{"$nulls":5}," "]
["IHDR1","C12.8.11",{"$nulls":3},"Installation of vertical drains (type/ size indicated)","m",{"$nulls":5}," "]
["IHDR1","C12.8.12",{"$nulls":3},"Filter sand for wells (type/ size indicated)","kg",{"$nulls":5}," "]
["IHDR1","C12.8.13",{"$nulls":3},"River sand for vertical drains (source indicated)","m³",{"$nulls":5}," "]
["IHDR1","C12.8.14",{"$nulls":3},"Provision and installation of submersible borehole pumps in designated wells","prov sum",{"$nulls":5}," "]
["IHDR1","C12.8.15",{"$nulls":3},"Construction of base station for wells","prov sum",{"$nulls":5}," "]
["#BillEnd#"]
["#BillEnd#","TOTAL CARRIED FORWARD TO SUMMARY",{"$nulls":10},{"$f":"SUBTOTAL(9,M$11:M26)","v":0}]
["#BillEnd#"]

{"sheet":"12.9","index":59,"n_rows":26,"n_cols":13,"rows_kept":26,"hidden":true}
["#BillSheet#"]
["#BillSheet#","C12.9","SLOPE PROTECTION MEASURES",{"$nulls":3},"\n",null,null,"SCHEDULE A",{"$f":"SUBTOTAL(9,M$7:M1013)","v":0},null,{"$f":"J2","v":"SCHEDULE A"}]
["#BillSheet#"]
["ColHDR"]
["ColHDR","ITEM",{"$nulls":3},"DESCRIPTION","UNIT","QTY","RATE","AMT",null,"RATE","AMOUNT"]
["ColHDR"]
[{"$nulls":5},"SLOPE PROTECTION MEASURES"]
["IHDR1","C12.4.1",{"$nulls":3},"Site Establishment:",{"$nulls":6},{"$f":"IF(ISNUMBER(H8),L8*H8,IF(ISNUMBER(J8),J8,IF(J8=\"RATE ONLY\",LOWER(\"RATE ONLY\"),\" \")))","v":" "}]
["IHDR2",null,"C12.4.1.1",null,null,"Prefabricated kerbing (description of type of kerb and bedding with reference to drawing)",{"$nulls":6}," "]
["Item",null,null,"(a)",null,"State type of kerb and bedding with reference to drawing","m",{"$nulls":5}," "]
["Item",null,null,"(b)",null,"Etc for other types","m",{"$nulls":5}," "]
["IHDR1","C12.9.1",{"$nulls":3},"Barring down of rock surfaces within vertical height intervals (intervals stated)","m²",{"$nulls":5}," "]
["IHDR1","C12.9.2",{"$nulls":3},"Cleaning of rock surfaces by high pressure air and water jetting equipment within the vertical height intervals (categories stated)","m²",{"$nulls":5}," "]
["IHDR1","C12.9.3",{"$nulls":3},"Disposal of barred down and accumulated debris","m³.km",{"$nulls":5}," "]
["IHDR1","C12.9.4",{"$nulls":3},"Supply and install wire mesh rockfall netting within vertical height intervals (intervals stated, galvanic requirements, roll width, wire thickness, tensile strength, weave, aperture, PVC coating and/or colouring indicated)","m²",{"$nulls":5}," "]
["IHDR1","C12.9.5",{"$nulls":3},"Supply and Installation/erection of catch fencing (galvanic requirements, type, height, length and energy rating in kJ and location of fences indicated)","m",{"$nulls":5}," "]
["IHDR1","C12.9.6",{"$nulls":3},"Supply and installation/erection of additional anchor lengths for catch fences (differentiate between threadbar and wire rope anchor for different diameters)","m",{"$nulls":5}," "]
["IHDR1","C12.9.7",{"$nulls":3},"Gap filling under the catch fences (energy class stated)","m²",{"$nulls":5}," "]
["IHDR1","C12.9.8",{"$nulls":3},"Supply and installation/erection of shallow landslide fencing (galvanic requirements, type, height, length and rating and fence length class interval)","m",{"$nulls":5}," "]
["IHDR1","C12.9.9",{"$nulls":3},"Supply and install additional anchor lengths for shallow landslide fences (differentiate between threadbar and wire rope anchor for different diameters)","m",{"$nulls":5}," "]
["IHDR1","C12.9.10",{"$nulls":3},"Gap filling under the shallow landslide fences (fence rating indicated)","m²",{"$nulls":5}," "]
["IHDR1","C12.9.11",{"$nulls":3},"Supply and installation/erection of debris flow fencing (galvanic requirements, type, rating and location for each numbered fence indicated)","m",{"$nulls":5}," "]
["IHDR1","C12.9.12",{"$nulls":3},"Supply and install additional anchor lengths for debris flow fences (differentiate between threadbar and wire rope anchor for different diameters)","m",{"$nulls":5}," "]
["#BillEnd#"]
["#BillEnd#","TOTAL CARRIED FORWARD TO SUMMARY",{"$nulls":10},{"$f":"SUBTOTAL(9,M$10:M23)","v":0}]
["#BillEnd#"]

{"sheet":"12.10","index":60,"n_rows":71,"n_cols":14,"rows_kept":71,"hidden":true}
["#BillSheet#"]
["#BillSheet#","C12.10","HARD EXCAVATION BY BLASTING",{"$nulls":3},"\n",null,null,"SCHEDULE A",{"$f":"SUBTOTAL(9,M$7:M1058)","v":{"v":71100000,"d":"71,100,000.00"}},null,{"$f":"J2","v":"SCHEDULE A"}]
["#BillSheet#"]
["ColHDR"]
["ColHDR","ITEM",{"$nulls":3},"DESCRIPTION","UNIT","QTY","RATE","AMT",null,"RATE","AMOUNT"]
["ColHDR",{"$nulls":12},"Rate as per Matjiesfontein project"]
[{"$nulls":5},"HARD EXCAVATION BY BLASTING"]
["IHDR1","C12.10.1",{"$nulls":3},"Excavation in hard rock using controlled blasting techniques","m³",1580000,{"$nulls":3},{"v":45,"d":"45.00"},{"$f":"IF(ISNUMBER(H8),L8*H8,IF(ISNUMBER(J8),J8,IF(J8=\"RATE ONLY\",LOWER(\"RATE ONLY\"),\" \")))","v":{"v":71100000,"d":"71,100,000.00"}},"See BP & haul spreadsheet JC"]
[]
["IHDR1","C12.10.2",{"$nulls":3},"Pre-splitting - base rate for holes @ 750 mm c/c","m²",{"$nulls":5},{"$f":"IF(ISNUMBER(H10),L10*H10,IF(ISNUMBER(J10),J10,IF(J10=\"RATE ONLY\",LOWER(\"RATE ONLY\"),\" \")))","v":" "}," "]
[]
["IHDR1","C12.10.3",{"$nulls":3},"Pre-splitting - compensation for additional holes","m",{"$nulls":5},{"$f":"IF(ISNUMBER(H12),L12*H12,IF(ISNUMBER(J12),J12,IF(J12=\"RATE ONLY\",LOWER(\"RATE ONLY\"),\" \")))","v":" "}]
[]
["IHDR1","C12.10.4",{"$nulls":3},"Smooth blasting - base rate for holes @ 1500 mm c/c","m²",{"$nulls":5},{"$f":"IF(ISNUMBER(H14),L14*H14,IF(ISNUMBER(J14),J14,IF(J14=\"RATE ONLY\",LOWER(\"RATE ONLY\"),\" \")))","v":" "}]
[]
["IHDR1","C12.10.5",{"$nulls":3},"Smooth Blasting - compensation for additional holes","m",{"$nulls":5},{"$f":"IF(ISNUMBER(H16),L16*H16,IF(ISNUMBER(J16),J16,IF(J16=\"RATE ONLY\",LOWER(\"RATE ONLY\"),\" \")))","v":" "}]
[]
["IHDR1","C12.10.6",{"$nulls":3},"Line Drilling - base rate for holes @ 300 mm c/c","m²",{"$nulls":5},{"$f":"IF(ISNUMBER(H18),L18*H18,IF(ISNUMBER(J18),J18,IF(J18=\"RATE ONLY\",LOWER(\"RATE ONLY\"),\" \")))","v":" "}]
[]
["IHDR1","C12.10.7",{"$nulls":3},"Line Drilling - compensation for additional holes","m",{"$nulls":5},{"$f":"IF(ISNUMBER(H20),L20*H20,IF(ISNUMBER(J20),J20,IF(J20=\"RATE ONLY\",LOWER(\"RATE ONLY\"),\" \")))","v":" "}]
{"$rows_empty":48}
["#BillEnd#"]
["#BillEnd#","TOTAL CARRIED FORWARD TO SUMMARY",{"$nulls":10},{"$f":"SUBTOTAL(9,M$7:M21)","v":{"v":71100000,"d":"71,100,000.00"}}]
["#BillEnd#"]

{"sheet":"12.11","index":61,"n_rows":10,"n_cols":13,"rows_kept":10,"hidden":true}
["#BillSheet#"]
["#BillSheet#","C12.11","GEOSYNTHETICS",{"$nulls":3},"\n",null,null,"SCHEDULE A",{"$f":"SUBTOTAL(9,M$7:M997)","v":0},null,{"$f":"J2","v":"SCHEDULE A"}]
["#BillSheet#"]
["ColHDR"]
["ColHDR","ITEM",{"$nulls":3},"DESCRIPTION","UNIT","QTY","RATE","AMT",null,"RATE","AMOUNT"]
["ColHDR"]
[{"$nulls":5},"GEOSYNTHETICS"]
["#BillEnd#"]
["#BillEnd#","TOTAL CARRIED FORWARD TO SUMMARY",{"$nulls":10},{"$f":"SUBTOTAL(9,M8:M$8)","v":0}]
["#BillEnd#"]

{"sheet":"12.12","index":62,"n_rows":20,"n_cols":13,"rows_kept":20,"hidden":true}
["#BillSheet#"]
["#BillSheet#","C12.12","CONSTRUCTION DEWATERING",{"$nulls":3},"\n",null,null,"SCHEDULE A",{"$f":"SUBTOTAL(9,M$7:M1007)","v":0},null,{"$f":"J2","v":"SCHEDULE A"}]
["#BillSheet#"]
["ColHDR"]
["ColHDR","ITEM",{"$nulls":3},"DESCRIPTION","UNIT","QTY","RATE","AMT",null,"RATE","AMOUNT"]
["ColHDR"]
[{"$nulls":5},"CONSTRUCTION DEWATERING"]
["IHDR1","C12.12.1",{"$nulls":3},"Establishment on site for construction dewatering","lump sum",{"$nulls":5},{"$f":"IF(ISNUMBER(H8),L8*H8,IF(ISNUMBER(J8),J8,IF(J8=\"RATE ONLY\",LOWER(\"RATE ONLY\"),\" \")))","v":" "}]
["IHDR1","C12.12.2",{"$nulls":3},"Installing and commissioning all requisite plant and equipment to undertake dewatering by well system offered (type of well system to be nominated by tenderer)","No.",{"$nulls":5}," "]
["IHDR1","C12.12.3",{"$nulls":3},"Operate and maintain well system (type of well system to be nominated by tenderer)","hour",{"$nulls":5}," "]
["IHDR1","C12.12.4",{"$nulls":3},"Supply Install and remove discharge pipeline to the required depth (diameter and class indicated)","m",{"$nulls":5}," "]
["IHDR1","C12.12.5",{"$nulls":3},"Install ground observation wells to the required depth (diameter and class indicated)","m",{"$nulls":5}," "]
["IHDR1","C12.12.6",{"$nulls":3},"Monitoring of lowering of ground water levels","lump sum",{"$nulls":5}," "]
["IHDR1","C12.12.7",{"$nulls":3},"Monitoring of potential settlements","lump sum",{"$nulls":5}," "]
["IHDR1","C12.12.8",{"$nulls":3},"Monitoring quality of groundwater:",{"$nulls":6}," "]
["Item",null,"C12.12.8.1",null,null,"Monitoring of silt and fine sand","lump sum",{"$nulls":5},{"$f":"IF(ISNUMBER(H16),L16*H16,IF(ISNUMBER(J16),J16,IF(J16=\"RATE ONLY\",LOWER(\"RATE ONLY\"),\" \")))","v":" "}]
["Item",null,"C12.12.8.2",null,null,"Monitoring of groundwater chemistry and quality","lump sum",{"$nulls":5},{"$f":"IF(ISNUMBER(H17),L17*H17,IF(ISNUMBER(J17),J17,IF(J17=\"RATE ONLY\",LOWER(\"RATE ONLY\"),\" \")))","v":" "}]
["#BillEnd#"]
["#BillEnd#","TOTAL CARRIED FORWARD TO SUMMARY",{"$nulls":10},{"$f":"SUBTOTAL(9,M$10:M17)","v":0}]
["#BillEnd#"]

{"sheet":"13.2","index":63,"n_rows":22,"n_cols":13,"rows_kept":22,"hidden":true}
["#BillSheet#"]
["#BillSheet#","C13.2","FALSEWORK, FORMWORK AND CONCRETE FINISH",{"$nulls":3},"\n",null,null,"SCHEDULE A",{"$f":"SUBTOTAL(9,M$7:M1009)","v":0},null,{"$f":"J2","v":"SCHEDULE A"}]
["#BillSheet#"]
["ColHDR"]
["ColHDR","ITEM",{"$nulls":3},"DESCRIPTION","UNIT","QTY","RATE","AMT",null,"RATE","AMOUNT"]
["ColHDR"]
[{"$nulls":5},"FALSEWORK, FORMWORK AND CONCRETE FINISH"]
["IHDR1","C13.2.1",{"$nulls":3},"Formwork to provide (class of finish indicated as F1, F2, F3 or board) surface finish to (description of member to which applicable)","m²",{"$nulls":5},{"$f":"IF(ISNUMBER(H8),L8*H8,IF(ISNUMBER(J8),J8,IF(J8=\"RATE ONLY\",LOWER(\"RATE ONLY\"),\" \")))","v":" "}]
["IHDR1","C13.2.2",{"$nulls":3},"Vertical formwork to provide (class of finish indicated as F1, F2, F3 or board) surface finish to (description of member to which applicable)","m²",{"$nulls":5}," "]
["IHDR1","C13.2.3",{"$nulls":3},"Horizontal formwork to provide (class of finish Indicated as F1, F2, F3 or board) surface finish to (description of member to which applicable)","m²",{"$nulls":5}," "]
["IHDR1","C13.2.4",{"$nulls":3},"Inclined formwork to provide (class of finish indicated as F1, F2, F3 or board) surface finish to (description of member to which applicable)","m²",{"$nulls":5}," "]
["IHDR1","C13.2.5",{"$nulls":3},"Permanent formwork",{"$nulls":6}," "]
["Item",null,"C13.2.5.1",null,null,"To form voids of (diameter/ size of void indicated) in (description of member to which applicable)","m²",{"$nulls":5}," "]
["Item",null,"C13.2.5.2",null,null,"Of (description of material and member to which applicable)","m²",{"$nulls":5}," "]
["IHDR1","C13.2.6",{"$nulls":3},"Formwork to form open joints (description of member to which applicable, and location)","m²",{"$nulls":5}," "]
["IHDR1","C13.2.7",{"$nulls":3},"Establishment on the site for sliding formwork operations","lump sum",{"$nulls":5}," "]
["IHDR1","C13.2.8",{"$nulls":3},"Transporting to and setting up the sliding formwork assembly at (description of each structure)","No.",{"$nulls":5}," "]
["IHDR1","C13.2.9",{"$nulls":3},"Forming the concrete by sliding formwork for (description of each structure and class of surface finish to exposed surfaces indicated)","m",{"$nulls":5}," "]
["IHDR1","C13.2.10",{"$nulls":3},"Provision of designs and drawings of falsework and formwork by an ECSA registered Professional Engineer or Technologist (description of member to which applicable)","lump sum",{"$nulls":5}," "]
["#BillEnd#"]
["#BillEnd#","TOTAL CARRIED FORWARD TO SUMMARY",{"$nulls":10},{"$f":"SUBTOTAL(9,M$10:M19)","v":0}]
["#BillEnd#"]

{"sheet":"13.3","index":64,"n_rows":21,"n_cols":13,"rows_kept":21,"hidden":true}
["#BillSheet#"]
["#BillSheet#","C13.3","STEEL REINFORCEMENT",{"$nulls":3},"\n",null,null,"SCHEDULE A",{"$f":"SUBTOTAL(9,M$7:M1008)","v":0},null,{"$f":"J2","v":"SCHEDULE A"}]
["#BillSheet#"]
["ColHDR"]
["ColHDR","ITEM",{"$nulls":3},"DESCRIPTION","UNIT","QTY","RATE","AMT",null,"RATE","AMOUNT"]
["ColHDR"]
[{"$nulls":5},"STEEL REINFORCEMENT"]
["IHDR1","C13.3.1",{"$nulls":3},"Reinforcement for:",{"$nulls":6},{"$f":"IF(ISNUMBER(H8),L8*H8,IF(ISNUMBER(J8),J8,IF(J8=\"RATE ONLY\",LOWER(\"RATE ONLY\"),\" \")))","v":" "}]
["IHDR2",null,"C13.3.1.1",null,null,"(Description of portion of structure to which applicable):",{"$nulls":6}," "]
["Item",null,null,"(a)",null,"Mild-steel bars","t",{"$nulls":5}," "]
["Item",null,null,"(b)",null,"High-yield-stress-steel bars (type indicated)","t",{"$nulls":5}," "]
["Item",null,null,"(c)",null,"Welded Steel Fabric","kg",{"$nulls":5}," "]
["Item",null,null,"(d)",null,"Stainless steel bars (type indicated)","t",{"$nulls":5}," "]
["Item",null,null,"(e)",null,"Other Materials (specify material)","t",{"$nulls":5}," "]
["IHDR2",null,"C13.3.1.2",null,null,"Etc. for other structures or parts of structures","t",{"$nulls":5}," "]
["IHDR1","C13.3.2",{"$nulls":3},"Mechanical couplers (type of coupler and diameter of bar indicated)","No.",{"$nulls":5}," "]
["IHDR1","C13.3.3",{"$nulls":3},"Spacer ladders for (description of part of structure to which applicable)","t",{"$nulls":5}," "]
["IHDR1","C13.3.4",{"$nulls":3},"Extra-over item C13.3.1 (a), (b), etc. for galvanising of reinforcement","t",{"$nulls":5}," "]
["#BillEnd#"]
["#BillEnd#","TOTAL CARRIED FORWARD TO SUMMARY",{"$nulls":10},{"$f":"SUBTOTAL(9,M$10:M18)","v":0}]
["#BillEnd#"]

{"sheet":"13.4","index":65,"n_rows":60,"n_cols":13,"rows_kept":60,"hidden":true}
["#BillSheet#"]
["#BillSheet#","C13.4","CONCRETE",{"$nulls":3},"\n",null,null,"SCHEDULE A",{"$f":"SUBTOTAL(9,M$7:M1047)","v":0},null,{"$f":"J2","v":"SCHEDULE A"}]
["#BillSheet#"]
["ColHDR"]
["ColHDR","ITEM",{"$nulls":3},"DESCRIPTION","UNIT","QTY","RATE","AMT",null,"RATE","AMOUNT"]
["ColHDR"]
[{"$nulls":5},"CONCRETE"]
["IHDR1","C13.4.1",{"$nulls":3},"Cast in situ concrete (Class of concrete and use or position in structure stated):",{"$nulls":6},{"$f":"IF(ISNUMBER(H8),L8*H8,IF(ISNUMBER(J8),J8,IF(J8=\"RATE ONLY\",LOWER(\"RATE ONLY\"),\" \")))","v":" "}]
["IHDR2",null,"C13.4.1.1",null,null,"Strength concrete (class C):",{"$nulls":6},{"$f":"IF(ISNUMBER(H9),L9*H9,IF(ISNUMBER(J9),J9,IF(J9=\"RATE ONLY\",LOWER(\"RATE ONLY\"),\" \")))","v":" "}]
["Item",null,null,"(a)",null,"Indicate part of structure, class code and 28 day characteristic cylinder strength/ characteristic compressive cube strength and nominal aggregate size e.g. Blinding C12/15-20","m³",{"$nulls":5},{"$f":"IF(ISNUMBER(H10),L10*H10,IF(ISNUMBER(J10),J10,IF(J10=\"RATE ONLY\",LOWER(\"RATE ONLY\"),\" \")))","v":" "}]
["Item",null,null,"(b)",null,"Etc. For other parts of structure","m³",{"$nulls":5}," "]
["IHDR2",null,"C13.4.1.2",null,null,"Durable concrete (class D):",{"$nulls":6},{"$f":"IF(ISNUMBER(H12),L12*H12,IF(ISNUMBER(J12),J12,IF(J12=\"RATE ONLY\",LOWER(\"RATE ONLY\"),\" \")))","v":" "}]
["Item",null,null,"(a)",null,"Indicate part of structure, class code and 28 day characteristic cylinder strength/ characteristic compressive cube strength, environmental exposure and service life and nominal aggregate size e.g. Deck slab D35/45-XS1(100)-20","m³",{"$nulls":5}," "]
["Item",null,null,"(b)",null,"Etc. For other parts of structure","m³",{"$nulls":5}," "]
["IHDR2",null,"C13.4.1.3",null,null,"Prescribed-composition concrete (class P):",{"$nulls":6},{"$f":"IF(ISNUMBER(H15),L15*H15,IF(ISNUMBER(J15),J15,IF(J15=\"RATE ONLY\",LOWER(\"RATE ONLY\"),\" \")))","v":" "}]
["Item",null,null,"(a)",null,"Indicate part of structure, class code and 28 day characteristic cylinder strength/ characteristic compressive cube strength and nominal aggregate size e.g. Piers P32/40-20","m³",{"$nulls":5}," "]
["Item",null,null,"(b)",null,"Etc. For other parts of structure","m³",{"$nulls":5}," "]
["IHDR1","C13.4.2",{"$nulls":3},"Labour enhanced cast in situ concrete (class of concrete and use or position in structure stated)",{"$nulls":6},{"$f":"IF(ISNUMBER(H18),L18*H18,IF(ISNUMBER(J18),J18,IF(J18=\"RATE ONLY\",LOWER(\"RATE ONLY\"),\" \")))","v":" "}]
["Item",null,"C13.4.2.1",null,null,"Commercially- Sourced concrete","m³",{"$nulls":5}," "]
["Item",null,"C13.4.2.2",null,null,"Contractor-mixed concrete on site","m³",{"$nulls":5}," "]
["IHDR1","C13.4.3",{"$nulls":3},"Extra over item C13.4.1 for the protection of concrete from adverse environmental conditions, if required:",{"$nulls":6},{"$f":"IF(ISNUMBER(H21),L21*H21,IF(ISNUMBER(J21),J21,IF(J21=\"RATE ONLY\",LOWER(\"RATE ONLY\"),\" \")))","v":" "}]
["IHDR2",null,"C13.4.3.1",null,null,"Strength concrete (class C):",{"$nulls":6},{"$f":"IF(ISNUMBER(H22),L22*H22,IF(ISNUMBER(J22),J22,IF(J22=\"RATE ONLY\",LOWER(\"RATE ONLY\"),\" \")))","v":" "}]
["Item",null,null,"(a)",null,"Indicate part of structure, class code and 28 day characteristic cylinder strength/ characteristic compressive cube strength and nominal aggregate size e.g. Blinding C12/15-20","m³",{"$nulls":5}," "]
["Item",null,null,"(b)",null,"Etc for other parts of structure","m³",{"$nulls":5}," "]
["IHDR2",null,"C13.4.3.2",null,null,"Durable concrete (class D):",{"$nulls":6},{"$f":"IF(ISNUMBER(H25),L25*H25,IF(ISNUMBER(J25),J25,IF(J25=\"RATE ONLY\",LOWER(\"RATE ONLY\"),\" \")))","v":" "}]
["Item",null,null,"(a)",null,"Indicate part of structure, class code and 28 day characteristic cylinder strength/ characteristic compressive cube strength, environmental exposure and service life and nominal aggregate size e.g. Deck slab D35/45-XS1(100)-20","m³",{"$nulls":5}," "]
["Item",null,null,"(b)",null,"Etc for other parts of structure","m³",{"$nulls":5}," "]
["IHDR2",null,"C13.4.3.3",null,null,"Prescribed-composition concrete (class P):",{"$nulls":6},{"$f":"IF(ISNUMBER(H28),L28*H28,IF(ISNUMBER(J28),J28,IF(J28=\"RATE ONLY\",LOWER(\"RATE ONLY\"),\" \")))","v":" "}]
["Item",null,null,"(a)",null,"Indicate part of structure, class code and 28 day characteristic cylinder strength/ characteristic compressive cube strength and nominal aggregate size e.g. Piers P32/40-20","m³",{"$nulls":5}," "]
["Item",null,null,"(b)",null,"Etc for other parts of structure","m³",{"$nulls":5}," "]
["IHDR1","C13.4.4",{"$nulls":3},"Extra over item C13.4.2 for the protection of labour enhanced concrete from adverse environmental conditions",{"$nulls":6},{"$f":"IF(ISNUMBER(H31),L31*H31,IF(ISNUMBER(J31),J31,IF(J31=\"RATE ONLY\",LOWER(\"RATE ONLY\"),\" \")))","v":" "}]
["Item",null,"C13.4.4.1",null,null,"(Class of concrete and use or position in structure stated)","m³",{"$nulls":5}," "]
["IHDR1","C13.4.5",{"$nulls":3},"Curing and surface protection of cast in situ concrete, as and where specifically required:",{"$nulls":6},{"$f":"IF(ISNUMBER(H33),L33*H33,IF(ISNUMBER(J33),J33,IF(J33=\"RATE ONLY\",LOWER(\"RATE ONLY\"),\" \")))","v":" "}]
["Item",null,"C13.4.5.1",null,null,"Indicate structural element and surface to be cured (Tenderer to specify method of curing)","m²",{"$nulls":5}," "]
["Item",null,"C13.4.5.2",null,null,"Etc for other parts of structure (Tenderer to specify method of curing)","m²",{"$nulls":5}," "]
["IHDR1","C13.4.6",{"$nulls":3},"Curing and surface protection of labour enhanced cast in situ concrete",{"$nulls":6},{"$f":"IF(ISNUMBER(H36),L36*H36,IF(ISNUMBER(J36),J36,IF(J36=\"RATE ONLY\",LOWER(\"RATE ONLY\"),\" \")))","v":" "}]
["Item",null,"C13.4.6.1",null,null,"Structural element and surface to be stated (Tenderer to specify method of curing)","m²",{"$nulls":5}," "]
["IHDR1","C13.4.7",{"$nulls":3},"No-fines concrete (class NF):",{"$nulls":6},{"$f":"IF(ISNUMBER(H38),L38*H38,IF(ISNUMBER(J38),J38,IF(J38=\"RATE ONLY\",LOWER(\"RATE ONLY\"),\" \")))","v":" "}]
["IHDR2",null,"C13.4.7.1",null,null,"Cast in situ:",{"$nulls":6},{"$f":"IF(ISNUMBER(H39),L39*H39,IF(ISNUMBER(J39),J39,IF(J39=\"RATE ONLY\",LOWER(\"RATE ONLY\"),\" \")))","v":" "}]
["Item",null,null,"(a)",null,"Indicate class of no-fines concrete and portion of structure or use","m³",{"$nulls":5},{"$f":"IF(ISNUMBER(H40),L40*H40,IF(ISNUMBER(J40),J40,IF(J40=\"RATE ONLY\",LOWER(\"RATE ONLY\"),\" \")))","v":" "}]
["Item",null,null,"(b)",null,"Etc for other classes of no-fines concrete and other portions of structures or uses","m³",{"$nulls":5}," "]
["IHDR2",null,"C13.4.7.2",null,null,"Precast:",{"$nulls":6},{"$f":"IF(ISNUMBER(H42),L42*H42,IF(ISNUMBER(J42),J42,IF(J42=\"RATE ONLY\",LOWER(\"RATE ONLY\"),\" \")))","v":" "}]
["Item",null,null,"(a)",null,"Indicate class of no-fines concrete and describe unit with reference to drawing","No.",{"$nulls":5}," "]
["Item",null,null,"(b)",null,"Etc for other classes of no-fines concrete and units of other types and sizes","No.",{"$nulls":5}," "]
["IHDR1","C13.4.8",{"$nulls":3},"Labour enhanced no fines concrete (Class NF)",{"$nulls":6},{"$f":"IF(ISNUMBER(H45),L45*H45,IF(ISNUMBER(J45),J45,IF(J45=\"RATE ONLY\",LOWER(\"RATE ONLY\"),\" \")))","v":" "}]
["Item",null,"C13.4.8.1",null,null,"Cast in situ (class and portion of structure or use stated)","m³",{"$nulls":5}," "]
["Item",null,"C13.4.8.2",null,null,"Precast","m³",{"$nulls":5}," "]
["IHDR1","C13.4.9",{"$nulls":3},"Manufacturing precast concrete members (description of member with reference to drawing)","No.",{"$nulls":5},{"$f":"IF(ISNUMBER(H48),L48*H48,IF(ISNUMBER(J48),J48,IF(J48=\"RATE ONLY\",LOWER(\"RATE ONLY\"),\" \")))","v":" "}]
["IHDR1","C13.4.10",{"$nulls":3},"Labour enhanced manufacture of precast concrete members (Description of member with reference to drawing)","No.",{"$nulls":5},{"$f":"IF(ISNUMBER(H49),L49*H49,IF(ISNUMBER(J49),J49,IF(J49=\"RATE ONLY\",LOWER(\"RATE ONLY\"),\" \")))","v":" "}]
["IHDR1","C13.4.11",{"$nulls":3},"Transporting and erecting precast concrete members (description of member and approximate mass to be given)","No.",{"$nulls":5},{"$f":"IF(ISNUMBER(H50),L50*H50,IF(ISNUMBER(J50),J50,IF(J50=\"RATE ONLY\",LOWER(\"RATE ONLY\"),\" \")))","v":" "}]
["IHDR1","C13.4.12",{"$nulls":3},"Labour enhanced transporting and erecting precast concrete members (Description of member and approximate mass to be given)","No.",{"$nulls":5},{"$f":"IF(ISNUMBER(H51),L51*H51,IF(ISNUMBER(J51),J51,IF(J51=\"RATE ONLY\",LOWER(\"RATE ONLY\"),\" \")))","v":" "}]
["IHDR1","C13.4.13",{"$nulls":3},"Complete demolition and disposal of existing structural concrete elements or parts of existing structures:",{"$nulls":6},{"$f":"IF(ISNUMBER(H52),L52*H52,IF(ISNUMBER(J52),J52,IF(J52=\"RATE ONLY\",LOWER(\"RATE ONLY\"),\" \")))","v":" "}]
["Item",null,"C13.4.13.1",null,null,"(Member Indicated)","m³",{"$nulls":5}," "]
["Item",null,"C13.4.13.2",null,null,"Etc. for other members","m³",{"$nulls":5}," "]
["IHDR1","C13.4.14",{"$nulls":3},"Controlled demolition of concrete from structural elements:",{"$nulls":6},{"$f":"IF(ISNUMBER(H55),L55*H55,IF(ISNUMBER(J55),J55,IF(J55=\"RATE ONLY\",LOWER(\"RATE ONLY\"),\" \")))","v":" "}]
["Item",null,"C13.4.14.1",null,null,"(Member Indicated)","m³",{"$nulls":5}," "]
["Item",null,"C13.4.14.2",null,null,"Etc. for other members","m³",{"$nulls":5}," "]
["#BillEnd#"]
["#BillEnd#","TOTAL CARRIED FORWARD TO SUMMARY",{"$nulls":10},{"$f":"SUBTOTAL(9,M$10:M57)","v":0}]
["#BillEnd#"]

{"sheet":"13.5","index":66,"n_rows":20,"n_cols":13,"rows_kept":20,"hidden":true}
["#BillSheet#"]
["#BillSheet#","C13.5","PRESTRESSING",{"$nulls":3},"\n",null,null,"SCHEDULE A",{"$f":"SUBTOTAL(9,M$7:M1007)","v":0},null,{"$f":"J2","v":"SCHEDULE A"}]
["#BillSheet#"]
["ColHDR"]
["ColHDR","ITEM",{"$nulls":3},"DESCRIPTION","UNIT","QTY","RATE","AMT",null,"RATE","AMOUNT"]
["ColHDR"]
[{"$nulls":5},"PRESTRESSING"]
["IHDR1","C13.5.1",{"$nulls":3},"Prestressing tendons:",{"$nulls":6},{"$f":"IF(ISNUMBER(H8),L8*H8,IF(ISNUMBER(J8),J8,IF(J8=\"RATE ONLY\",LOWER(\"RATE ONLY\"),\" \")))","v":" "}]
["Item",null,"C13.5.1.1",null,null,"Longitudinal tendons","MN-m",{"$nulls":5},{"$f":"IF(ISNUMBER(H9),L9*H9,IF(ISNUMBER(J9),J9,IF(J9=\"RATE ONLY\",LOWER(\"RATE ONLY\"),\" \")))","v":" "}]
["Item",null,"C13.5.1.2",null,null,"Transverse tendons","MN-m",{"$nulls":5}," "]
["Item",null,"C13.5.1.3",null,null,"Vertical tendons","MN-m",{"$nulls":5}," "]
["IHDR1","C13.5.2",{"$nulls":3},"Anchorages and couplers:",{"$nulls":6},{"$f":"IF(ISNUMBER(H12),L12*H12,IF(ISNUMBER(J12),J12,IF(J12=\"RATE ONLY\",LOWER(\"RATE ONLY\"),\" \")))","v":" "}]
["Item",null,"C13.5.2.1",null,null,"Anchorage at jacking end","MN",{"$nulls":5}," "]
["Item",null,"C13.5.2.2",null,null,"Anchorage at dead end","MN",{"$nulls":5}," "]
["Item",null,"C13.5.2.3",null,null,"Coupler at jacking end","MN",{"$nulls":5}," "]
["Item",null,"C13.5.2.4",null,null,"Coupler at dead end","MN",{"$nulls":5}," "]
["IHDR1","C13.5.3",{"$nulls":3},"Extra over item C13.5.2 for partially tensioning the tendons","MN",{"$nulls":5},{"$f":"IF(ISNUMBER(H17),L17*H17,IF(ISNUMBER(J17),J17,IF(J17=\"RATE ONLY\",LOWER(\"RATE ONLY\"),\" \")))","v":" "}]
["#BillEnd#"]
["#BillEnd#","TOTAL CARRIED FORWARD TO SUMMARY",{"$nulls":10},{"$f":"SUBTOTAL(9,M$11:M17)","v":0}]
["#BillEnd#"]

{"sheet":"13.6","index":67,"n_rows":22,"n_cols":13,"rows_kept":22,"hidden":true}
["#BillSheet#"]
["#BillSheet#","C13.6","BEARINGS",{"$nulls":3},"\n",null,null,"SCHEDULE A",{"$f":"SUBTOTAL(9,M$7:M1009)","v":0},null,{"$f":"J2","v":"SCHEDULE A"}]
["#BillSheet#"]
["ColHDR"]
["ColHDR","ITEM",{"$nulls":3},"DESCRIPTION","UNIT","QTY","RATE","AMT",null,"RATE","AMOUNT"]
["ColHDR"]
[{"$nulls":5},"BEARINGS"]
["IHDR1","C13.6.1",{"$nulls":3},"Bearings:",{"$nulls":6},{"$f":"IF(ISNUMBER(H8),L8*H8,IF(ISNUMBER(J8),J8,IF(J8=\"RATE ONLY\",LOWER(\"RATE ONLY\"),\" \")))","v":" "}]
["Item",null,"C13.6.1.1",null,null,"Bearings (description of each type and class)","No.",{"$nulls":5},{"$f":"IF(ISNUMBER(H9),L9*H9,IF(ISNUMBER(J9),J9,IF(J9=\"RATE ONLY\",LOWER(\"RATE ONLY\"),\" \")))","v":" "}]
["Item",null,"C13.6.1.2",null,null,"Provision of Engineering drawings of proprietary bearings and certification after installation, by an ECSA Registered Professional Engineer or Technologist.","lump sum",{"$nulls":5}," "]
["IHDR1","C13.6.2",{"$nulls":3},"Concrete Hinges",{"$nulls":6},{"$f":"IF(ISNUMBER(H11),L11*H11,IF(ISNUMBER(J11),J11,IF(J11=\"RATE ONLY\",LOWER(\"RATE ONLY\"),\" \")))","v":" "}]
["Item",null,"C13.6.2.1",null,null,"(Description of hinge measured per metre)","m",{"$nulls":5}," "]
["Item",null,"C13.6.2.2",null,null,"(Description of hinge measured by number)","No.",{"$nulls":5}," "]
["IHDR1","C13.6.3",{"$nulls":3},"Bearing strips (description of the material and number of Layers)","m²",{"$nulls":5},{"$f":"IF(ISNUMBER(H14),L14*H14,IF(ISNUMBER(J14),J14,IF(J14=\"RATE ONLY\",LOWER(\"RATE ONLY\"),\" \")))","v":" "}]
["IHDR1","C13.6.4",{"$nulls":3},"Dowels or guides (description of each type)","No.",{"$nulls":5},{"$f":"IF(ISNUMBER(H15),L15*H15,IF(ISNUMBER(J15),J15,IF(J15=\"RATE ONLY\",LOWER(\"RATE ONLY\"),\" \")))","v":" "}]
["IHDR1","C13.6.5",{"$nulls":3},"Specialist proprietary bearings:",{"$nulls":6},{"$f":"IF(ISNUMBER(H16),L16*H16,IF(ISNUMBER(J16),J16,IF(J16=\"RATE ONLY\",LOWER(\"RATE ONLY\"),\" \")))","v":" "}]
["Item",null,"C13.6.5.1",null,null,"Prime cost sum allowed for purchasing and taking delivery of bearing","PC sum",{"$nulls":5}," "]
["Item",null,"C13.6.5.2",null,null,"Percentage on prime cost sum for charges and profit","%",{"$nulls":5}," "]
["IHDR1","C13.6.6",{"$nulls":3},"Installing the proprietary bearings (description of each type, and state class)","No.",{"$nulls":5},{"$f":"IF(ISNUMBER(H19),L19*H19,IF(ISNUMBER(J19),J19,IF(J19=\"RATE ONLY\",LOWER(\"RATE ONLY\"),\" \")))","v":" "}]
["#BillEnd#"]
["#BillEnd#","TOTAL CARRIED FORWARD TO SUMMARY",{"$nulls":10},{"$f":"SUBTOTAL(9,M$11:M19)","v":0}]
["#BillEnd#"]

{"sheet":"13.8","index":68,"n_rows":44,"n_cols":13,"rows_kept":44,"hidden":true}
["#BillSheet#"]
["#BillSheet#","C13.8","ANCILLARY STRUCTURAL ELEMENTS",{"$nulls":3},"\n",null,null,"SCHEDULE A",{"$f":"SUBTOTAL(9,M$7:M1031)","v":0},null,{"$f":"J2","v":"SCHEDULE A"}]
["#BillSheet#"]
["ColHDR"]
["ColHDR","ITEM",{"$nulls":3},"DESCRIPTION","UNIT","QTY","RATE","AMT",null,"RATE","AMOUNT"]
["ColHDR"]
[{"$nulls":5},"ANCILLARY STRUCTURAL ELEMENTS"]
["IHDR1","C13.8.1",{"$nulls":3},"Concrete barriers and parapets (refer to drawings):",{"$nulls":6},{"$f":"IF(ISNUMBER(H8),L8*H8,IF(ISNUMBER(J8),J8,IF(J8=\"RATE ONLY\",LOWER(\"RATE ONLY\"),\" \")))","v":" "}]
["Item",null,"C13.8.1.1",null,null,"Barriers","m",{"$nulls":5}," "]
["Item",null,"C13.8.1.2",null,null,"Parapets","m",{"$nulls":5}," "]
["IHDR1","C13.8.2",{"$nulls":3},"End blocks (length indicated)","No.",{"$nulls":5}," "]
["IHDR1","C13.8.3",{"$nulls":3},"Concrete transition blocks (length indicated)","No.",{"$nulls":5}," "]
["IHDR1","C13.8.4",{"$nulls":3},"Concrete pedestrian railings","m",{"$nulls":5}," "]
["IHDR1","C13.8.5",{"$nulls":3},"Steel railings (type described)","m",{"$nulls":5}," "]
["IHDR1","C13.8.6",{"$nulls":3},"Service ducts in structures:",{"$nulls":6}," "]
["Item",null,"C13.8.6.1",null,null,"Type and size (diameter)","m",{"$nulls":5}," "]
["Item",null,"C13.8.6.2",null,null,"Joint in ducts at bridge deck expansion joints","No.",{"$nulls":5}," "]
["IHDR1","C13.8.7",{"$nulls":3},"Numbers for structures: (refer to drawings):",{"$nulls":6}," "]
["Item",null,"C13.8.7.1",null,null,"Number plates","No.",{"$nulls":5}," "]
["Item",null,"C13.8.7.2",null,null,"Painted numbers","No.",{"$nulls":5}," "]
["Item",null,"C13.8.7.3",null,null,"Numbers formed in concrete","No.",{"$nulls":5}," "]
["Item",null,"C13.8.7.4",null,null,"Numbers on concrete pedestals","No.",{"$nulls":5}," "]
["IHDR1","C13.8.8",{"$nulls":3},"Cast in situ no-fines concrete (class of concrete indicated)","m³",{"$nulls":5}," "]
["IHDR1","C13.8.9",{"$nulls":3},"Precast no-fines concrete units (class of concrete and description of unit)","No.",{"$nulls":5}," "]
["IHDR1","C13.8.10",{"$nulls":3},"Drainage pipes and weep holes:",{"$nulls":6}," "]
["IHDR2",null,"C13.8.10.1",null,null,"Drainage pipes:",{"$nulls":6}," "]
["Item",null,null,"(a)",null,"(Type and size indicated)","m",{"$nulls":5}," "]
["Item",null,null,"(b)",null,"(Type and size indicated)","No.",{"$nulls":5}," "]
["IHDR2",null,"C13.8.10.2",null,null,"Weep holes:",{"$nulls":6}," "]
["Item",null,null,"(a)",null,"(Type and size indicated)","m",{"$nulls":5}," "]
["Item",null,null,"(b)",null,"(Type and size indicated)","No.",{"$nulls":5}," "]
["IHDR1","C13.8.11",{"$nulls":3},"Drainage gulleys (description of each type given)","No.",{"$nulls":5},{"$f":"IF(ISNUMBER(H32),L32*H32,IF(ISNUMBER(J32),J32,IF(J32=\"RATE ONLY\",LOWER(\"RATE ONLY\"),\" \")))","v":" "}]
["IHDR1","C13.8.12",{"$nulls":3},"Synthetic-fibre filter fabric (type indicated and description)","m²",{"$nulls":5}," "]
["IHDR1","C13.8.13",{"$nulls":3},"Concrete channels adjoining structural works (size indicated)","m",{"$nulls":5}," "]
["IHDR1","C13.8.14",{"$nulls":3},"Crushed stone in drainage strips (stone size indicated)","m³",{"$nulls":5}," "]
["IHDR1","C13.8.15",{"$nulls":3},"Drainage strips (type, size and grade indicated)","m",{"$nulls":5}," "]
["IHDR1","C13.8.16",{"$nulls":3},"Perforated drainage pipes:",{"$nulls":6}," "]
["Item",null,"C13.8.16.1",null,null,"Size (diameter) and type of pipe wrapped in synthetic – filter fabric as specified (describe type, grade etc.)","m",{"$nulls":5},{"$f":"IF(ISNUMBER(H38),L38*H38,IF(ISNUMBER(J38),J38,IF(J38=\"RATE ONLY\",LOWER(\"RATE ONLY\"),\" \")))","v":" "}]
["IHDR1","C13.8.17",{"$nulls":3},"Supplying and installing bolt groups complete with electrification brackets:",{"$nulls":6},{"$f":"IF(ISNUMBER(H39),L39*H39,IF(ISNUMBER(J39),J39,IF(J39=\"RATE ONLY\",LOWER(\"RATE ONLY\"),\" \")))","v":" "}]
["Item",null,"C13.8.17.1",null,null,"Single-bolt groups","No.",{"$nulls":5},{"$f":"IF(ISNUMBER(H40),L40*H40,IF(ISNUMBER(J40),J40,IF(J40=\"RATE ONLY\",LOWER(\"RATE ONLY\"),\" \")))","v":" "}]
["Item",null,"C13.8.17.2",null,null,"Double-bolt groups","No.",{"$nulls":5},{"$f":"IF(ISNUMBER(H41),L41*H41,IF(ISNUMBER(J41),J41,IF(J41=\"RATE ONLY\",LOWER(\"RATE ONLY\"),\" \")))","v":" "}]
["#BillEnd#"]
["#BillEnd#","TOTAL CARRIED FORWARD TO SUMMARY",{"$nulls":10},{"$f":"SUBTOTAL(9,M$11:M41)","v":0}]
["#BillEnd#"]

{"sheet":"13.9","index":69,"n_rows":26,"n_cols":13,"rows_kept":26,"hidden":true}
["#BillSheet#"]
["#BillSheet#","C13.9","STRUCTURAL STEELWORK FOR MINOR STRUCTURES",{"$nulls":3},"\n",null,null,"SCHEDULE A",{"$f":"SUBTOTAL(9,M$7:M1013)","v":0},null,{"$f":"J2","v":"SCHEDULE A"}]
["#BillSheet#"]
["ColHDR"]
["ColHDR","ITEM",{"$nulls":3},"DESCRIPTION","UNIT","QTY","RATE","AMT",null,"RATE","AMOUNT"]
["ColHDR"]
[{"$nulls":5},"STRUCTURAL STEELWORK FOR MINOR STRUCTURES"]
["IHDR1","C13.9.1",{"$nulls":3},"Structural steel:",{"$nulls":6},{"$f":"IF(ISNUMBER(H8),L8*H8,IF(ISNUMBER(J8),J8,IF(J8=\"RATE ONLY\",LOWER(\"RATE ONLY\"),\" \")))","v":" "}]
["Item",null,"C13.9.1.1",null,null,"(Structure/article described)","t",{"$nulls":5},{"$f":"IF(ISNUMBER(H9),L9*H9,IF(ISNUMBER(J9),J9,IF(J9=\"RATE ONLY\",LOWER(\"RATE ONLY\"),\" \")))","v":" "}]
["Item",null,"C13.9.1.2",null,null,"(Structure/article described)","m",{"$nulls":5}," "]
["Item",null,"C13.9.1.3",null,null,"(Structure/article described)","No.",{"$nulls":5}," "]
["IHDR1","C13.9.2",{"$nulls":3},"Anchor bolts:",{"$nulls":6},{"$f":"IF(ISNUMBER(H12),L12*H12,IF(ISNUMBER(J12),J12,IF(J12=\"RATE ONLY\",LOWER(\"RATE ONLY\"),\" \")))","v":" "}]
["Item",null,"C13.9.2.1",null,null,"(Description of each assembly, and grade/type of steel, diameter and length indicated)","kg",{"$nulls":5}," "]
["Item",null,"C13.9.2.2",null,null,"(Description of each assembly, and grade/type of steel, diameter and length indicated)","No.",{"$nulls":5}," "]
["IHDR1","C13.9.3",{"$nulls":3},"Corrosion protection:",{"$nulls":6},{"$f":"IF(ISNUMBER(H15),L15*H15,IF(ISNUMBER(J15),J15,IF(J15=\"RATE ONLY\",LOWER(\"RATE ONLY\"),\" \")))","v":" "}]
["IHDR2",null,"C13.9.3.1",null,null,"Sprayed-on metal:",{"$nulls":6},{"$f":"IF(ISNUMBER(H16),L16*H16,IF(ISNUMBER(J16),J16,IF(J16=\"RATE ONLY\",LOWER(\"RATE ONLY\"),\" \")))","v":" "}]
["Item",null,null,"(a)",null,"(Type of metal and thickness or type symbol of coating indicated)","t",{"$nulls":5}," "]
["Item",null,null,"(b)",null,"(Type of metal and thickness or type symbol of coating indicated)","m",{"$nulls":5}," "]
["Item",null,null,"(c)",null,"(Type of metal and thickness or type symbol of coating indicated)","No.",{"$nulls":5}," "]
["IHDR2",null,"C13.9.3.2",null,null,"Galvanising:",{"$nulls":6},{"$f":"IF(ISNUMBER(H20),L20*H20,IF(ISNUMBER(J20),J20,IF(J20=\"RATE ONLY\",LOWER(\"RATE ONLY\"),\" \")))","v":" "}]
["Item",null,null,"(a)",null,"(Thickness or type symbol of zinc coat indicated)","t",{"$nulls":5}," "]
["Item",null,null,"(b)",null,"(Thickness or type symbol of zinc coat indicated)","m",{"$nulls":5}," "]
["Item",null,null,"(c)",null,"(Thickness or type symbol of zinc coat indicated)","No.",{"$nulls":5}," "]
["#BillEnd#"]
["#BillEnd#","TOTAL CARRIED FORWARD TO SUMMARY",{"$nulls":10},{"$f":"SUBTOTAL(9,M$11:M23)","v":0}]
["#BillEnd#"]

{"sheet":"13.10","index":70,"n_rows":20,"n_cols":13,"rows_kept":20,"hidden":true}
["#BillSheet#"]
["#BillSheet#","C13.10","PAINTING OF MINOR STRUCTURES",{"$nulls":3},"\n",null,null,"SCHEDULE A",{"$f":"SUBTOTAL(9,M$7:M1007)","v":0},null,{"$f":"J2","v":"SCHEDULE A"}]
["#BillSheet#"]
["ColHDR"]
["ColHDR","ITEM",{"$nulls":3},"DESCRIPTION","UNIT","QTY","RATE","AMT",null,"RATE","AMOUNT"]
["ColHDR"]
[{"$nulls":5},"PAINTING OF MINOR STRUCTURES"]
["IHDR1","C13.10.1",{"$nulls":3},"Painting:",{"$nulls":6},{"$f":"IF(ISNUMBER(H8),L8*H8,IF(ISNUMBER(J8),J8,IF(J8=\"RATE ONLY\",LOWER(\"RATE ONLY\"),\" \")))","v":" "}]
["Item",null,"C13.10.1.1",null,null,"(Describe structure/article)","m²",{"$nulls":5},{"$f":"IF(ISNUMBER(H9),L9*H9,IF(ISNUMBER(J9),J9,IF(J9=\"RATE ONLY\",LOWER(\"RATE ONLY\"),\" \")))","v":" "}]
["Item",null,"C13.10.1.2",null,null,"(Describe structure/article)","No.",{"$nulls":5}," "]
["Item",null,"C13.10.1.3",null,null,"(Describe structure/article)","m",{"$nulls":5}," "]
["Item",null,"C13.10.1.4",null,null,"(Describe structure/article)","t",{"$nulls":5}," "]
["IHDR1","C13.10.2",{"$nulls":3},"Extra-over item C13.10.2, using non-toxic materials:",{"$nulls":6},{"$f":"IF(ISNUMBER(H13),L13*H13,IF(ISNUMBER(J13),J13,IF(J13=\"RATE ONLY\",LOWER(\"RATE ONLY\"),\" \")))","v":" "}]
["Item",null,"C13.10.2.1",null,null,"(Describe structure/article)","m²",{"$nulls":5}," "]
["Item",null,"C13.10.2.2",null,null,"(Describe structure/article)","No.",{"$nulls":5}," "]
["Item",null,"C13.10.2.3",null,null,"(Describe structure/article)","m",{"$nulls":5}," "]
["Item",null,"C13.10.2.4",null,null,"(Describe structure/article)","t",{"$nulls":5}," "]
["#BillEnd#"]
["#BillEnd#","TOTAL CARRIED FORWARD TO SUMMARY",{"$nulls":10},{"$f":"SUBTOTAL(9,M$11:M17)","v":0}]
["#BillEnd#"]

{"sheet":"13.11","index":71,"n_rows":12,"n_cols":13,"rows_kept":12,"hidden":true}
["#BillSheet#"]
["#BillSheet#","C13.11","STRUCTURAL STEELWORK FOR MAJOR STRUCTURES",{"$nulls":3},"\n",null,null,"SCHEDULE A",{"$f":"SUBTOTAL(9,M$7:M999)","v":0},null,{"$f":"J2","v":"SCHEDULE A"}]
["#BillSheet#"]
["ColHDR"]
["ColHDR","ITEM",{"$nulls":3},"DESCRIPTION","UNIT","QTY","RATE","AMT",null,"RATE","AMOUNT"]
["ColHDR"]
[{"$nulls":5},"STRUCTURAL STEELWORK FOR MAJOR STRUCTURES"]
["IHDR1","C13.11.1",{"$nulls":3},"Supply, fabrication and erection of steelwork (location, member, grade and type identified)","t",{"$nulls":5},{"$f":"IF(ISNUMBER(H8),L8*H8,IF(ISNUMBER(J8),J8,IF(J8=\"RATE ONLY\",LOWER(\"RATE ONLY\"),\" \")))","v":" "}]
["IHDR1","C13.11.2",{"$nulls":3},"Miscellaneous metalwork (location and member to be specified)","No.",{"$nulls":5},{"$f":"IF(ISNUMBER(H9),L9*H9,IF(ISNUMBER(J9),J9,IF(J9=\"RATE ONLY\",LOWER(\"RATE ONLY\"),\" \")))","v":" "}]
["#BillEnd#"]
["#BillEnd#","TOTAL CARRIED FORWARD TO SUMMARY",{"$nulls":10},{"$f":"SUBTOTAL(9,M10:M$10)","v":0}]
["#BillEnd#"]

{"sheet":"13.12","index":72,"n_rows":13,"n_cols":13,"rows_kept":13,"hidden":true}
["#BillSheet#"]
["#BillSheet#","C13.12","STRUCTURAL STEEL PROTECTIVE TREATMENT OF MAJOR STRUCTURES",{"$nulls":6},"SCHEDULE A",{"$f":"SUBTOTAL(9,M$7:M1000)","v":0},null,{"$f":"J2","v":"SCHEDULE A"}]
["#BillSheet#"]
["ColHDR"]
["ColHDR","ITEM",{"$nulls":3},"DESCRIPTION","UNIT","QTY","RATE","AMT",null,"RATE","AMOUNT"]
["ColHDR"]
[{"$nulls":5},"STRUCTURAL STEEL PROTECTIVE TREATMENT OF MAJOR STRUCTURES"]
["IHDR1","C13.12.1",{"$nulls":3},"Steelwork protective system:",{"$nulls":6},{"$f":"IF(ISNUMBER(H8),L8*H8,IF(ISNUMBER(J8),J8,IF(J8=\"RATE ONLY\",LOWER(\"RATE ONLY\"),\" \")))","v":" "}]
["Item",null,"C13.12.1.1",null,null,"(system and location to be specified)","m²",{"$nulls":5},{"$f":"IF(ISNUMBER(H9),L9*H9,IF(ISNUMBER(J9),J9,IF(J9=\"RATE ONLY\",LOWER(\"RATE ONLY\"),\" \")))","v":" "}]
["Item",null,"C13.12.1.2",null,null,"(system and location to be specified)","m²",{"$nulls":5},{"$f":"IF(ISNUMBER(H10),L10*H10,IF(ISNUMBER(J10),J10,IF(J10=\"RATE ONLY\",LOWER(\"RATE ONLY\"),\" \")))","v":" "}]
["#BillEnd#"]
["#BillEnd#","TOTAL CARRIED FORWARD TO SUMMARY",{"$nulls":10},{"$f":"SUBTOTAL(9,M10:M$11)","v":0}]
["#BillEnd#"]

{"sheet":"13.13","index":73,"n_rows":38,"n_cols":13,"rows_kept":38,"hidden":true}
["#BillSheet#"]
["#BillSheet#","C13.13","INCREMENTAL LAUNCHING OF BRIDGE DECKS",{"$nulls":3},"\n",null,null,"SCHEDULE A",{"$f":"SUBTOTAL(9,M$7:M1025)","v":0},null,{"$f":"J2","v":"SCHEDULE A"}]
["#BillSheet#"]
["ColHDR"]
["ColHDR","ITEM",{"$nulls":3},"DESCRIPTION","UNIT","QTY","RATE","AMT",null,"RATE","AMOUNT"]
["ColHDR"]
[{"$nulls":5},"INCREMENTAL LAUNCHING OF BRIDGE DECKS"]
["IHDR1","C13.13.1",{"$nulls":3},"Temporary bridge segment casting yard:",{"$nulls":6},{"$f":"IF(ISNUMBER(H8),L8*H8,IF(ISNUMBER(J8),J8,IF(J8=\"RATE ONLY\",LOWER(\"RATE ONLY\"),\" \")))","v":" "}]
["Item",null,"C13.13.1.1",null,null,"Installation (Description of Structure)","lump sum",{"$nulls":5},{"$f":"IF(ISNUMBER(H9),L9*H9,IF(ISNUMBER(J9),J9,IF(J9=\"RATE ONLY\",LOWER(\"RATE ONLY\"),\" \")))","v":" "}]
["IHDR1","C13.13.2",{"$nulls":3},"Cover to casting area:",{"$nulls":6},{"$f":"IF(ISNUMBER(H10),L10*H10,IF(ISNUMBER(J10),J10,IF(J10=\"RATE ONLY\",LOWER(\"RATE ONLY\"),\" \")))","v":" "}]
["Item",null,"C13.13.2.1",null,null,"Provide cover (Description of Structure)","lump sum",{"$nulls":5}," "]
["Item",null,"C13.13.2.2",null,null,"Re-use (Description of Structure)","lump sum",{"$nulls":5}," "]
["IHDR1","C13.13.3",{"$nulls":3},"Launching girder:",{"$nulls":6},{"$f":"IF(ISNUMBER(H13),L13*H13,IF(ISNUMBER(J13),J13,IF(J13=\"RATE ONLY\",LOWER(\"RATE ONLY\"),\" \")))","v":" "}]
["Item",null,"C13.13.3.1",null,null,"Provide launching girder (Description of Structure)","lump sum",{"$nulls":5}," "]
["Item",null,"C13.13.3.2",null,null,"Re-use (Description of Structure)","lump sum",{"$nulls":5}," "]
["IHDR1","C13.13.4",{"$nulls":3},"Formwork assembly:",{"$nulls":6},{"$f":"IF(ISNUMBER(H16),L16*H16,IF(ISNUMBER(J16),J16,IF(J16=\"RATE ONLY\",LOWER(\"RATE ONLY\"),\" \")))","v":" "}]
["Item",null,"C13.13.4.1",null,null,"Supply formwork assembly (Description of Structure)","lump sum",{"$nulls":5}," "]
["Item",null,"C13.13.4.2",null,null,"Re-use (Description of Structure)","lump sum",{"$nulls":5}," "]
["IHDR1","C13.13.5",{"$nulls":3},"Launching equipment:",{"$nulls":6},{"$f":"IF(ISNUMBER(H19),L19*H19,IF(ISNUMBER(J19),J19,IF(J19=\"RATE ONLY\",LOWER(\"RATE ONLY\"),\" \")))","v":" "}]
["Item",null,"C13.13.5.1",null,null,"Supply launching equipment (Description of Structure)","lump sum",{"$nulls":5}," "]
["Item",null,"C13.13.5.2",null,null,"Re-use (Description of Structure)","lump sum",{"$nulls":5}," "]
["IHDR1","C13.13.6",{"$nulls":3},"Temporary bearings, side guides and launching pads:",{"$nulls":6},{"$f":"IF(ISNUMBER(H22),L22*H22,IF(ISNUMBER(J22),J22,IF(J22=\"RATE ONLY\",LOWER(\"RATE ONLY\"),\" \")))","v":" "}]
["Item",null,"C13.13.6.1",null,null,"Supply temporary bearings","No.",{"$nulls":5}," "]
["Item",null,"C13.13.6.2",null,null,"Supply side guides","No.",{"$nulls":5}," "]
["Item",null,"C13.13.6.3",null,null,"Re-use of temporary bearings","No.",{"$nulls":5}," "]
["Item",null,"C13.13.6.4",null,null,"Re-use of side guides","No.",{"$nulls":5}," "]
["IHDR1","C13.13.7",{"$nulls":3},"Platforms:",{"$nulls":6},{"$f":"IF(ISNUMBER(H27),L27*H27,IF(ISNUMBER(J27),J27,IF(J27=\"RATE ONLY\",LOWER(\"RATE ONLY\"),\" \")))","v":" "}]
["Item",null,"C13.13.7.1",null,null,"Supply platforms (Description of Structure)","No.",{"$nulls":5}," "]
["Item",null,"C13.13.7.2",null,null,"Re-use (Description of Structure)","No.",{"$nulls":5}," "]
["IHDR1","C13.13.8",{"$nulls":3},"Stay system for piers:",{"$nulls":6},{"$f":"IF(ISNUMBER(H30),L30*H30,IF(ISNUMBER(J30),J30,IF(J30=\"RATE ONLY\",LOWER(\"RATE ONLY\"),\" \")))","v":" "}]
["Item",null,"C13.13.8.1",null,null,"Pier (description)","No.",{"$nulls":5}," "]
["IHDR1","C13.13.9",{"$nulls":3},"Launching of deck segments:",{"$nulls":6},{"$f":"IF(ISNUMBER(H32),L32*H32,IF(ISNUMBER(J32),J32,IF(J32=\"RATE ONLY\",LOWER(\"RATE ONLY\"),\" \")))","v":" "}]
["Item",null,"C13.13.9.1",null,null,"Structure (description) deck segments","No.",{"$nulls":5}," "]
["IHDR1","C13.13.10",{"$nulls":3},"Temporary piers including piles and pilecap:",{"$nulls":6},{"$f":"IF(ISNUMBER(H34),L34*H34,IF(ISNUMBER(J34),J34,IF(J34=\"RATE ONLY\",LOWER(\"RATE ONLY\"),\" \")))","v":" "}]
["Item",null,"C13.13.10.1",null,null,"Temporary piers (description)","No.",{"$nulls":5}," "]
["#BillEnd#"]
["#BillEnd#","TOTAL CARRIED FORWARD TO SUMMARY",{"$nulls":10},{"$f":"SUBTOTAL(9,M$11:M35)","v":0}]
["#BillEnd#"]

{"sheet":"13.14","index":74,"n_rows":10,"n_cols":13,"rows_kept":10,"hidden":true}
["#BillSheet#"]
["#BillSheet#","C13.14","SPECIALIST STRUCTURES",{"$nulls":3},"\n",null,null,"SCHEDULE A",{"$f":"SUBTOTAL(9,M$7:M997)","v":0},null,{"$f":"J2","v":"SCHEDULE A"}]
["#BillSheet#"]
["ColHDR"]
["ColHDR","ITEM NO",null,null,"Item no","DESCRIPTION","UNIT","QUANTITY","RATE","AMOUNT",null,"RATE","AMOUNT"]
["ColHDR"]
[{"$nulls":5},"SPECIALIST STRUCTURES"]
["#BillEnd#"]
["#BillEnd#",{"$f":"RIGHT($J$2,5)","v":"ULE A"},{"$nulls":3},"TOTAL CARRIED TO SUMMARY PAGE ",{"$nulls":6},{"$f":"SUBTOTAL(9,M$7:M7)","v":0}]
["#BillEnd#"]

{"sheet":"14.1","index":75,"n_rows":31,"n_cols":13,"rows_kept":31,"hidden":true}
["#BillSheet#"]
["#BillSheet#","C14.1","ACCESS FOR BRIDGE REHABILITAION",{"$nulls":3},"\n",null,null,"SCHEDULE A",{"$f":"SUBTOTAL(9,M$7:M1018)","v":0},null,{"$f":"J2","v":"SCHEDULE A"}]
["#BillSheet#"]
["ColHDR"]
["ColHDR","ITEM",{"$nulls":3},"DESCRIPTION","UNIT","QTY","RATE","AMT",null,"RATE","AMOUNT"]
["ColHDR"]
[{"$nulls":5},"ACCESS FOR BRIDGE REHABILITAION"]
["IHDR1","C14.1.1",{"$nulls":3},"Temporary access structures and work platforms (by element):",{"$nulls":6},{"$f":"IF(ISNUMBER(H8),L8*H8,IF(ISNUMBER(J8),J8,IF(J8=\"RATE ONLY\",LOWER(\"RATE ONLY\"),\" \")))","v":" "}]
["IHDR2",null,"C14.1.1.1",null,null,"Access and platforms to locations as described as well as dismantling and removal at completion (heights assessed by Contractor):",{"$nulls":6},{"$f":"IF(ISNUMBER(H9),L9*H9,IF(ISNUMBER(J9),J9,IF(J9=\"RATE ONLY\",LOWER(\"RATE ONLY\"),\" \")))","v":" "}]
["IHDR3",null,null,"(a)",null,"(Description of bridge or structures given):",{"$nulls":6},{"$f":"IF(ISNUMBER(H10),L10*H10,IF(ISNUMBER(J10),J10,IF(J10=\"RATE ONLY\",LOWER(\"RATE ONLY\"),\" \")))","v":" "}]
["Item1",{"$nulls":3},"(i)","(Element of work requiring access described)","No.",{"$nulls":5},{"$f":"IF(ISNUMBER(H11),L11*H11,IF(ISNUMBER(J11),J11,IF(J11=\"RATE ONLY\",LOWER(\"RATE ONLY\"),\" \")))","v":" "}]
["Item1",{"$nulls":3},"(ii)","(Etc. for other elements of work)","No.",{"$nulls":5}," "]
["IHDR3",null,null,"(b)",null,"(b) (Etc. for other bridges or structures):",{"$nulls":6},{"$f":"IF(ISNUMBER(H13),L13*H13,IF(ISNUMBER(J13),J13,IF(J13=\"RATE ONLY\",LOWER(\"RATE ONLY\"),\" \")))","v":" "}]
["Item1",{"$nulls":3},"(i)","(Element of work requiring access described)","No.",{"$nulls":5}," "]
["Item1",{"$nulls":4},"(Etc. for other elements of work)","No.",{"$nulls":5}," "]
["IHDR1","C14.1.2",{"$nulls":3},"Mobile access units:",{"$nulls":6},{"$f":"IF(ISNUMBER(H16),L16*H16,IF(ISNUMBER(J16),J16,IF(J16=\"RATE ONLY\",LOWER(\"RATE ONLY\"),\" \")))","v":" "}]
["Item",null,"C14.1.2.1",null,null,"Establishment of mobile access unit on site (description of type of unit)","lump sum",{"$nulls":5}," "]
["Item",null,"C14.1.2.2",null,null,"Setting up of mobile access unit at each structure location and removal after completion","No.",{"$nulls":5}," "]
["Item",null,"C14.1.2.3",null,null,"Operation of mobile access unit during repair work at each location (structure)","days",{"$nulls":5}," "]
["Item",null,"C14.1.2.4",null,null,"Operation of mobile access unit during inspections by the Engineer","hours",{"$nulls":5}," "]
["Item",null,"C14.1.2.5",null,null,"De-establishing and removal of mobile access unit from site after completion of work","lump sum",{"$nulls":5}," "]
["IHDR1","C14.1.3",{"$nulls":3},"Access at end of defects liability period (description of location)","lump sum",{"$nulls":5},{"$f":"IF(ISNUMBER(H22),L22*H22,IF(ISNUMBER(J22),J22,IF(J22=\"RATE ONLY\",LOWER(\"RATE ONLY\"),\" \")))","v":" "}]
["IHDR1","C14.1.4",{"$nulls":3},"Attendance by (relevant authority):",{"$nulls":6},{"$f":"IF(ISNUMBER(H23),L23*H23,IF(ISNUMBER(J23),J23,IF(J23=\"RATE ONLY\",LOWER(\"RATE ONLY\"),\" \")))","v":" "}]
["Item",null,"C14.1.4.1",null,null,"Prime cost sum to allow for attendance by relevant authority to obtain access near electrified railway lines or other relevant authorities as required (give description of bridge)","PC sum",{"$nulls":5}," "]
["Item",null,"C14.1.4.2",null,null,"Percentage on prime cost sum for charges and profits","%",{"$nulls":5}," "]
["IHDR1","C14.1.5",{"$nulls":3},"Provision of designs and drawings of access structures and platforms by an ECSA Registered Professional Engineer or Technologist (description of member to which applicable)","lump sum",{"$nulls":5},{"$f":"IF(ISNUMBER(H26),L26*H26,IF(ISNUMBER(J26),J26,IF(J26=\"RATE ONLY\",LOWER(\"RATE ONLY\"),\" \")))","v":" "}]
["IHDR1","C14.1.6",{"$nulls":3},"Provision of a safety gantry with warning system (description of type of gantry, size and location)","No.",{"$nulls":5},{"$f":"IF(ISNUMBER(H27),L27*H27,IF(ISNUMBER(J27),J27,IF(J27=\"RATE ONLY\",LOWER(\"RATE ONLY\"),\" \")))","v":" "}]
["IHDR1","C14.1.7",{"$nulls":3},"Accommodation of Vehicular and Pedestrian Traffic at Access Structures","lump sum",{"$nulls":5},{"$f":"IF(ISNUMBER(H28),L28*H28,IF(ISNUMBER(J28),J28,IF(J28=\"RATE ONLY\",LOWER(\"RATE ONLY\"),\" \")))","v":" "}]
["#BillEnd#"]
["#BillEnd#","TOTAL CARRIED FORWARD TO SUMMARY",{"$nulls":10},{"$f":"SUBTOTAL(9,M$10:M28)","v":0}]
["#BillEnd#"]

{"sheet":"14.2","index":76,"n_rows":30,"n_cols":13,"rows_kept":30,"hidden":true}
["#BillSheet#"]
["#BillSheet#","C14.2","CORROSION SURVEY METHODS AND TESTING OF NEAR SURFACE CONCRETE PROPERTIES",{"$nulls":6},"SCHEDULE A",{"$f":"SUBTOTAL(9,M$7:M1017)","v":0},null,{"$f":"J2","v":"SCHEDULE A"}]
["#BillSheet#"]
["ColHDR"]
["ColHDR","ITEM",{"$nulls":3},"DESCRIPTION","UNIT","QTY","RATE","AMT",null,"RATE","AMOUNT"]
["ColHDR"]
[{"$nulls":5},"CORROSION SURVEY METHODS AND TESTING OF NEAR SURFACE CONCRETE PROPERTIES"]
["IHDR1","C14.2.1",{"$nulls":3},"Delamination Survey:",{"$nulls":6},{"$f":"IF(ISNUMBER(H8),L8*H8,IF(ISNUMBER(J8),J8,IF(J8=\"RATE ONLY\",LOWER(\"RATE ONLY\"),\" \")))","v":" "}]
["Item",null,"C14.2.1.1",null,null,"using hammer tapping technique to (description)","m²",{"$nulls":5},{"$f":"IF(ISNUMBER(H9),L9*H9,IF(ISNUMBER(J9),J9,IF(J9=\"RATE ONLY\",LOWER(\"RATE ONLY\"),\" \")))","v":" "}]
["Item",null,"C14.2.1.2",null,null,"using chain drag technique to (description)","m²",{"$nulls":5}," "]
["Item",null,"C14.2.1.3",null,null,"using extracted core samples (description of location, core size and length)","No.",{"$nulls":5}," "]
["Item",null,"C14.2.1.4",null,null,"using extracted core samples (description of location, core size and length)","m",{"$nulls":5}," "]
["IHDR1","C14.2.2",{"$nulls":3},"Concrete cover survey:",{"$nulls":6},{"$f":"IF(ISNUMBER(H13),L13*H13,IF(ISNUMBER(J13),J13,IF(J13=\"RATE ONLY\",LOWER(\"RATE ONLY\"),\" \")))","v":" "}]
["Item",null,"C14.2.2.1",null,null,"(description of location on structure)","m²",{"$nulls":5}," "]
["IHDR1","C14.2.3",{"$nulls":3},"Concrete compressive strength:",{"$nulls":6},{"$f":"IF(ISNUMBER(H15),L15*H15,IF(ISNUMBER(J15),J15,IF(J15=\"RATE ONLY\",LOWER(\"RATE ONLY\"),\" \")))","v":" "}]
["Item",null,"C14.2.3.1",null,null,"using extracted core samples (description of location, core size and length)","No.",{"$nulls":5}," "]
["Item",null,"C14.2.3.2",null,null,"using extracted core samples (description of location, core size and length)","m",{"$nulls":5}," "]
["IHDR1","C14.2.4",{"$nulls":3},"Carbonation depth testing:",{"$nulls":6},{"$f":"IF(ISNUMBER(H18),L18*H18,IF(ISNUMBER(J18),J18,IF(J18=\"RATE ONLY\",LOWER(\"RATE ONLY\"),\" \")))","v":" "}]
["Item",null,"C14.2.4.1",null,null,"using extracted core samples or fragment removed for (description of location on structure)","No.",{"$nulls":5}," "]
["IHDR1","C14.2.5",{"$nulls":3},"Chloride profile testing:",{"$nulls":6},{"$f":"IF(ISNUMBER(H20),L20*H20,IF(ISNUMBER(J20),J20,IF(J20=\"RATE ONLY\",LOWER(\"RATE ONLY\"),\" \")))","v":" "}]
["Item",null,"C14.2.5.1",null,null,"using extracted core samples or fragment removed for (description of location on structure)","No.",{"$nulls":5}," "]
["IHDR1","C14.2.6",{"$nulls":3},"Half-cell potential measurements:",{"$nulls":6},{"$f":"IF(ISNUMBER(H22),L22*H22,IF(ISNUMBER(J22),J22,IF(J22=\"RATE ONLY\",LOWER(\"RATE ONLY\"),\" \")))","v":" "}]
["Item",null,"C14.2.6.1",null,null,"(description of location on structure)","m²",{"$nulls":5}," "]
["IHDR1","C14.2.7",{"$nulls":3},"Surface resistivity measurements:",{"$nulls":6},{"$f":"IF(ISNUMBER(H24),L24*H24,IF(ISNUMBER(J24),J24,IF(J24=\"RATE ONLY\",LOWER(\"RATE ONLY\"),\" \")))","v":" "}]
["Item",null,"C14.2.7.1",null,null,"(description of location on structure)","m²",{"$nulls":5}," "]
["IHDR1","C14.2.8",{"$nulls":3},"Corrosion rate measurements:",{"$nulls":6},{"$f":"IF(ISNUMBER(H26),L26*H26,IF(ISNUMBER(J26),J26,IF(J26=\"RATE ONLY\",LOWER(\"RATE ONLY\"),\" \")))","v":" "}]
["Item",null,"C14.2.8.1",null,null,"(description of location on structure)","m²",{"$nulls":5}," "]
["#BillEnd#"]
["#BillEnd#","TOTAL CARRIED FORWARD TO SUMMARY",{"$nulls":10},{"$f":"SUBTOTAL(9,M$11:M27)","v":0}]
["#BillEnd#"]

{"sheet":"14.3","index":77,"n_rows":24,"n_cols":13,"rows_kept":24,"hidden":true}
["#BillSheet#"]
["#BillSheet#","C14.3","DEMOLITION AND REMOVAL OF STRUCTURAL CONCRETE AND STEELWORK",{"$nulls":6},"SCHEDULE A",{"$f":"SUBTOTAL(9,M$7:M1011)","v":0},null,{"$f":"J2","v":"SCHEDULE A"}]
["#BillSheet#"]
["ColHDR"]
["ColHDR","ITEM",{"$nulls":3},"DESCRIPTION","UNIT","QTY","RATE","AMT",null,"RATE","AMOUNT"]
["ColHDR"]
[{"$nulls":5},"DEMOLITION AND REMOVAL OF STRUCTURAL CONCRETE AND STEELWORK"]
["IHDR1","C14.3.1",{"$nulls":3},"Demolition of concrete members or elements:",{"$nulls":6},{"$f":"IF(ISNUMBER(H8),L8*H8,IF(ISNUMBER(J8),J8,IF(J8=\"RATE ONLY\",LOWER(\"RATE ONLY\"),\" \")))","v":" "}]
["Item",null,"C14.3.1.1",null,null,"Full member or element (location and description)","m³",{"$nulls":5},{"$f":"IF(ISNUMBER(H9),L9*H9,IF(ISNUMBER(J9),J9,IF(J9=\"RATE ONLY\",LOWER(\"RATE ONLY\"),\" \")))","v":" "}]
["Item",null,"C14.3.1.2",null,null,"Partial member or element (location and description)","m³",{"$nulls":5}," "]
["IHDR1","C14.3.2",{"$nulls":3},"Demolition of concrete members or elements by labour enhanced construction:",{"$nulls":6},{"$f":"IF(ISNUMBER(H11),L11*H11,IF(ISNUMBER(J11),J11,IF(J11=\"RATE ONLY\",LOWER(\"RATE ONLY\"),\" \")))","v":" "}]
["Item",null,"C14.3.2.1",null,null,"Full member or element (location and description)","m³",{"$nulls":5}," "]
["Item",null,"C14.3.2.2",null,null,"Partial member or element (location and description)","m³",{"$nulls":5}," "]
["IHDR1","C14.3.3",{"$nulls":3},"Demolition of structural steel structures, members or elements (location and description):",{"$nulls":6},{"$f":"IF(ISNUMBER(H14),L14*H14,IF(ISNUMBER(J14),J14,IF(J14=\"RATE ONLY\",LOWER(\"RATE ONLY\"),\" \")))","v":" "}]
["Item",null,"C14.3.3.1",null,null,"Full member or element (location and description)","ton",{"$nulls":5}," "]
["Item",null,"C14.3.3.2",null,null,"Partial member or element (location and description)","ton",{"$nulls":5}," "]
["IHDR1","C14.3.4",{"$nulls":3},"Demolition of structural steel structures, members or elements by labour optimised construction (location and description):",{"$nulls":6},{"$f":"IF(ISNUMBER(H17),L17*H17,IF(ISNUMBER(J17),J17,IF(J17=\"RATE ONLY\",LOWER(\"RATE ONLY\"),\" \")))","v":" "}]
["Item",null,"C14.3.4.1",null,null,"Full member or element (location and description)","ton",{"$nulls":5}," "]
["Item",null,"C14.3.4.2",null,null,"Partial member or element (location and description)","ton",{"$nulls":5}," "]
["IHDR1","C14.3.5",{"$nulls":3},"Removal of metal sections embedded in concrete (description)","No.",{"$nulls":5},{"$f":"IF(ISNUMBER(H20),L20*H20,IF(ISNUMBER(J20),J20,IF(J20=\"RATE ONLY\",LOWER(\"RATE ONLY\"),\" \")))","v":" "}]
["IHDR1","C14.3.6",{"$nulls":3},"Establishment on site for hydro-demolition equipment","lump sum",{"$nulls":5},{"$f":"IF(ISNUMBER(H21),L21*H21,IF(ISNUMBER(J21),J21,IF(J21=\"RATE ONLY\",LOWER(\"RATE ONLY\"),\" \")))","v":" "}]
["#BillEnd#"]
["#BillEnd#","TOTAL CARRIED FORWARD TO SUMMARY",{"$nulls":10},{"$f":"SUBTOTAL(9,M$11:M21)","v":0}]
["#BillEnd#"]

{"sheet":"14.4","index":78,"n_rows":29,"n_cols":13,"rows_kept":29,"hidden":true}
["#BillSheet#"]
["#BillSheet#","C14.4","SURFACE AND STRUCTURAL REPAIR OF CONCRETE MEMBERS",{"$nulls":6},"SCHEDULE A",{"$f":"SUBTOTAL(9,M$7:M1016)","v":0},null,{"$f":"J2","v":"SCHEDULE A"}]
["#BillSheet#"]
["ColHDR"]
["ColHDR","ITEM",{"$nulls":3},"DESCRIPTION","UNIT","QTY","RATE","AMT",null,"RATE","AMOUNT"]
["ColHDR"]
[{"$nulls":5},"SURFACE AND STRUCTURAL REPAIR OF CONCRETE MEMBERS"]
["IHDR1","C14.4.1",{"$nulls":3},"Cementitious mortar or concrete (Class) to (description)","litre",{"$nulls":5},{"$f":"IF(ISNUMBER(H8),L8*H8,IF(ISNUMBER(J8),J8,IF(J8=\"RATE ONLY\",LOWER(\"RATE ONLY\"),\" \")))","v":" "}]
["IHDR1","C14.4.2",{"$nulls":3},"Epoxy mortar","litre",{"$nulls":5},{"$f":"IF(ISNUMBER(H9),L9*H9,IF(ISNUMBER(J9),J9,IF(J9=\"RATE ONLY\",LOWER(\"RATE ONLY\"),\" \")))","v":" "}]
["IHDR1","C14.4.3",{"$nulls":3},"Proprietary cementitious repair system (Class and generic description) in positions as indicated in accordance with Table A14.4.5-1:",{"$nulls":6},{"$f":"IF(ISNUMBER(H10),L10*H10,IF(ISNUMBER(J10),J10,IF(J10=\"RATE ONLY\",LOWER(\"RATE ONLY\"),\" \")))","v":" "}]
["IHDR2",null,"C14.4.3.1",null,null,"Class R4 – (Generic description):",{"$nulls":6},{"$f":"IF(ISNUMBER(H11),L11*H11,IF(ISNUMBER(J11),J11,IF(J11=\"RATE ONLY\",LOWER(\"RATE ONLY\"),\" \")))","v":" "}]
["Item",null,null,"(a)",null,"(Position indicated)","litre",{"$nulls":5},{"$f":"IF(ISNUMBER(H12),L12*H12,IF(ISNUMBER(J12),J12,IF(J12=\"RATE ONLY\",LOWER(\"RATE ONLY\"),\" \")))","v":" "}]
["Item",null,null,"(b)",null,"(Etc. for other positions)","litre",{"$nulls":5}," "]
["IHDR2",null,"C14.4.3.2",null,null,"Class R3 – (Generic description):",{"$nulls":6},{"$f":"IF(ISNUMBER(H14),L14*H14,IF(ISNUMBER(J14),J14,IF(J14=\"RATE ONLY\",LOWER(\"RATE ONLY\"),\" \")))","v":" "}]
["Item",null,null,"(a)",null,"(Position indicated)","litre",{"$nulls":5}," "]
["Item",null,null,"(b)",null,"(Etc. for other positions)","litre",{"$nulls":5}," "]
["IHDR2",null,"C14.4.3.3",null,null,"Class R2 – (Generic description):",{"$nulls":6},{"$f":"IF(ISNUMBER(H17),L17*H17,IF(ISNUMBER(J17),J17,IF(J17=\"RATE ONLY\",LOWER(\"RATE ONLY\"),\" \")))","v":" "}]
["Item",null,null,"(a)",null,"(Position indicated)","litre",{"$nulls":5}," "]
["Item",null,null,"(b)",null,"(Etc. for other positions)","litre",{"$nulls":5}," "]
["IHDR2",null,"C14.4.3.4",null,null,"Class R1 – (Generic description):",{"$nulls":6},{"$f":"IF(ISNUMBER(H20),L20*H20,IF(ISNUMBER(J20),J20,IF(J20=\"RATE ONLY\",LOWER(\"RATE ONLY\"),\" \")))","v":" "}]
["Item",null,null,"(a)",null,"(Position indicated)","litre",{"$nulls":5}," "]
["Item",null,null,"(b)",null,"(Etc. for other positions)","litre",{"$nulls":5}," "]
["IHDR1","C14.4.4",{"$nulls":3},"Curing of repair surfaces:",{"$nulls":6},{"$f":"IF(ISNUMBER(H23),L23*H23,IF(ISNUMBER(J23),J23,IF(J23=\"RATE ONLY\",LOWER(\"RATE ONLY\"),\" \")))","v":" "}]
["Item",null,"C14.4.4.1",null,null,"By coating the surface with (type indicated) to (description)","m²",{"$nulls":5}," "]
["Item",null,"C14.4.4.2",null,null,"Curing by (method indicated) to (description)","m²",{"$nulls":5}," "]
["IHDR1","C14.4.5",{"$nulls":3},"Sounding survey (Prior to repair of the surface)","m²",{"$nulls":5},{"$f":"IF(ISNUMBER(H26),L26*H26,IF(ISNUMBER(J26),J26,IF(J26=\"RATE ONLY\",LOWER(\"RATE ONLY\"),\" \")))","v":" "}]
["#BillEnd#"]
["#BillEnd#","TOTAL CARRIED FORWARD TO SUMMARY",{"$nulls":10},{"$f":"SUBTOTAL(9,M$10:M26)","v":0}]
["#BillEnd#"]

{"sheet":"14.5","index":79,"n_rows":26,"n_cols":13,"rows_kept":26,"hidden":true}
["#BillSheet#"]
["#BillSheet#","C14.5","ANCHORING OF REINFORCEMENT, GROUTING AND CRACK INJECTION",{"$nulls":3},"\n",null,null,"SCHEDULE A",{"$f":"SUBTOTAL(9,M$7:M1013)","v":0},null,{"$f":"J2","v":"SCHEDULE A"}]
["#BillSheet#"]
["ColHDR"]
["ColHDR","ITEM",{"$nulls":3},"DESCRIPTION","UNIT","QTY","RATE","AMT",null,"RATE","AMOUNT"]
["ColHDR"]
[{"$nulls":5},"ANCHORING OF REINFORCEMENT, GROUTING AND CRACK INJECTION"]
["IHDR1","C14.5.1",{"$nulls":3},"Anchoring of reinforcing steel:",{"$nulls":6},{"$f":"IF(ISNUMBER(H8),L8*H8,IF(ISNUMBER(J8),J8,IF(J8=\"RATE ONLY\",LOWER(\"RATE ONLY\"),\" \")))","v":" "}]
["Item",null,"C14.5.1.1",null,null,"Reinforcing (type, bar diameter) into formed holes (hole diameter and depth stated) in (description of member)","No.",{"$nulls":5},{"$f":"IF(ISNUMBER(H9),L9*H9,IF(ISNUMBER(J9),J9,IF(J9=\"RATE ONLY\",LOWER(\"RATE ONLY\"),\" \")))","v":" "}]
["Item",null,"C14.5.1.2",null,null,"Reinforcing (type, bar diameter) into pockets (pocket size and depth stated) in (description of member)","No.",{"$nulls":5}," "]
["IHDR1","C14.5.2",{"$nulls":3},"Preparation of contact surfaces for grouting (type, position and size indicated)","No.",{"$nulls":5},{"$f":"IF(ISNUMBER(H11),L11*H11,IF(ISNUMBER(J11),J11,IF(J11=\"RATE ONLY\",LOWER(\"RATE ONLY\"),\" \")))","v":" "}]
["IHDR1","C14.5.3",{"$nulls":3},"Grouting for:",{"$nulls":6},{"$f":"IF(ISNUMBER(H12),L12*H12,IF(ISNUMBER(J12),J12,IF(J12=\"RATE ONLY\",LOWER(\"RATE ONLY\"),\" \")))","v":" "}]
["item",null,"C14.5.3.1",null,null,"Bedding (type, thickness and size indicated) to (description)","litre",{"$nulls":5},{"$f":"IF(ISNUMBER(H13),L13*H13,IF(ISNUMBER(J13),J13,IF(J13=\"RATE ONLY\",LOWER(\"RATE ONLY\"),\" \")))","v":" "}]
["Item",null,"C14.5.3.2",null,null,"Gap filling (type, thickness and size indicated) to (description)","litre",{"$nulls":5}," "]
["IHDR1","C14.5.4",{"$nulls":3},"Establishment on site for crack injection","lump sum",{"$nulls":5},{"$f":"IF(ISNUMBER(H15),L15*H15,IF(ISNUMBER(J15),J15,IF(J15=\"RATE ONLY\",LOWER(\"RATE ONLY\"),\" \")))","v":" "}]
["IHDR1","C14.5.5",{"$nulls":3},"Surface preparation and surface sealing for crack injection to (location on structure)","m",{"$nulls":5},{"$f":"IF(ISNUMBER(H16),L16*H16,IF(ISNUMBER(J16),J16,IF(J16=\"RATE ONLY\",LOWER(\"RATE ONLY\"),\" \")))","v":" "}]
["IHDR1","C14.5.6",{"$nulls":3},"Crack injection adhesive to (location on structure)","litre",{"$nulls":5},{"$f":"IF(ISNUMBER(H17),L17*H17,IF(ISNUMBER(J17),J17,IF(J17=\"RATE ONLY\",LOWER(\"RATE ONLY\"),\" \")))","v":" "}]
["IHDR1","C14.5.7",{"$nulls":3},"Crack filling:",{"$nulls":6},{"$f":"IF(ISNUMBER(H18),L18*H18,IF(ISNUMBER(J18),J18,IF(J18=\"RATE ONLY\",LOWER(\"RATE ONLY\"),\" \")))","v":" "}]
["Item",null,"C14.5.7.1",null,null,"Repair system to (location on structure)","m",{"$nulls":5}," "]
["IHDR1","C14.5.8",{"$nulls":3},"Site and core tests:",{"$nulls":6},{"$f":"IF(ISNUMBER(H20),L20*H20,IF(ISNUMBER(J20),J20,IF(J20=\"RATE ONLY\",LOWER(\"RATE ONLY\"),\" \")))","v":" "}]
["Item",null,"C14.5.8.1",null,null,"Drilling of cores (specify diameter of cores)","m",{"$nulls":5}," "]
["Item",null,"C14.5.8.2",null,null,"Site testing and testing of cores","prov sum",{"$nulls":5}," "]
["Item",null,"C14.5.8.3",null,null,"Percentage on provisional sum for charges and profit","%",{"$nulls":5}," "]
["#BillEnd#"]
["#BillEnd#","TOTAL CARRIED FORWARD TO SUMMARY",{"$nulls":10},{"$f":"SUBTOTAL(9,M$11:M23)","v":0}]
["#BillEnd#"]

{"sheet":"14.6","index":80,"n_rows":17,"n_cols":13,"rows_kept":17,"hidden":true}
["#BillSheet#"]
["#BillSheet#","C14.6","SPRAYED CONCRETE FOR STRUCTURES",{"$nulls":3},"\n",null,null,"SCHEDULE A",{"$f":"SUBTOTAL(9,M$7:M1004)","v":0},null,{"$f":"J2","v":"SCHEDULE A"}]
["#BillSheet#"]
["ColHDR"]
["ColHDR","ITEM",{"$nulls":3},"DESCRIPTION","UNIT","QTY","RATE","AMT",null,"RATE","AMOUNT"]
["ColHDR"]
[{"$nulls":5},"SPRAYED CONCRETE FOR STRUCTURES"]
["IHDR1","C14.6.1",{"$nulls":3},"Establishment on site for sprayed concrete work","lump sum",{"$nulls":5},{"$f":"IF(ISNUMBER(H8),L8*H8,IF(ISNUMBER(J8),J8,IF(J8=\"RATE ONLY\",LOWER(\"RATE ONLY\"),\" \")))","v":" "}]
["IHDR1","C14.6.2",{"$nulls":3},"Preparation of concrete surface","m²",{"$nulls":5}," "]
["IHDR1","C14.6.3",{"$nulls":3},"Sprayed concrete of specified strength class, thickness and finish applied in one or multiple layers as necessary:",{"$nulls":6}," "]
["item",null,"C14.6.3.1",null,null,"Indicate strength, thickness, finish of sprayed concrete to portion of structure or use","m²",{"$nulls":5}," "]
["item",null,"C14.6.3.2",null,null,"Etc. for other strength, thickness, finish of sprayed concrete to other portions of structure or uses","m²",{"$nulls":5}," "]
["IHDR1","C14.6.4",{"$nulls":3},"Curing of sprayed concrete surface","m²",{"$nulls":5}," "]
["IHDR1","C14.6.5",{"$nulls":3},"Special tests ordered by the Engineer","prov sum",{"$nulls":5}," "]
["#BillEnd#"]
["#BillEnd#","TOTAL CARRIED FORWARD TO SUMMARY",{"$nulls":10},{"$f":"SUBTOTAL(9,M$10:M14)","v":0}]
["#BillEnd#"]

{"sheet":"14.7","index":81,"n_rows":14,"n_cols":13,"rows_kept":14,"hidden":true}
["#BillSheet#"]
["#BillSheet#","C14.7","PROTECTIVE COATINGS AND TREATMENTS FOR CONCRETE",{"$nulls":3},"\n",null,null,"SCHEDULE A",{"$f":"SUBTOTAL(9,M$7:M1001)","v":0},null,{"$f":"J2","v":"SCHEDULE A"}]
["#BillSheet#"]
["ColHDR"]
["ColHDR","ITEM",{"$nulls":3},"DESCRIPTION","UNIT","QTY","RATE","AMT",null,"RATE","AMOUNT"]
["ColHDR"]
[{"$nulls":5},"PROTECTIVE COATINGS AND TREATMENTS FOR CONCRETE"]
["IHDR1","C14.7.1",{"$nulls":3},"Cleaning and preparation of concrete surface (method and surface finish indicated)","m²",{"$nulls":5},{"$f":"IF(ISNUMBER(H8),L8*H8,IF(ISNUMBER(J8),J8,IF(J8=\"RATE ONLY\",LOWER(\"RATE ONLY\"),\" \")))","v":" "}]
["IHDR1","C14.7.2",{"$nulls":3},"Application of protective coatings and treatments (type and application rate indicated)","m²",{"$nulls":5},{"$f":"IF(ISNUMBER(H9),L9*H9,IF(ISNUMBER(J9),J9,IF(J9=\"RATE ONLY\",LOWER(\"RATE ONLY\"),\" \")))","v":" "}]
["IHDR1","C14.7.3",{"$nulls":3},"On site monitoring and supply of written product performance guarantee","lump sum",{"$nulls":5},{"$f":"IF(ISNUMBER(H10),L10*H10,IF(ISNUMBER(J10),J10,IF(J10=\"RATE ONLY\",LOWER(\"RATE ONLY\"),\" \")))","v":" "}]
["IHDR1","C14.7.4",{"$nulls":3},"Trial sample panels","m²",{"$nulls":5},{"$f":"IF(ISNUMBER(H11),L11*H11,IF(ISNUMBER(J11),J11,IF(J11=\"RATE ONLY\",LOWER(\"RATE ONLY\"),\" \")))","v":" "}]
["#BillEnd#"]
["#BillEnd#","TOTAL CARRIED FORWARD TO SUMMARY",{"$nulls":10},{"$f":"SUBTOTAL(9,M$10:M11)","v":0}]
["#BillEnd#"]

{"sheet":"14.8","index":82,"n_rows":25,"n_cols":13,"rows_kept":25,"hidden":true}
["#BillSheet#"]
["#BillSheet#","C14.8","EXTERNAL BONDING OF STEEL AND CARBON FIBRE",{"$nulls":3},"\n",null,null,"SCHEDULE A",{"$f":"SUBTOTAL(9,M$7:M1012)","v":0},null,{"$f":"J2","v":"SCHEDULE A"}]
["#BillSheet#"]
["ColHDR"]
["ColHDR","ITEM",{"$nulls":3},"DESCRIPTION","UNIT","QTY","RATE","AMT",null,"RATE","AMOUNT"]
["ColHDR"]
[{"$nulls":5},"EXTERNAL BONDING OF STEEL AND CARBON FIBRE"]
["IHDR1","C14.8.1",{"$nulls":3},"Moving to and setting up the equipment at each work site (description of location)","No.",{"$nulls":5},{"$f":"IF(ISNUMBER(H8),L8*H8,IF(ISNUMBER(J8),J8,IF(J8=\"RATE ONLY\",LOWER(\"RATE ONLY\"),\" \")))","v":" "}]
["IHDR1","C14.8.2",{"$nulls":3},"Preparation of concrete surfaces:",{"$nulls":6},{"$f":"IF(ISNUMBER(H9),L9*H9,IF(ISNUMBER(J9),J9,IF(J9=\"RATE ONLY\",LOWER(\"RATE ONLY\"),\" \")))","v":" "}]
["Item",null,"C14.8.2.1",null,null,"Concrete surfaces for plate bonding (position, size and material indicated)","m²",{"$nulls":5},{"$f":"IF(ISNUMBER(H10),L10*H10,IF(ISNUMBER(J10),J10,IF(J10=\"RATE ONLY\",LOWER(\"RATE ONLY\"),\" \")))","v":" "}]
["Item",null,"C14.8.2.2",null,null,"Slots in concrete for steel or carbon fibre bonding (position, size and material indicated)","m",{"$nulls":5}," "]
["IHDR1","C14.8.3",{"$nulls":3},"Adhesive and saturant:",{"$nulls":6},{"$f":"IF(ISNUMBER(H12),L12*H12,IF(ISNUMBER(J12),J12,IF(J12=\"RATE ONLY\",LOWER(\"RATE ONLY\"),\" \")))","v":" "}]
["Item",null,"C14.8.3.1",null,null,"Adhesive (description or type to location)","litre",{"$nulls":5}," "]
["Item",null,"C14.8.3.2",null,null,"Saturant (description or type to location)","kg",{"$nulls":5}," "]
["IHDR1","C14.8.4",{"$nulls":3},"Bonded plates, bars or sections:",{"$nulls":6},{"$f":"IF(ISNUMBER(H15),L15*H15,IF(ISNUMBER(J15),J15,IF(J15=\"RATE ONLY\",LOWER(\"RATE ONLY\"),\" \")))","v":" "}]
["Item",null,"C14.8.4.1",null,null,"Plates (description of material, unit, size and mass)","No.",{"$nulls":5}," "]
["Item",null,"C14.8.4.2",null,null,"Bars (material, type and size indicated)","kg",{"$nulls":5}," "]
["Item",null,"C14.8.4.3",null,null,"Sections (material, type and size indicated)","No.",{"$nulls":5}," "]
["Item",null,"C14.8.4.4",null,null,"Elements (material, description)","No.",{"$nulls":5}," "]
["Item",null,"C14.8.4.5",null,null,"Fibre fabric material (material and type indicated)","m²",{"$nulls":5}," "]
["IHDR1","C14.8.5",{"$nulls":3},"Fixing studs and bolts (type and size indicated)","No.",{"$nulls":5},{"$f":"IF(ISNUMBER(H21),L21*H21,IF(ISNUMBER(J21),J21,IF(J21=\"RATE ONLY\",LOWER(\"RATE ONLY\"),\" \")))","v":" "}]
["IHDR1","C14.8.6",{"$nulls":3},"Protective paint coatings (type and film thickness indicated)","m²",{"$nulls":5},{"$f":"IF(ISNUMBER(H22),L22*H22,IF(ISNUMBER(J22),J22,IF(J22=\"RATE ONLY\",LOWER(\"RATE ONLY\"),\" \")))","v":" "}]
["#BillEnd#"]
["#BillEnd#","TOTAL CARRIED FORWARD TO SUMMARY",{"$nulls":10},{"$f":"SUBTOTAL(9,M$10:M22)","v":0}]
["#BillEnd#"]

{"sheet":"14.9","index":83,"n_rows":43,"n_cols":13,"rows_kept":43,"hidden":true}
["#BillSheet#"]
["#BillSheet#","C14.9","REPAIR AND REPLACEMENT OF ANCILLARY STRUCTURAL ELEMENTS",{"$nulls":3},"\n",null,null,"SCHEDULE A",{"$f":"SUBTOTAL(9,M$7:M1030)","v":0},null,{"$f":"J2","v":"SCHEDULE A"}]
["#BillSheet#"]
["ColHDR"]
["ColHDR","ITEM",{"$nulls":3},"DESCRIPTION","UNIT","QTY","RATE","AMT",null,"RATE","AMOUNT"]
["ColHDR"]
[{"$nulls":5},"REPAIR AND REPLACEMENT OF ANCILLARY STRUCTURAL ELEMENTS"]
["IHDR1","C14.9.1",{"$nulls":3},"Removal of debris from expansion gaps (description)","m",{"$nulls":5},{"$f":"IF(ISNUMBER(H8),L8*H8,IF(ISNUMBER(J8),J8,IF(J8=\"RATE ONLY\",LOWER(\"RATE ONLY\"),\" \")))","v":" "}]
["IHDR1","C14.9.2",{"$nulls":3},"Clear bridge drainage system (description of elements)","No.",{"$nulls":5},{"$f":"IF(ISNUMBER(H9),L9*H9,IF(ISNUMBER(J9),J9,IF(J9=\"RATE ONLY\",LOWER(\"RATE ONLY\"),\" \")))","v":" "}]
["IHDR1","C14.9.3",{"$nulls":3},"Service and repair of existing joint system",{"$nulls":6},{"$f":"IF(ISNUMBER(H10),L10*H10,IF(ISNUMBER(J10),J10,IF(J10=\"RATE ONLY\",LOWER(\"RATE ONLY\"),\" \")))","v":" "}]
["IHDR2",null,"C14.9.3.1",null,null,"Service and repair of bridge joints (description)","m",{"$nulls":5},{"$f":"IF(ISNUMBER(H11),L11*H11,IF(ISNUMBER(J11),J11,IF(J11=\"RATE ONLY\",LOWER(\"RATE ONLY\"),\" \")))","v":" "}]
["IHDR1","C14.9.4",{"$nulls":3},"Joint terminations as specified on the drawings in:",{"$nulls":6},{"$f":"IF(ISNUMBER(H12),L12*H12,IF(ISNUMBER(J12),J12,IF(J12=\"RATE ONLY\",LOWER(\"RATE ONLY\"),\" \")))","v":" "}]
["Item",null,"C14.9.4.1",null,null,"Barriers and Parapets (type of joint indicated)","No.",{"$nulls":5},{"$f":"IF(ISNUMBER(H13),L13*H13,IF(ISNUMBER(J13),J13,IF(J13=\"RATE ONLY\",LOWER(\"RATE ONLY\"),\" \")))","v":" "}]
["Item",null,"C14.9.4.2",null,null,"Sidewalks (type of joint indicated)","No.",{"$nulls":5}," "]
["IHDR1","C14.9.5",{"$nulls":3},"Cover plates (nonmetallic) in barriers, parapets and sidewalks as specified on the drawings in:",{"$nulls":6},{"$f":"IF(ISNUMBER(H15),L15*H15,IF(ISNUMBER(J15),J15,IF(J15=\"RATE ONLY\",LOWER(\"RATE ONLY\"),\" \")))","v":" "}]
["Item",null,"C14.9.5.1",null,null,"Barriers and Parapets (type of joint indicated)","No.",{"$nulls":5}," "]
["Item",null,"C14.9.5.2",null,null,"Sidewalks (type of joint indicated)","No.",{"$nulls":5}," "]
["IHDR1","C14.9.6",{"$nulls":3},"Repair of handrails (description of work)","m",{"$nulls":5},{"$f":"IF(ISNUMBER(H18),L18*H18,IF(ISNUMBER(J18),J18,IF(J18=\"RATE ONLY\",LOWER(\"RATE ONLY\"),\" \")))","v":" "}]
["IHDR1","C14.9.7",{"$nulls":3},"Removal and reinstatement of brickwork on bridges (description and wall thickness)","m²",{"$nulls":5},{"$f":"IF(ISNUMBER(H19),L19*H19,IF(ISNUMBER(J19),J19,IF(J19=\"RATE ONLY\",LOWER(\"RATE ONLY\"),\" \")))","v":" "}]
["IHDR1","C14.9.8",{"$nulls":3},"Drilling of drainage holes into void formers from deck soffit (size of hole indicated)","No.",{"$nulls":5},{"$f":"IF(ISNUMBER(H20),L20*H20,IF(ISNUMBER(J20),J20,IF(J20=\"RATE ONLY\",LOWER(\"RATE ONLY\"),\" \")))","v":" "}]
["IHDR1","C14.9.9",{"$nulls":3},"Refurbishment of bearings (type and size described):",{"$nulls":6},{"$f":"IF(ISNUMBER(H21),L21*H21,IF(ISNUMBER(J21),J21,IF(J21=\"RATE ONLY\",LOWER(\"RATE ONLY\"),\" \")))","v":" "}]
["Item",null,"C14.9.9.1",null,null,"Removal and inspection","No.",{"$nulls":5}," "]
["Item",null,"C14.9.9.2",null,null,"Refurbish and reinstall","No.",{"$nulls":5}," "]
["IHDR1","C14.9.10",{"$nulls":3},"Replace PVC junctions in deck (type and size described)","No.",{"$nulls":5},{"$f":"IF(ISNUMBER(H24),L24*H24,IF(ISNUMBER(J24),J24,IF(J24=\"RATE ONLY\",LOWER(\"RATE ONLY\"),\" \")))","v":" "}]
["IHDR1","C14.9.11",{"$nulls":3},"Reseal PVC junctions in deck drainage network (type and size described)","No.",{"$nulls":5},{"$f":"IF(ISNUMBER(H25),L25*H25,IF(ISNUMBER(J25),J25,IF(J25=\"RATE ONLY\",LOWER(\"RATE ONLY\"),\" \")))","v":" "}]
["IHDR1","C14.9.12",{"$nulls":3},"Refurbishment of bearings (type and size described):",{"$nulls":6},{"$f":"IF(ISNUMBER(H26),L26*H26,IF(ISNUMBER(J26),J26,IF(J26=\"RATE ONLY\",LOWER(\"RATE ONLY\"),\" \")))","v":" "}]
["Item",null,"C14.9.12.1",null,null,"Inlet grating in kerb (size)","No.",{"$nulls":5}," "]
["Item",null,"C14.9.12.2",null,null,"Other types of gratings (indicate details)","No.",{"$nulls":5}," "]
["IHDR1","C14.9.13",{"$nulls":3},"Seal deck drainage outlets at deck level (size)","No.",{"$nulls":5},{"$f":"IF(ISNUMBER(H29),L29*H29,IF(ISNUMBER(J29),J29,IF(J29=\"RATE ONLY\",LOWER(\"RATE ONLY\"),\" \")))","v":" "}]
["IHDR1","C14.9.14",{"$nulls":3},"Refurbishment of bearings (type and size described):",{"$nulls":6},{"$f":"IF(ISNUMBER(H30),L30*H30,IF(ISNUMBER(J30),J30,IF(J30=\"RATE ONLY\",LOWER(\"RATE ONLY\"),\" \")))","v":" "}]
["Item",null,"C14.9.14.1",null,null,"Refurbishment of existing plates","No.",{"$nulls":5}," "]
["Item",null,"C14.9.14.2",null,null,"New number plate","No.",{"$nulls":5}," "]
["IHDR1","C14.9.15",{"$nulls":3},"Fix or re-fix ancillary elements:",{"$nulls":6},{"$f":"IF(ISNUMBER(H33),L33*H33,IF(ISNUMBER(J33),J33,IF(J33=\"RATE ONLY\",LOWER(\"RATE ONLY\"),\" \")))","v":" "}]
["Item",null,"C14.9.15.1",null,null,"(Description of element)","m",{"$nulls":5}," "]
["Item",null,"C14.9.15.2",null,null,"(Description of element)","No.",{"$nulls":5}," "]
["Item",null,"C14.9.15.3",null,null,"(Description of element)","m²",{"$nulls":5}," "]
["IHDR1","C14.9.16",{"$nulls":3},"Supply new ancillary elements:",{"$nulls":6},{"$f":"IF(ISNUMBER(H37),L37*H37,IF(ISNUMBER(J37),J37,IF(J37=\"RATE ONLY\",LOWER(\"RATE ONLY\"),\" \")))","v":" "}]
["Item",null,"C14.9.16.1",null,null,"(Description of element)","m",{"$nulls":5}," "]
["Item",null,"C14.9.16.2",null,null,"(Description of element)","m²",{"$nulls":5}," "]
["IHDR1","C14.9.17",{"$nulls":3},"Light fittings (description of element)","prov sum",{"$nulls":5},{"$f":"IF(ISNUMBER(H40),L40*H40,IF(ISNUMBER(J40),J40,IF(J40=\"RATE ONLY\",LOWER(\"RATE ONLY\"),\" \")))","v":" "}]
["#BillEnd#"]
["#BillEnd#","TOTAL CARRIED FORWARD TO SUMMARY",{"$nulls":10},{"$f":"SUBTOTAL(9,M$10:M40)","v":0}]
["#BillEnd#"]

{"sheet":"14.10","index":84,"n_rows":17,"n_cols":13,"rows_kept":17,"hidden":true}
["#BillSheet#"]
["#BillSheet#","C14.10","JACKING OF BRIDGE STRUCTURES",{"$nulls":3},"\n",null,null,"SCHEDULE A",{"$f":"SUBTOTAL(9,M$7:M1004)","v":0},null,{"$f":"J2","v":"SCHEDULE A"}]
["#BillSheet#"]
["ColHDR"]
["ColHDR","ITEM",{"$nulls":3},"DESCRIPTION","UNIT","QTY","RATE","AMT",null,"RATE","AMOUNT"]
["ColHDR"]
[{"$nulls":5},"JACKING OF BRIDGE STRUCTURES"]
["IHDR1","C14.10.1",{"$nulls":3},"Temporary support and foundations:",{"$nulls":6},{"$f":"IF(ISNUMBER(H8),L8*H8,IF(ISNUMBER(J8),J8,IF(J8=\"RATE ONLY\",LOWER(\"RATE ONLY\"),\" \")))","v":" "}]
["Item",null,"C14.10.1.1",null,null,"Design, construct and erect temporary supports for the jacking of (bridge deck)","lump sum",{"$nulls":5}," "]
["Item",null,"C14.10.1.2",null,null,"Dismantle and remove from site","lump sum",{"$nulls":5}," "]
["IHDR1","C14.10.2",{"$nulls":3},"Jacking equipment:",{"$nulls":6}," "]
["Item",null,"C14.10.2.1",null,null,"Design, supply and install equipment for the jacking of (bridge deck)","lump sum",{"$nulls":5}," "]
["Item",null,"C14.10.2.2",null,null,"Dismantle and remove all jacking equipment from site","lump sum",{"$nulls":5}," "]
["IHDR1","C14.10.3",{"$nulls":3},"Vertical jacking of the bridge deck (site details)","No.",{"$nulls":5}," "]
["#BillEnd#"]
["#BillEnd#","TOTAL CARRIED FORWARD TO SUMMARY",{"$nulls":10},{"$f":"SUBTOTAL(9,M$11:M14)","v":0}]
["#BillEnd#"]

{"sheet":"14.11","index":85,"n_rows":12,"n_cols":13,"rows_kept":12,"hidden":true}
["#BillSheet#"]
["#BillSheet#","C14.11","REPAIR OF STEEL ELEMENTS",{"$nulls":3},"\n",null,null,"SCHEDULE A",{"$f":"SUBTOTAL(9,M$7:M999)","v":0},null,{"$f":"J2","v":"SCHEDULE A"}]
["#BillSheet#"]
["ColHDR"]
["ColHDR","ITEM",{"$nulls":3},"DESCRIPTION","UNIT","QTY","RATE","AMT",null,"RATE","AMOUNT"]
["ColHDR"]
[{"$nulls":5},"REPAIR OF STEEL ELEMENTS"]
["IHDR1","C14.11.1",{"$nulls":3},"Refurbishment of (describe item)","No.",{"$nulls":5},{"$f":"IF(ISNUMBER(H8),L8*H8,IF(ISNUMBER(J8),J8,IF(J8=\"RATE ONLY\",LOWER(\"RATE ONLY\"),\" \")))","v":" "}]
["IHDR1","C14.11.2",{"$nulls":3},"Replacement of rivets or bolts with HSFG bolts (diameter and class indicated)","No.",{"$nulls":5},{"$f":"IF(ISNUMBER(H9),L9*H9,IF(ISNUMBER(J9),J9,IF(J9=\"RATE ONLY\",LOWER(\"RATE ONLY\"),\" \")))","v":" "}]
["#BillEnd#"]
["#BillEnd#","TOTAL CARRIED FORWARD TO SUMMARY",{"$nulls":10},{"$f":"SUBTOTAL(9,M10:M$10)","v":0}]
["#BillEnd#"]

{"sheet":"20.1","index":86,"n_rows":92,"n_cols":10,"rows_kept":92}
["#BillSheet#"]
["#BillSheet#","C20.1 ","TESTING MATERIALS AND JUDGEMENT OF WORKMANSHIP",{"$nulls":3},"\n",null,null,"SCHEDULE A "]
["#BillSheet#"]
["ColHDR"]
["ColHDR","ITEM",{"$nulls":3},"DESCRIPTION","UNIT","QTY","RATE","AMT"]
["ColHDR"]
[{"$nulls":5},"TESTING MATERIALS AND JUDGEMENT OF WORKMANSHIP"]
["IHDR1","C20.1.1",{"$nulls":3},"Special tests on elastomeric bearings (150 % vertical load and 150 % shear distortion)","No."]
[]
["IHDR1","C20.1.2",{"$nulls":3},"Special tests requested by the Engineer:"]
[]
["IHDR2"]
[]
["IHDR3"]
[]
["Item3"]
["IHDR3"]
[]
["Item3"]
["IHDR3"]
[]
["Item3"]
["IHDR3"]
[]
["Item3"]
["IHDR2",null,"C20.1.2.2",null,null,"Employer’s contribution to other special tests:"]
[]
["IHDR3",null,null,"(a)",null,"Special tests (as per Clause A20.1.6) including tests on water, aggregates, binders and cementitiously stabilized materials","PC sum",1,{"v":200000,"d":"200,000.00"},{"$f":"IF(ISNUMBER(H28),H28*I28,IF(H28=\"-\",\"rate only\",\" \"))","v":{"v":200000,"d":"200,000.00"}}]
[]
["Item3",{"$nulls":3},"(i)","Handling costs and profit in respect of item C20.1.2.2(a)","%",200000,null,{"$f":"IF(ISNUMBER(H30),H30*I30,IF(H30=\"-\",\"rate only\",\" \"))","v":0}]
[]
["IHDR1","C20.1.3",{"$nulls":3},"Providing testing equipment:"]
[]
["item",null,"C20.1.3.1",null,null,"Core drill","No.",1,null,{"$f":"IF(ISNUMBER(H34),H34*I34,IF(H34=\"-\",\"rate only\",\" \"))","v":0}]
[]
["item",null,"C20.1.3.2",null,null,"Rolling straight-edge","No.",1,null,{"$f":"IF(ISNUMBER(H36),H36*I36,IF(H36=\"-\",\"rate only\",\" \"))","v":0}]
[]
["IHDR1","C20.1.4",{"$nulls":3},"Special tests using Automated Road condition assessment instruments operated by service providers as requested by the Engineer for acceptance control in terms of Clause A20.1.3.6b)(iii):"]
[]
["IHDR2",null,"C20.1.4.1",null,null,"Using Highspeed Inertial Non-Contact laser profilers (Clause A20.1.5.5c)(ii))","PC sum",1,{"v":150000,"d":"150,000.00"},{"$f":"IF(ISNUMBER(H40),H40*I40,IF(H40=\"-\",\"rate only\",\" \"))","v":{"v":150000,"d":"150,000.00"}}]
[]
["Item3",null,null,"(a)",null,"Handling cost and profit in respect of item C20.1.4.1","%",150000,null,{"$f":"IF(ISNUMBER(H42),H42*I42,IF(H42=\"-\",\"rate only\",\" \"))","v":0}]
[]
["IHDR2",null,"C20.1.4.2",null,null,"Using Direct Contact Devices (Clause A20.1.5.5c)(i))","PC sum"]
[]
["item",null,null,"(a)",null,"Handling cost and profit in respect of item C20.1.4.2","%"]
["IHDR2",null,"C20.1.4.3",null,null,"Rutting measurements (Clause A20.1.5.5 d)(i))","PC sum"]
[]
["Item",null,null,"(a)",null,"Handling cost and profit in respect of item C20.1.4.3","%"]
["IHDR2",null,"C20.1.4.4",null,null,"Surface macro texture (Clause A20.1.5.5 b))","PC sum"]
[]
["Item",null,null,"(a)",null,"Handling cost and profit in respect of item C20.1.4.4","%"]
["IHDR2",null,"C20.1.4.5",null,null,"Deflection measurements (FWD) (Clause A20.1.5.5e))","PC sum"]
[]
["Item",null,null,"(a)",null,"Handling cost and profit in respect of item C20.1.4.5","%"]
["IHDR1","PC20.1.5",{"$nulls":3},"Financial contribution for an independent laboratory","month",18,null,{"$f":"IF(ISNUMBER(H56),H56*I56,IF(H56=\"-\",\"rate only\",\" \"))","v":0}]
[]
["IHDR1","PC20.1.6",{"$nulls":3},"Payment of independent site laboratory"]
[]
["IHDR2",null,"C20.1.6.1",null,null,"Direct payment by contractor","PC sum"]
[]
["Item",null,null,"(a)",null,"Handling cost and profit in respect of item C20.1.6.1","%"]
{"$rows_empty":27}
["#BillEnd#"]
["#BillEnd#","TOTAL CARRIED FORWARD TO SUMMARY",{"$nulls":7},{"$f":"SUM(J10:J89)","v":{"v":350000,"d":"350,000.00"}}]
["#BillEnd#"]

{"sheet":"Sch B - 13.7","index":87,"n_rows":212,"n_cols":10,"rows_kept":212}
["#BillSheet#"]
["#BillSheet#","C13.7","JOINTS",{"$nulls":3},"\n",null,null,"SCHEDULE B"]
["#BillSheet#"]
["ColHDR"]
["ColHDR","ITEM",{"$nulls":3},"DESCRIPTION","UNIT","QTY","RATE","AMT"]
["ColHDR"]
[{"$nulls":5},"JOINTS"]
["IHDR1","C13.7.1",{"$nulls":3},"Expansion joints:"]
[]
["Item",null,"C13.7.1.1",null,null,"(Description of joint measured per metre)","m"]
["Item",null,"C13.7.1.2",null,null,"(Description of joint measured by number)","No."]
["IHDR1","C13.7.2",{"$nulls":3},"Filled joints:"]
[]
["Item",null,"C13.7.2.1",null,null,"(Description of joint and thickness of joint filler for joints measured per square metre)","m²"]
["Item",null,"C13.7.2.2",null,null,"(Description of joint and thickness of joint filler for joints measured per metre)","m"]
["IHDR1","C13.7.3",{"$nulls":3},"Unfilled joints:"]
[]
["Item",null,"C13.7.3.1",null,null,"(Description of joint for joints measured per square metre)","m²"]
["Item",null,"C13.7.3.2",null,null,"(Description of joint for joints measured per linear metre)","m"]
["IHDR1","C13.7.4",{"$nulls":3},"Sealing joints with:"]
[]
["Item",null,"C13.7.4.1",null,null,"Sealant (description of joint, sealant and size)","m"]
["Item",null,"C13.7.4.2",null,null,"Waterstop (description of joint, waterstop and size)","m"]
["IHDR1","C13.7.5",{"$nulls":3},"Supply and installation of Agrément South Africa certified proprietary expansion joints"]
[]
["IHDR2",null,"C13.7.5.1",null,null,"Claw and other modular joints in nosings (bridge number and type provided):"]
[]
["IHDR3",null,null,"(a)",null,"Metal claw joint (80mm movement range)"]
[]
["Item",{"$nulls":3},"(i)","B1478 Continuous single box girder","m",{"$f":"13*2","v":26},null,{"$f":"IF(ISNUMBER(H30),H30*I30,IF(H30=\"-\",\"rate only\",\" \"))","v":0}]
[]
["Item",{"$nulls":3},"(ii)","B825A Box girder","m",96,null,{"$f":"IF(ISNUMBER(H32),H32*I32,IF(H32=\"-\",\"rate only\",\" \"))","v":0}]
[]
["Item",{"$nulls":3},"(iii)","B230 Twin box girder  ","m",92,null,{"$f":"IF(ISNUMBER(H34),H34*I34,IF(H34=\"-\",\"rate only\",\" \"))","v":0}]
[]
["Item",{"$nulls":3},"(iv)","B1433 Continuous stiffened arch","m",{"$f":"4*15","v":60},null,{"$f":"IF(ISNUMBER(H36),H36*I36,IF(H36=\"-\",\"rate only\",\" \"))","v":0}]
[]
["Item",{"$nulls":3},"(v)","B2718 T-beam & box girder  ","m",{"$f":"4*16","v":64},null,{"$f":"IF(ISNUMBER(H38),H38*I38,IF(H38=\"-\",\"rate only\",\" \"))","v":0}]
[]
["Item",{"$nulls":3},"(vi)","B2720 Continuous Twin box girder","m",{"$f":"3*26","v":78},null,{"$f":"IF(ISNUMBER(H40),H40*I40,IF(H40=\"-\",\"rate only\",\" \"))","v":0}]
[]
["Item",{"$nulls":3},"(vii)","B4403 Continuous Twin box girder","m",{"$f":"5*26","v":130},null,{"$f":"IF(ISNUMBER(H42),H42*I42,IF(H42=\"-\",\"rate only\",\" \"))","v":0}]
[]
["Item",{"$nulls":3},"(viii)","B1439 Continuous Single box girder","m",{"$f":"4*8","v":32},null,{"$f":"IF(ISNUMBER(H44),H44*I44,IF(H44=\"-\",\"rate only\",\" \"))","v":0}]
[]
["Item",{"$nulls":3},"(ix)","B1441A Skew Continuous slab","m",{"$f":"4*34","v":136},null,{"$f":"IF(ISNUMBER(H46),H46*I46,IF(H46=\"-\",\"rate only\",\" \"))","v":0}]
[]
["Item",{"$nulls":3},"(x)","B1441B Continuous Single Box Girder","m",{"$f":"4*8","v":32},null,{"$f":"IF(ISNUMBER(H48),H48*I48,IF(H48=\"-\",\"rate only\",\" \"))","v":0}]
[]
["Item",{"$nulls":3},"(xi)","B1443 Continuous T beam ","m",{"$f":"4*13","v":52},null,{"$f":"IF(ISNUMBER(H50),H50*I50,IF(H50=\"-\",\"rate only\",\" \"))","v":0}]
[]
["Item",{"$nulls":3},"(xii)","B1444 Continuous twin box girder","m",{"$f":"2*28","v":56},null,{"$f":"IF(ISNUMBER(H52),H52*I52,IF(H52=\"-\",\"rate only\",\" \"))","v":0}]
[]
["Item",{"$nulls":3},"(xiii)","B1448 Single Box Girder","m",{"$f":"2*15","v":30},null,{"$f":"IF(ISNUMBER(H54),H54*I54,IF(H54=\"-\",\"rate only\",\" \"))","v":0}]
[]
["Item",{"$nulls":3},"(xiv)","B1450 Continuous T beam ","m",{"$f":"4*14","v":56},null,{"$f":"IF(ISNUMBER(H56),H56*I56,IF(H56=\"-\",\"rate only\",\" \"))","v":0}]
[]
["Item",{"$nulls":3},"(xv)","Unknown at km3.0 Continuous twin box girder","m"]
["Item",{"$nulls":3},"(xvi)","Unknown at km22.0  Continuous single box girder","m",{"$f":"4*14","v":56},null,{"$f":"IF(ISNUMBER(H59),H59*I59,IF(H59=\"-\",\"rate only\",\" \"))","v":0}]
[]
["Item",{"$nulls":3},"(xvii)","Unknown at km28.44  Continuous Twin Box Girder","m",{"$f":"4*17","v":68},null,{"$f":"IF(ISNUMBER(H61),H61*I61,IF(H61=\"-\",\"rate only\",\" \"))","v":0}]
[]
["Item",{"$nulls":3},"(xviii)","Unknown at km32.2 Continuous single box girder","m",{"$f":"4*13","v":52},null,{"$f":"IF(ISNUMBER(H63),H63*I63,IF(H63=\"-\",\"rate only\",\" \"))","v":0}]
[]
["Item"]
["IHDR2",null,"C13.7.5.2",null,null,"Asphaltic plug type joints "]
[]
["IHDR3",null,null,"(c)",null,"400 x 75mm","m","-",null,{"$f":"IF(ISNUMBER(H68),H68*I68,IF(H68=\"-\",\"rate only\",\" \"))","v":"rate only"}]
[]
["IHDR4",null,null,"(d)",null,"500 x 75mm ","m","-",null,{"$f":"IF(ISNUMBER(H70),H70*I70,IF(H70=\"-\",\"rate only\",\" \"))","v":"rate only"}]
[]
["IHDR5",null,null,"(e)",null,"500 x 100mm"]
[]
["Item",{"$nulls":3},"(i)","B2712A Precast beams","m",{"$f":"2*18","v":36},null,{"$f":"IF(ISNUMBER(H74),H74*I74,IF(H74=\"-\",\"rate only\",\" \"))","v":0}]
[]
["Item",{"$nulls":3},"(ii)","B1431A Precast beams ","m",{"$f":"6*18","v":108},null,{"$f":"IF(ISNUMBER(H76),H76*I76,IF(H76=\"-\",\"rate only\",\" \"))","v":0}]
[]
["Item",{"$nulls":3},"(iii)","B2713 Post-Tensioned slab","m",{"$f":"5*18","v":90},null,{"$f":"IF(ISNUMBER(H78),H78*I78,IF(H78=\"-\",\"rate only\",\" \"))","v":0}]
[]
["PB"]
["PB","CARRIED FORWARD",{"$nulls":7},{"$f":"SUM(J24:J79)","v":{"v":0,"d":"0.00"}}]
["PB"]
["PB"]
["PB","BROUGHT FORWARD",{"$nulls":7},{"$f":"J81","v":{"v":0,"d":"0.00"}}]
["PB"]
["Item",{"$nulls":3},"(iv)","B2914A Post-Tensioned slab","m",{"$f":"5*18","v":90},null,{"$f":"IF(ISNUMBER(H86),H86*I86,IF(H86=\"-\",\"rate only\",\" \"))","v":0}]
[]
["Item",{"$nulls":3},"(v)","B2716 Continuous stiffened arch","m",{"$f":"2*11","v":22},null,{"$f":"IF(ISNUMBER(H88),H88*I88,IF(H88=\"-\",\"rate only\",\" \"))","v":0}]
[]
["Item",{"$nulls":3},"(vi)","B1434 Continuous stiffened arch","m",{"$f":"2*11","v":22},null,{"$f":"IF(ISNUMBER(H90),H90*I90,IF(H90=\"-\",\"rate only\",\" \"))","v":0}]
[]
["Item",{"$nulls":3},"(vii)","B2717 Precast beam","m",{"$f":"3*18","v":54},null,{"$f":"IF(ISNUMBER(H92),H92*I92,IF(H92=\"-\",\"rate only\",\" \"))","v":0}]
[]
["Item",{"$nulls":3},"(viii)","B1435 Precast beam","m",{"$f":"3*18","v":54},null,{"$f":"IF(ISNUMBER(H94),H94*I94,IF(H94=\"-\",\"rate only\",\" \"))","v":0}]
[]
["Item",{"$nulls":3},"(ix)","B1437A Precast beams, simply supported","m",{"$f":"3*16","v":48},null,{"$f":"IF(ISNUMBER(H96),H96*I96,IF(H96=\"-\",\"rate only\",\" \"))","v":0}]
[]
["Item",{"$nulls":3},"(x)","Unknown at km19.8 Solid slab","m",{"$f":"2*25","v":50},null,{"$f":"IF(ISNUMBER(H98),H98*I98,IF(H98=\"-\",\"rate only\",\" \"))","v":0}]
[]
["Item",{"$nulls":3},"(xi)","Unknown at km23.2 Continuous single box girder","m",{"$f":"2*14","v":28},null,{"$f":"IF(ISNUMBER(H100),H100*I100,IF(H100=\"-\",\"rate only\",\" \"))","v":0}]
[]
["Item",{"$nulls":3},"(xii)","Unknown at km23.8 Continuous T-beam","m",26,null,{"$f":"IF(ISNUMBER(H102),H102*I102,IF(H102=\"-\",\"rate only\",\" \"))","v":0}]
[]
["Item",{"$nulls":3},"(xiii)","Unknown at km24.7 Continuous single box girder","m",{"$f":"2*13","v":26},null,{"$f":"IF(ISNUMBER(H104),H104*I104,IF(H104=\"-\",\"rate only\",\" \"))","v":0}]
[]
["Item",{"$nulls":3},"(xiv)","Unknown at km26.6 Simply solid slab","m",{"$f":"4*16","v":64},null,{"$f":"IF(ISNUMBER(H106),H106*I106,IF(H106=\"-\",\"rate only\",\" \"))","v":0}]
[]
["Item",{"$nulls":3},"(xv)","Unknown at km26.8 Simply solid slab","m",{"$f":"4*16","v":64},null,{"$f":"IF(ISNUMBER(H108),H108*I108,IF(H108=\"-\",\"rate only\",\" \"))","v":0}]
[]
["Item",{"$nulls":3},"(xvi)","Unknown at km29.2 Simply supported precast beams","m",{"$f":"1*12","v":12},null,{"$f":"IF(ISNUMBER(H110),H110*I110,IF(H110=\"-\",\"rate only\",\" \"))","v":0}]
[]
["Item",{"$nulls":3},"(xvii)","Unknown at km29.7 Single Box Girder","m",{"$f":"2*12","v":24},null,{"$f":"IF(ISNUMBER(H112),H112*I112,IF(H112=\"-\",\"rate only\",\" \"))","v":0}]
[]
["IHDR1","C13.7.6",{"$nulls":3},"Joint terminations in:"]
[]
["IHDR2",null,"C13.7.6.1",null,null,"Barriers and Parapets (type of joint indicated)"]
[]
["Item"]
["Item",null,null,"(a)",null,"Metal claw joint","No.",26,null,{"$f":"IF(ISNUMBER(H119),H119*I119,IF(H119=\"-\",\"rate only\",\" \"))","v":0}]
[]
["Item",null,null,"(b)",null,"Asphaltic plug joint","No.",26,null,{"$f":"IF(ISNUMBER(H121),H121*I121,IF(H121=\"-\",\"rate only\",\" \"))","v":0}]
[]
["IHDR2",null,"C13.7.6.2",null,null,"Sidewalks (type of joint indicated)"]
[]
["Item",null,null,"(a)",null,"Metal claw joint","No.",8,null,{"$f":"IF(ISNUMBER(H125),H125*I125,IF(H125=\"-\",\"rate only\",\" \"))","v":0}]
[]
["Item"]
["Item",null,null,"(b)",null,"Asphaltic plug joint","No.",8,null,{"$f":"IF(ISNUMBER(H128),H128*I128,IF(H128=\"-\",\"rate only\",\" \"))","v":0}]
[]
["IHDR1","C13.7.7",{"$nulls":3},"Cover plates (non-metallic) in barriers, parapets and sidewalks where specified on the drawings in:"]
[]
["IHDR2",null,"C13.7.7.1",null,null,"Barriers and Parapets "]
[]
["Item",null,null,"(a)",null,"Metal claw joint","No.",26,null,{"$f":"IF(ISNUMBER(H134),H134*I134,IF(H134=\"-\",\"rate only\",\" \"))","v":0}]
[]
["Item",null,null,"(b)",null,"Asphaltic plug joint","No.",26,null,{"$f":"IF(ISNUMBER(H136),H136*I136,IF(H136=\"-\",\"rate only\",\" \"))","v":0}]
[]
["IHDR2",null,"C13.7.7.2",null,null,"Sidewalks"]
[]
["PB"]
["PB","CARRIED FORWARD",{"$nulls":7},{"$f":"SUM(J83:J139)","v":{"v":0,"d":"0.00"}}]
["PB"]
["PB"]
["PB","BROUGHT FORWARD",{"$nulls":7},{"$f":"J141","v":{"v":0,"d":"0.00"}}]
["PB"]
["Item",null,null,"(a)",null,"Metal claw joint","No.",8,null,{"$f":"IF(ISNUMBER(H146),H146*I146,IF(H146=\"-\",\"rate only\",\" \"))","v":0}]
[]
["Item",null,null,"(b)",null,"Asphaltic plug joint","No.",8,null,{"$f":"IF(ISNUMBER(H148),H148*I148,IF(H148=\"-\",\"rate only\",\" \"))","v":0}]
{"$rows_empty":61}
["#BillEnd#"]
["#BillEnd#","TOTAL CARRIED FORWARD TO SUMMARY",{"$nulls":7},{"$f":"SUM(J143:J209)","v":{"v":0,"d":"0.00"}}]
["#BillEnd#"]

{"sheet":"Sch D - D1000","index":88,"n_rows":102,"n_cols":10,"rows_kept":102}
["#BillSheet#"]
["#BillSheet#","D 1000","SMALL CONTRACTOR DEVELOPMENT, TRAINING AND COMMUNITY ",{"$nulls":6},"SCHEDULE D"]
["#BillSheet#"]
["ColHDR"]
["ColHDR","ITEM",{"$nulls":3},"DESCRIPTION","UNIT","QTY","RATE","AMT"]
["ColHDR"]
["IHDR1","D10.01",{"$nulls":3},"Target Group Participation"]
[]
["Item",null,null,"(a)",null,"Contract Participation Performance bonus ","PC sum",1,{"v":3727500,"d":"3,727,500.00"},{"$f":"IF(ISNUMBER(H9),H9*I9,IF(H9=\"-\",\"rate only\",\" \"))","v":{"v":3727500,"d":"3,727,500.00"}}]
[]
["IHDR1","D10.02",{"$nulls":3},"Stakeholder and Community Liaison and Social Facilitation"]
[]
["Item",null,null,"(a)",null,"Cost of liaison, social facilitation and PLC support  ","PC sum",1,{"v":100000,"d":"100,000.00"},{"$f":"IF(ISNUMBER(H13),H13*I13,IF(H13=\"-\",\"rate only\",\" \"))","v":{"v":100000,"d":"100,000.00"}}]
[]
["Item3",null,null,"(b)",null,"Handling cost and profit in respect of sub-item D10.02(a) ","%",{"$f":"+J13","v":100000},null,{"$f":"IF(ISNUMBER(H15),H15*I15,IF(H15=\"-\",\"rate only\",\" \"))","v":0}]
[]
["IHDR1","D10.03",{"$nulls":3},"Tender Process for Targeted Enterprises"]
[]
["IHDR2",null,null,"(a)",null,"Contractor’s charge for the management and execution of the Targeted Enterprise procurement process:"]
[]
["item",{"$nulls":3},"(i)","Procurement process for the totality of all tenders concluded for the appointment of Targeted Enterprise subcontractors of CIDB 1 and 2 contractor grading","No.",8,null,{"$f":"IF(ISNUMBER(H21),H21*I21,IF(H21=\"-\",\"rate only\",\" \"))","v":0}]
[]
["item",{"$nulls":3},"(ii)","Procurement process for the totality of all tenders concluded for the appointment of Targeted Enterprise subcontractors of CIDB 3 and 4 contractor grading","No.",5,null,{"$f":"IF(ISNUMBER(H23),H23*I23,IF(H23=\"-\",\"rate only\",\" \"))","v":0}]
[]
["item",{"$nulls":3},"(iii)","Procurement process for the totality of all tenders concluded for the appointment of Targeted Enterprise subcontractors of CIDB 5 and higher contractor grading","No.",7,null,{"$f":"IF(ISNUMBER(H25),H25*I25,IF(H25=\"-\",\"rate only\",\" \"))","v":0}]
[]
["item",{"$nulls":3},"(iv)","Procurement process for the totality of all tenders concluded for the appointment of Targeted Enterprise suppliers","No.",5,null,{"$f":"IF(ISNUMBER(H27),H27*I27,IF(H27=\"-\",\"rate only\",\" \"))","v":0}]
[]
["IHDR2",null,null,"(b)",null,"Targeted Enterprise Procurement Coordinator","month",18,null,{"$f":"IF(ISNUMBER(H29),H29*I29,IF(H29=\"-\",\"rate only\",\" \"))","v":0}]
[]
["IHDR1","D10.04",{"$nulls":3},"Responsibilities of the Contractor towards Targeted Enterprises "]
[]
["Item",null,null,"(a)",null,"Contractor’s establishment, management, management support, assistance, coaching, guidance, mentoring and supervision of Targeted Enterprises","month",18,null,{"$f":"IF(ISNUMBER(H33),H33*I33,IF(H33=\"-\",\"rate only\",\" \"))","v":0}]
[]
["Item",null,null,"(b)",null,"Targeted Enterprise Construction Manager","Person. month",18,null,{"$f":"IF(ISNUMBER(H35),H35*I35,IF(H35=\"-\",\"rate only\",\" \"))","v":0}]
[]
["Item",null,null,"(c)",null,"Targeted Enterprise Site Supervisors","Person. month",18,null,{"$f":"IF(ISNUMBER(H37),H37*I37,IF(H37=\"-\",\"rate only\",\" \"))","v":0}]
["PB"]
["PB","CARRIED FORWARD",{"$nulls":7},{"$f":"SUM(J7:J37)","v":{"v":3827500,"d":"3,827,500.00"}}]
["PB"]
["PB"]
["PB","BROUGHT FORWARD",{"$nulls":7},{"$f":"J39","v":{"v":3827500,"d":"3,827,500.00"}}]
["PB"]
[]
["IHDR1","D10.05",{"$nulls":3},"Construction Works by Targeted Enterprises"]
[]
["Item",null,null,"(a)",null,"Payments associated with the construction works carried out by Targeted Enterprise subcontractors of CIDB 1 and 2 contractor grading designation appointed in terms of Section D","Prov Sum",1,{"v":7400000,"d":"7,400,000.00"},{"$f":"IF(ISNUMBER(H47),H47*I47,IF(H47=\"-\",\"rate only\",\" \"))","v":{"v":7400000,"d":"7,400,000.00"}}]
[]
["Item3",null,null,"(b)",null,"Handling costs and profit in respect of payment associated with sub-item D10.05(a)","%",{"$f":"I47","v":7400000},null,{"$f":"IF(ISNUMBER(H49),H49*I49,IF(H49=\"-\",\"rate only\",\" \"))","v":0}]
[]
["Item",null,null,"(c)",null,"Fluctuation between the main contractor’s rates and that of the Targeted Enterprise subcontractors","lump sum",1,null,{"$f":"IF(ISNUMBER(H51),H51*I51,IF(H51=\"-\",\"rate only\",\" \"))","v":0}]
[]
["Item",null,null,"(d)",null,"Preliminary and General Obligations of Targeted Enterprise sub-contractors appointed in terms of Section D","lump sum",1,null,{"$f":"IF(ISNUMBER(H53),H53*I53,IF(H53=\"-\",\"rate only\",\" \"))","v":0}]
[]
["IHDR1","D10.06",{"$nulls":3},"Training, coaching, guidance, mentoring and assistance"]
[]
["IHDR2",null,null,"(a)",null,"Training Costs"]
[]
["item",{"$nulls":3},"(i)","Student stipends "," PC Sum"]
["item",{"$nulls":3},"(ii)","Accredited generic skills training","Prov Sum",1,{"v":200000,"d":"200,000.00"},{"$f":"IF(ISNUMBER(H60),H60*I60,IF(H60=\"-\",\"rate only\",\" \"))","v":{"v":200000,"d":"200,000.00"}}]
[]
["item",{"$nulls":3},"(iii)","Community skills training","Prov Sum",1,{"v":150000,"d":"150,000.00"},{"$f":"IF(ISNUMBER(H62),H62*I62,IF(H62=\"-\",\"rate only\",\" \"))","v":{"v":150000,"d":"150,000.00"}}]
[{"$nulls":9},{"$f":"IF(ISNUMBER(H63),H63*I63,IF(H63=\"-\",\"rate only\",\" \"))","v":" "}]
[{"$nulls":4},"(iv)","Handling cost and profit in respect of sub-items D10.06(a)(ii) and (iii)","%",{"$f":"J60+J62","v":350000},null,{"$f":"IF(ISNUMBER(H64),H64*I64,IF(H64=\"-\",\"rate only\",\" \"))","v":0}]
[]
["Item3",{"$nulls":3},"(iv)","Handling cost and profit in respect of subitems D10.06(a)(i), (ii) and (iii)","%"]
["IHDR2",null,null,"(b)",null,"Student experiential training"]
[]
["item",{"$nulls":3},"(i)","Student stipends","PC sum"]
["item",{"$nulls":3},"(ii)","Provision of experiential training","Person. month"]
["IHDR2",null,null,"(c)",null,"Other costs during training ","Prov Sum",1,{"v":50000,"d":"50,000.00"},{"$f":"IF(ISNUMBER(H71),H71*I71,IF(H71=\"-\",\"rate only\",\" \"))","v":{"v":50000,"d":"50,000.00"}}]
[]
["IHDR2",null,null,"(d)",null,"Training venue","lump sum",1,null,{"$f":"IF(ISNUMBER(H73),H73*I73,IF(H73=\"-\",\"rate only\",\" \"))","v":0}]
[]
["IHDR1","D10.07",{"$nulls":3},"Community development projects"]
[]
["item",null,null,"(a)",null,"Provision for costs of Community Development  projects","prov sum"]
["item3",null,null,"(b)",null,"Handling costs and profit in respect of sub-item D10.07(a)","%"]
{"$rows_empty":21}
["#BillEnd#"]
["#BillEnd#","TOTAL CARRIED FORWARD TO SUMMARY",{"$nulls":7},{"$f":"SUM(J41:J99)","v":{"v":11627500,"d":"11,627,500.00"}}]
["#BillEnd#"]

{"sheet":"Summary","index":89,"n_rows":47,"n_cols":3,"rows_kept":47,"merged":[[2,0,2,1],[4,0,4,2],[41,0,41,1],[46,0,46,1]]}
["SUMMARY OF SCHEDULE OF QUANTITIES"]
[]
["CONTRACT SANRAL N.017-020-2018/1 "]
["FOR"]
["THE MILL AND REPLACE OF SURFACING ON NATIONAL ROUTE N17 SECTION 2 FROM N3 (KM 3.0) TO TONK METER (KM 33.45) "]
[]
["SCHEDULE A : ROAD CONSTRUCTION"]
[]
["GENERAL"]
["C1.2","GENERAL REQUIREMENTS AND PROVISIONS",{"$f":"'1.2'!I182","v":{"v":560000,"d":"R560,000.00"}}]
["C1.3","CONTRACTOR’S SITE ESTABLISHMENT AND GENERAL OBLIGATIONS",{"$f":"'1.3'!I69","v":{"v":250000,"d":"R250,000.00"}}]
["C1.4","FACILITIES FOR THE ENGINEER",{"$f":"'1.4'!I173","v":{"v":860000,"d":"R860,000.00"}}]
["C1.5","ACCOMMODATION OF TRAFFIC",{"$f":"'1.5'!I146","v":{"v":150000,"d":"R150,000.00"}}]
["C2.1","GENERAL REQUIREMENTS AND TRENCHING FOR SERVICES",{"$f":"'2.1'!J249","v":{"v":1750000,"d":"R1,750,000.00"}}]
["C3.3","CONCRETE KERBING AND CHANNELLING, ASPHALT BERMS, CHUTES, DOWNPIPES",{"$f":"'3.3'!J179","v":{"v":0,"d":"R0.00"}}]
["C4.3","EXISTING ROAD MATERIALS",{"$f":"'4.3'!J227","v":{"v":0,"d":"R0.00"}}]
["C6.2","SEGMENTAL BLOCK PAVING LAYERS",{"$f":"'6.2'!J66","v":{"v":20000,"d":"R20,000.00"}}]
["C7.1","REPLACEMENT OF EXISTING JOINT SEALANT",{"$f":"'7.1'!J71","v":{"v":0,"d":"R0.00"}}]
["C7.2","REPAIR TO CONCRETE PANELS AND CONCRETE ADJACENT TO UNCONTROLLED ",{"$f":"'7.2'!J99","v":{"v":0,"d":"R0.00"}}]
["C7.3","REMOVAL AND REINSTATEMENT OF EXISTING CONCRETE LAYERS",{"$f":"'7.3'!J83","v":{"v":0,"d":"R0.00"}}]
["C8.1","PRIME COAT",{"$f":"'8.1'!J73","v":{"v":0,"d":"R0.00"}}]
["C8.5","STANDARD CRACK SEALING",{"$f":"'8.5'!J78","v":{"v":0,"d":"R0.00"}}]
["C8.6","GEOSYNTHETIC CRACK SEALING",{"$f":"'8.6'!J71","v":{"v":0,"d":"R0.00"}}]
["C8.8","PATCHING AND EDGE BREAK REPAIR",{"$f":"'8.8'!J147","v":{"v":0,"d":"R0.00"}}]
["C9.1","ASPHALT LAYERS",{"$f":"'9.1'!J177","v":{"v":500000,"d":"R500,000.00"}}]
["C11.7","ROAD MARKINGS AND ROAD STUDS",{"$f":"'11.7'!J202","v":{"v":0,"d":"R0.00"}}]
["C11.9","FINISHING THE ROAD AND ROAD RESERVE AND TREATING OLD ROADS",{"$f":"'11.9'!J85","v":{"v":0,"d":"R0.00"}}]
["C20.1 ","TESTING MATERIALS AND JUDGEMENT OF WORKMANSHIP",{"$f":"'20.1'!J91","v":{"v":350000,"d":"R350,000.00"}}]
[]
[]
["TOTAL SCHEDULE A : ROAD CONSTRUCTION ",null,{"$f":"SUM(C10:C28)","v":{"v":4440000,"d":"R4,440,000.00"}}]
[]
[]
["SCHEDULE B : STRUCTURES"]
[]
["C13.7","JOINTS",{"$f":"'Sch B - 13.7'!J211","v":{"v":0,"d":"R0.00"}}]
[]
[]
["TOTAL SCHEDULE B : STRUCTURES   ",null,{"$f":"C36","v":{"v":0,"d":"R0.00"}}]
[]
[]
["SCHEDULE D :  SMALL CONTRACTOR DEVELOPMENT, TRAINING AND COMMUNITY                                      "]
[]
["D1000 ","SMALL CONTRACTOR DEVELOPMENT, TRAINING AND COMMUNITY ",{"$f":"'Sch D - D1000'!J101","v":{"v":11627500,"d":"R11,627,500.00"}}]
[]
[]
["TOTAL SCHEDULE D :  SMALL CONTRACTOR DEVELOPMENT, TRAINING AND COMMUNITY                                    ",null,{"$f":"C44","v":{"v":11627500,"d":"R11,627,500.00"}}]