{"text_format":"1","workbook":"xlsx","n_sheets":9,"sheets":["Summary","Functional","Technical","Security","Integration and Testing","Cloud","Priority Ratings","Config","Concerns and Recommendations"],"not_rendered":{"charts":0,"images":2,"macros":1,"external_links":0,"defined_names":19,"comments":0,"pivot_tables":0},"unopened":[],"bounds":{"document_bytes":16777216,"sheet_cells":100000,"rows_first":2000,"rows_last":500,"rows_between":2000,"halvings":0,"cell_chars":16384,"cell_head_chars":4096},"cells_cut":0,"cells_raw":0,"read":"whole","date_system":"1900"}

{"sheet":"Summary","index":0,"n_rows":38,"n_cols":6,"rows_kept":38,"cut":false,"hidden":false,"merged":[[18,5,22,5],[23,1,23,4],[7,0,7,4],[17,1,17,2],[18,0,22,0],[18,4,22,4]]}
["ERI Configuration Management System"]
[]
["Tenderer:"]
["Evaluated by:"]
[]
["Evaluation Criteria"]
[]
["Important Notes: "]
["1. Please indicate location of answers to the criteria and where required answer yes or no. To be included in Comments tab per sheet."]
["2. The qualified solution service provider shall do a product demo of the proposed product to be presented to Eskom.  This is mandatory. "]
{"$rows_left_out":29}
{"sheet":"Functional","index":1,"n_rows":23,"n_cols":14,"rows_kept":23,"cut":false,"hidden":false,"merged":[[6,10,6,12],[21,0,21,12],[0,0,0,2],[1,0,1,1],[2,0,2,1],[3,0,3,1],[5,0,5,2],[6,8,6,9]]}
[{"$f":"Technical!A1","v":"ERI Configuration Management System"}]
["CORP xxxx Tender"]
["Tenderer:"]
["Evaluated by:"]
[]
["Evaluation Criteria - Functional "]
[null,null,null,null,null,null,null,null,"Weight\n(agreed by evaluation team members)",null,"Score\n(determined by each evaluation team member during evaluation. Will be averaged for final scores)"]
["ID","Type","Criterion","Solution","Functional Requirement","Requirement description","Vendor Comments","Priority Description","Priority\n","Weighted Question","Scoring","Answer\n(0,50,100%)","Weighted Answer","Internal\nComment"]
[1,"Meeting the Scope of Work Required","How well has the Tenderer described how scope requirements will be met?  Do they understand what needs to be done?  List concerns in Comments.","How well has the Tenderer described how scope requirements will be met?  Do they understand what needs to be done?  List concerns in Comments.","Register components in the system upon arrival at work centres","Ability to create component identity by: \n1.Scanning the marked components into the system\n (Secondary requirement to procure handheld devices) or\n2.Allow manual entry into the system by an authorized person\n3.Ability for all Eskom employees to view all technical information pertaining to the registered components\n4.Ability to track components as they move through the refurbishment life cycle",null,"Show stopper",{"$f":"IF(H9='Priority Ratings'!$C$21,'Priority Ratings'!$B$21,IF(H9='Priority Ratings'!$C$22,'Priority Ratings'!$B$22,IF(H9='Priority Ratings'!$C$23,'Priority Ratings'!$B$23,IF(H9='Priority Ratings'!$C$24,'Priority Ratings'!$B$24,IF(H9='Priority Ratings'!$C$25,'Priority Ratings'!$B$25,IF(H9='Priority Ratings'!$C$26,'Priority Ratings'!$B$26,IF(H9='Priority Ratings'!$C$27,'Priority Ratings'!$B$27,\"No Rating\")))))))","v":6},{"$f":"I9/I$23","v":8.5714285714285715E-2},"100%: Fully comply with requirement\n50%:   Partially comply will require development/ customisation\n0%:     No compliance",null,{"$f":"J9*L9","v":0}]
[2,"Meeting the Scope of Work Required","How well has the Tenderer described how scope requirements will be met?  Do they understand what needs to be done?  List concerns in Comments.","ERI Configuration Management System","Register components in the system upon arrival at work centres","The Component technical information must be captured according to the following metadata structure:\n1.\tPlant \n2.\tUnit \n3.\tTechnology\n4.\tService Report (Service Report number)\n              a.\tMonitoring Documentation (Vibration Analysis)\n              b.\tModule Assembly (HP,IP, LP, Gen etc.)\n              c.\tComponent ( Blades, Diaphragms etc.)     \n                          i.\t Project Number\n                          ii. WBS Elements\n                          iii. PQP\n                          iv. Engineering Project Number\n                          v. Engineering Drawings\n                          vi. Serial number",null,"Show stopper",{"$f":"IF(H10='Priority Ratings'!$C$21,'Priority Ratings'!$B$21,IF(H10='Priority Ratings'!$C$22,'Priority Ratings'!$B$22,IF(H10='Priority Ratings'!$C$23,'Priority Ratings'!$B$23,IF(H10='Priority Ratings'!$C$24,'Priority Ratings'!$B$24,IF(H10='Priority Ratings'!$C$25,'Priority Ratings'!$B$25,IF(H10='Priority Ratings'!$C$26,'Priority Ratings'!$B$26,IF(H10='Priority Ratings'!$C$27,'Priority Ratings'!$B$27,\"No Rating\")))))))","v":6},8.5714285714285715E-2,"100%: Fully comply with requirement\n50%:   Partially comply will require development/ customisation\n0%:     No compliance",null,0]
{"$rows_left_out":14}
{"sheet":"Technical","index":2,"n_rows":14,"n_cols":14,"rows_kept":14,"cut":false,"hidden":false,"merged":[[12,0,12,12],[6,10,6,12],[6,8,6,9],[0,0,0,3],[1,0,1,1],[2,0,2,1],[3,0,3,1],[5,0,5,3]]}
["ERI Configuration Management System"]
["CORP xxxx Tender"]
["Tenderer:"]
["Evaluated by:"]
[]
["Evaluation Criteria"]
[null,null,null,null,null,null,null,null,"Weight\n(agreed by evaluation team members)",null,"Score\n(determined by each evaluation team member during evaluation. Will be averaged for final scores)"]
["ID","Type","Solution","Criterion","Functional Requirement","Requirement description","Vendor Comments","Priority Description","Priority\n","Weighted Question","Scoring","Answer\n(0,50,100%)","Weighted Answer","Internal\nComment"]
[1,"Meeting the Scope of Work Required","ERI Configuration Management System","Compatibility Certificate from Microsoft Azure","Information Security","Technical Support Team\nAccess Control and User Account Management \nDoes your Proposed Solution comply and is Compatible with Microsoft Azure, OAUTH2",null,"Critical",{"$f":"IF(H9='Priority Ratings'!$C$21,'Priority Ratings'!$B$21,IF(H9='Priority Ratings'!$C$22,'Priority Ratings'!$B$22,IF(H9='Priority Ratings'!$C$23,'Priority Ratings'!$B$23,IF(H9='Priority Ratings'!$C$24,'Priority Ratings'!$B$24,IF(H9='Priority Ratings'!$C$25,'Priority Ratings'!$B$25,IF(H9='Priority Ratings'!$C$26,'Priority Ratings'!$B$26,IF(H9='Priority Ratings'!$C$27,'Priority Ratings'!$B$27,\"No Rating\")))))))","v":5},{"$f":"I9/I$14","v":0.35714285714285715},"100%: Fully comply with requirement\n50%:   Partially comply will require development/ customisation\n0%:     No compliance",null,{"$f":"J9*L9","v":0}]
[2,"Meeting the Scope of Work Required","ERI Configuration Management System","Compatability Certificate from Microsoft Edge  and FireFox ","Information Security","Browser Accessability\nPlease advise if Solution is compatible with:\n1. Microsoft Edge\n2. Firefox\n3. SAP system\n4. Primavera",null,"Important",{"$f":"IF(H10='Priority Ratings'!$C$21,'Priority Ratings'!$B$21,IF(H10='Priority Ratings'!$C$22,'Priority Ratings'!$B$22,IF(H10='Priority Ratings'!$C$23,'Priority Ratings'!$B$23,IF(H10='Priority Ratings'!$C$24,'Priority Ratings'!$B$24,IF(H10='Priority Ratings'!$C$25,'Priority Ratings'!$B$25,IF(H10='Priority Ratings'!$C$26,'Priority Ratings'!$B$26,IF(H10='Priority Ratings'!$C$27,'Priority Ratings'!$B$27,\"No Rating\")))))))","v":3},{"$f":"I10/I$14","v":0.21428571428571427},"100%: Fully comply with requirement\n50%:   Partially comply will require development/ customisation\n0%:     No compliance",null,0]
{"$rows_left_out":5}
{"sheet":"Security","index":3,"n_rows":21,"n_cols":14,"rows_kept":21,"cut":false,"hidden":false,"merged":[[6,10,6,12],[19,0,19,12],[0,0,0,3],[1,0,1,1],[2,0,2,1],[3,0,3,1],[5,0,5,3],[6,8,6,9]]}
["ERI Configuration Management System"]
["CORP xxxx Tender"]
["Tenderer:"]
["Evaluated by:"]
[]
["Evaluation Criteria"]
[null,null,null,null,null,null,null,null,"Weight\n(agreed by evaluation team members)",null,"Score\n(determined by each evaluation team member during evaluation. Will be averaged for final scores)"]
["ID","Type","Solution","Criterion","Functional Requirement","Requirement description","Vendor Comments","Priority Description","Priority\n","Weighted Question","Scoring","Answer\n(0,50,100%)","Weighted Answer","Internal\nComment"]
[1,"Meeting the Scope of Work Required","ERI Configuration Management System","Compatibility Authentication Mechanism/s\nSubstantiate by providing details of standards that are supported","Information Security","Authentication for the following Categories:\n* Technical Support Team\n* User\n* System\n\nAccess Control and User Account Management\nDoes your Proposed Solution comply and is Compatible with Microsoft Active Directory, AD Azure, SAML2, OAuth2 and/or LDAPv3, MFA ?",null,"Very important",{"$f":"IF(H9='Priority Ratings'!$C$21,'Priority Ratings'!$B$21,IF(H9='Priority Ratings'!$C$22,'Priority Ratings'!$B$22,IF(H9='Priority Ratings'!$C$23,'Priority Ratings'!$B$23,IF(H9='Priority Ratings'!$C$24,'Priority Ratings'!$B$24,IF(H9='Priority Ratings'!$C$25,'Priority Ratings'!$B$25,IF(H9='Priority Ratings'!$C$26,'Priority Ratings'!$B$26,IF(H9='Priority Ratings'!$C$27,'Priority Ratings'!$B$27,\"No Rating\")))))))","v":4},{"$f":"I9/I$21","v":8.5106382978723402E-2},"100%: Fully comply with requirement\n50%:   Partially comply will require development/ customisation\n0%:     No compliance",null,{"$f":"J9*L9","v":0}]
[2,"Meeting the Scope of Work Required","ERI Configuration Management System","Certificate from the OEM or Reputable Authority ","Information Security","Information Security Threat Management\nPlease advise to what extend is your Solution Compatible with each of below:\n1. Malware\n2. Cyber Attack\n3. Anti-Virus",null,"Very important",{"$f":"IF(H10='Priority Ratings'!$C$21,'Priority Ratings'!$B$21,IF(H10='Priority Ratings'!$C$22,'Priority Ratings'!$B$22,IF(H10='Priority Ratings'!$C$23,'Priority Ratings'!$B$23,IF(H10='Priority Ratings'!$C$24,'Priority Ratings'!$B$24,IF(H10='Priority Ratings'!$C$25,'Priority Ratings'!$B$25,IF(H10='Priority Ratings'!$C$26,'Priority Ratings'!$B$26,IF(H10='Priority Ratings'!$C$27,'Priority Ratings'!$B$27,\"No Rating\")))))))","v":4},{"$f":"I10/I$21","v":8.5106382978723402E-2},"100%: Fully comply with requirement\n50%:   Partially comply will require development/ customisation\n0%:     No compliance",null,0]
{"$rows_left_out":12}
{"sheet":"Integration and Testing","index":4,"n_rows":26,"n_cols":14,"rows_kept":26,"cut":false,"hidden":false,"merged":[[24,0,24,12],[6,10,6,12],[0,0,0,2],[1,0,1,1],[2,0,2,1],[3,0,3,1],[5,0,5,2],[6,8,6,9]]}
[{"$f":"Technical!A1","v":"ERI Configuration Management System"}]
["CORP xxxx Tender"]
["Tenderer:"]
["Evaluated by:"]
[]
["Evaluation Criteria"]
[null,null,null,null,null,null,null,null,"Weight\n(agreed by evaluation team members)",null,"Score\n(determined by each evaluation team member during evaluation. Will be averaged for final scores)"]
["ID","Type","Criterion","Solution","Functional Requirement","Requirement description","Vendor Comments","Priority Description","Priority\n","Weighted Question","Scoring","Answer\n(0,50,100%)","Weighted Answer","Internal\nComment"]
[1,"Meeting the Scope of Work Required","Integration to Microsoft Azure","ERI Configuration Management System","Integration","Microsoft Azure will be used authentication of users to gain access to the system.",null,"Show stopper",{"$f":"IF(H9='Priority Ratings'!$C$21,'Priority Ratings'!$B$21,IF(H9='Priority Ratings'!$C$22,'Priority Ratings'!$B$22,IF(H9='Priority Ratings'!$C$23,'Priority Ratings'!$B$23,IF(H9='Priority Ratings'!$C$24,'Priority Ratings'!$B$24,IF(H9='Priority Ratings'!$C$25,'Priority Ratings'!$B$25,IF(H9='Priority Ratings'!$C$26,'Priority Ratings'!$B$26,IF(H9='Priority Ratings'!$C$27,'Priority Ratings'!$B$27,\"No Rating\")))))))","v":6},{"$f":"I9/I$26","v":8.2191780821917804E-2},"100%: Fully comply with requirement\n50%:   Partially comply will require development/ customisation\n0%:     No compliance\n",null,{"$f":"J9*L9","v":0}]
[2,"Meeting the Scope of Work Required","Integration to Microsoft Exchange Online","ERI Configuration Management System","Integration","Email notifications for escalations and approvals",null,"Important",{"$f":"IF(H10='Priority Ratings'!$C$21,'Priority Ratings'!$B$21,IF(H10='Priority Ratings'!$C$22,'Priority Ratings'!$B$22,IF(H10='Priority Ratings'!$C$23,'Priority Ratings'!$B$23,IF(H10='Priority Ratings'!$C$24,'Priority Ratings'!$B$24,IF(H10='Priority Ratings'!$C$25,'Priority Ratings'!$B$25,IF(H10='Priority Ratings'!$C$26,'Priority Ratings'!$B$26,IF(H10='Priority Ratings'!$C$27,'Priority Ratings'!$B$27,\"No Rating\")))))))","v":3},4.1095890410958902E-2,"100%: Good Experience with certification\n50%: Some exeperience without certification\n0%: No experience, No certification\n",null,{"$f":"J10*L10","v":0}]
{"$rows_left_out":17}
{"sheet":"Cloud","index":5,"n_rows":37,"n_cols":14,"rows_kept":37,"cut":false,"hidden":false,"merged":[[35,0,35,12],[6,10,6,12],[0,0,0,3],[1,0,1,1],[2,0,2,1],[3,0,3,1],[5,0,5,3],[6,8,6,9]]}
["ERI Configuration Management  System"]
["CORP xxxx Tender"]
["Tenderer:"]
["Evaluated by:"]
[]
["Evaluation Criteria"]
[null,null,null,null,null,null,null,null,"Weight\n(agreed by evaluation team members)",null,"Score\n(determined by each evaluation team member during evaluation. Will be averaged for final scores)"]
["ID","Type","Solution","Criterion","Functional Requirement","Requirement description","Vendor Comments","Priority Description","Priority\n","Weighted Question","Scoring","Answer\n(0,50,100%)","Weighted Answer","Internal\nComment"]
[1,"Meeting the Scope of Work Required","ERI Configuration Management System","Cyber Attack","SECURITY, CONFIDENTIALITY AND PRIVACY","How will the vendor ensure  that ERI's  Data is protected from Cyber attacks?",null,"Show stopper",{"$f":"IF(H9='Priority Ratings'!$C$21,'Priority Ratings'!$B$21,IF(H9='Priority Ratings'!$C$22,'Priority Ratings'!$B$22,IF(H9='Priority Ratings'!$C$23,'Priority Ratings'!$B$23,IF(H9='Priority Ratings'!$C$24,'Priority Ratings'!$B$24,IF(H9='Priority Ratings'!$C$25,'Priority Ratings'!$B$25,IF(H9='Priority Ratings'!$C$26,'Priority Ratings'!$B$26,IF(H9='Priority Ratings'!$C$27,'Priority Ratings'!$B$27,\"No Rating\")))))))","v":6},{"$f":"I9/I$37","v":5.1724137931034482E-2},"100%: Fully comply with requirement\n50%:   Partially comply will require development/ customisation\n0%:     No compliance",null,{"$f":"J9*L9","v":0}]
[2,"Meeting the Scope of Work Required","ERI Configuration Management System","System Availability","AVAILABILITY, RETRIEVAL AND USE","The tenderer's Cloud hosting data centre must be within the borders of South Africa.",null,"Show stopper",{"$f":"IF(H10='Priority Ratings'!$C$21,'Priority Ratings'!$B$21,IF(H10='Priority Ratings'!$C$22,'Priority Ratings'!$B$22,IF(H10='Priority Ratings'!$C$23,'Priority Ratings'!$B$23,IF(H10='Priority Ratings'!$C$24,'Priority Ratings'!$B$24,IF(H10='Priority Ratings'!$C$25,'Priority Ratings'!$B$25,IF(H10='Priority Ratings'!$C$26,'Priority Ratings'!$B$26,IF(H10='Priority Ratings'!$C$27,'Priority Ratings'!$B$27,\"No Rating\")))))))","v":6},{"$f":"I10/I$37","v":5.1724137931034482E-2},"100%: Fully comply with requirement\n50%:   Partially comply will require development/ customisation\n0%:     No compliance",null,{"$f":"J10*L10","v":0}]
{"$rows_left_out":28}
{"sheet":"Priority Ratings","index":6,"n_rows":29,"n_cols":6,"rows_kept":29,"cut":false,"hidden":true,"merged":[]}
[]
[]
[]
[]
[]
[]
[]
[]
[]
[]
{"$rows_left_out":20}
{"sheet":"Config","index":7,"n_rows":13,"n_cols":7,"rows_kept":13,"cut":false,"hidden":true,"merged":[]}
[]
[null,"Solution",null,"Priority rating","Priority Description",null,"Category"]
[null,"Chatbot",null,0,"No interest",null,"Functional"]
[null,"Social Media API",null,1,"Nice to have",null,"Technical Evaluation"]
[null,"Chatbot and Social Media API",null,2,"Useful",null,"Integration and Testing"]
[null,null,null,3,"Important",null,"Cloud"]
[null,null,null,4,"Very important"]
[null,null,null,5,"Critical"]
[null,null,null,6,"Show stopper"]
[]
{"$rows_left_out":4}
{"sheet":"Concerns and Recommendations","index":8,"n_rows":19,"n_cols":2,"rows_kept":19,"cut":false,"hidden":true,"merged":[[2,1,2,2],[3,1,16,14],[18,1,18,2],[19,1,33,14]]}
["Note: Not applicable for the vendors / Tenderers / respondents. This sheet is not needed for issuing the Tendor. Useful for making recommendatins after evaluation."]
[null,"Please do NOT delete this sheet. "]
[null,"Recommendation"]
[]
[]
[]
[]
[]
[]
[]
{"$rows_left_out":9}