{"text_format":"3","workbook":"xlsx","n_sheets":3,"sheets":["SIP Trunks","SIP Trunks Details","Currency"],"not_rendered":{"external_links":7,"defined_names":398},"read":"whole","date_system":"1900"}

{"sheet":"SIP Trunks","index":0,"n_rows":56,"n_cols":23,"rows_kept":56,"merged":[[2,1,2,6],[28,4,28,6],[28,7,28,11],[28,13,28,17],[28,19,28,20],[29,4,29,6],[32,0,34,0],[32,1,34,1],[36,0,42,0],[36,1,42,1],[43,0,44,0],[43,1,44,1],[45,0,48,0],[45,1,48,1],[54,1,54,11],[55,1,78,11]]}
[null,"Pricing Schedule : SIP Trunks"]
[]
[null,"VENDOR NAME"]
[]
[]
[]
[null,"IMPORTANT NOTES"]
[null,"All cells highlighted in GREEN must be completed"]
[null,"Quoted prices MUST be in ZAR, EXCLUDING VAT and ESCALATIONS"]
[]
[null,"SIP Trunks"]
[null,"Prices MUST be quoted based on the SCOPE provided"]
[null,"Select the currency from the CURRENCY drop-down list in COLUMN \"F\""]
[]
[null,"Capture the applicable Currency, ROE and ROE Published Date on the \"Currency sheet\". "]
[null,"The adjustments for prevailing rates and the basis for future price adjustments will be determined at time of contracting. "]
[null,"Exchange rate variations may not be claimed for the local mark-up in the pricing structure"]
[]
[null,"SIP TRUNKS DETAILS: Provide the detailed requirements for the OT Environment"]
[]
[null,"NB: Provide details of pricing assumptions made in the submission IN TABLE 1"]
[]
[null,"Indicate the applicable CPA - IN COLUMN W to allow for Price Adjustments"]
[]
[null,"All Prices must be exclusive of VAT"]
[]
[]
[]
[null," ",{"$nulls":5},"PROJECT PHASE (FOR A PERIOD OF 1 YEAR)",{"$nulls":5},"OPERATIONS PHASE (ANNUAL COST FOR A PERIOD OF 9 YEARS)",{"$nulls":5},"TOTAL OVER 9 YEARS"]
["Item Number","Category","Description","Unit charge","CURRENCY",null,null,"Total Estimated Quantity","Unit Price in Nominated Currency","Unit Price in ZAR","Total [Nominated Currency]","Total in ZAR",null,"Total Estimated Quantity","Unit Price in Nominated Currency","Unit Price in ZAR","Total [Nominated Currency]","Total in ZAR",null,"Total [Nominated Currency]","Total in ZAR",null,"CONTRACT PRICE ADJUSTEMENT"]
[1,"Infrastructure (OT Requirements)","Replacement of the PRI/BRI infrastructure","sum",{"$f":"IF(F31=\"\",\"\",IF(F31=\"ZAR\",\"Local\",\"Foreign\"))","v":"Local"},"ZAR",{"$f":"IF(E31=\"\",\"\",IF(E31=\"Foreign\",VLOOKUP(F31,Currency!$E$20:$F$33,2,FALSE),1))","v":{"v":1,"d":"1.00"}},null,0,{"$f":"I31*$G31","v":0},{"$f":"'SIP Trunks Details'!L355","v":0},{"$f":"'SIP Trunks Details'!M355","v":0},null,null,0,{"$f":"O31*$G31","v":0},{"$f":"'SIP Trunks Details'!Q355","v":0},{"$f":"'SIP Trunks Details'!R355","v":0},null,{"$f":"Q31*9","v":0},{"$f":"R31*9","v":0}]
[2,"Software","Subscription","sum",{"$f":"IF(F32=\"\",\"\",IF(F32=\"ZAR\",\"Local\",\"Foreign\"))","v":"Local"},"ZAR",{"$f":"IF(E32=\"\",\"\",IF(E32=\"Foreign\",VLOOKUP(F32,Currency!$E$20:$F$33,2,FALSE),1))","v":{"v":1,"d":"1.00"}},1,0,{"$f":"I32*$G32","v":0},{"$f":"I32*$H32","v":0},{"$f":"J32*$H32","v":0},null,1,0,{"$f":"O32*$G32","v":0},{"$f":"O32*$N32","v":0},{"$f":"P32*$N32","v":0},null,{"$f":"Q32*9","v":0},{"$f":"R32*9","v":0}]
[3,"Implementation","MS Teams Phone Direct Routing","sum",{"$f":"IF(F33=\"\",\"\",IF(F33=\"ZAR\",\"Local\",\"Foreign\"))","v":"Local"},"ZAR",{"$f":"IF(E33=\"\",\"\",IF(E33=\"Foreign\",VLOOKUP(F33,Currency!$E$20:$F$33,2,FALSE),1))","v":{"v":1,"d":"1.00"}},1,0,0,0,0]
[null,null,"Number portability","sum",{"$f":"IF(F34=\"\",\"\",IF(F34=\"ZAR\",\"Local\",\"Foreign\"))","v":"Local"},"ZAR",{"$f":"IF(E34=\"\",\"\",IF(E34=\"Foreign\",VLOOKUP(F34,Currency!$E$20:$F$33,2,FALSE),1))","v":{"v":1,"d":"1.00"}},1,0,{"$f":"I34*$G34","v":0},{"$f":"I34*$H34","v":0},{"$f":"J34*$H34","v":0}]
[null,null,"Configuration","sum",{"$f":"IF(F35=\"\",\"\",IF(F35=\"ZAR\",\"Local\",\"Foreign\"))","v":"Local"},"ZAR",{"$f":"IF(E35=\"\",\"\",IF(E35=\"Foreign\",VLOOKUP(F35,Currency!$E$20:$F$33,2,FALSE),1))","v":{"v":1,"d":"1.00"}},1,0,{"$f":"I35*$G35","v":0},{"$f":"I35*$H35","v":0},{"$f":"J35*$H35","v":0}]
[4,"Voice Minutes","Voice Minutes","Per Minute",{"$f":"IF(F36=\"\",\"\",IF(F36=\"ZAR\",\"Local\",\"Foreign\"))","v":"Local"},"ZAR",{"$f":"IF(E36=\"\",\"\",IF(E36=\"Foreign\",VLOOKUP(F36,Currency!$E$20:$F$33,2,FALSE),1))","v":{"v":1,"d":"1.00"}},1,0,0,0,0,null,1,0,0,{"$f":"O36*$N36","v":0},{"$f":"P36*$N36","v":0},null,{"$f":"Q36*9","v":0},{"$f":"R36*9","v":0}]
[5,"Professional Services\n(As and When Required)","Unified Comms Engineer","Hourly",{"$f":"IF(F37=\"\",\"\",IF(F37=\"ZAR\",\"Local\",\"Foreign\"))","v":"Local"},"ZAR",{"$f":"IF(E37=\"\",\"\",IF(E37=\"Foreign\",VLOOKUP(F37,Currency!$E$20:$F$33,2,FALSE),1))","v":{"v":1,"d":"1.00"}},1896,0,{"$f":"I37*$G37","v":0},{"$f":"I37*$H37","v":0},{"$f":"J37*$H37","v":0},null,656,0,0,0,0,null,{"$f":"Q37","v":0},{"$f":"R37","v":0}]
[null,null,"Project Manager","Hourly","Local","ZAR",{"$f":"IF(E38=\"\",\"\",IF(E38=\"Foreign\",VLOOKUP(F38,Currency!$E$20:$F$33,2,FALSE),1))","v":{"v":1,"d":"1.00"}},1896,0,0,0,0,null,656,0,0,0,0,null,{"$f":"Q38","v":0},{"$f":"R38*9","v":0}]
[null,null,"Test Manager","Hourly",{"$f":"IF(F39=\"\",\"\",IF(F39=\"ZAR\",\"Local\",\"Foreign\"))","v":"Local"},"ZAR",{"$f":"IF(E39=\"\",\"\",IF(E39=\"Foreign\",VLOOKUP(F39,Currency!$E$20:$F$33,2,FALSE),1))","v":{"v":1,"d":"1.00"}},1896,0,{"$f":"I39*$G39","v":0},{"$f":"I39*$H39","v":0},{"$f":"J39*$H39","v":0},null,656,0,{"$f":"O39*$G39","v":0},{"$f":"O39*$N39","v":0},{"$f":"P39*$N39","v":0},null,{"$f":"Q39","v":0},{"$f":"R39*9","v":0}]
[null,null,"Test Analyst (Unified Comms Engineer)","Hourly","Local","ZAR",{"$f":"IF(E40=\"\",\"\",IF(E40=\"Foreign\",VLOOKUP(F40,Currency!$E$20:$F$33,2,FALSE),1))","v":{"v":1,"d":"1.00"}},1896,0,0,0,0,null,632,0,0,0,0,null,0,0]
[null,null,"Solution Architect","Hourly","Local","ZAR",{"$f":"IF(E41=\"\",\"\",IF(E41=\"Foreign\",VLOOKUP(F41,Currency!$E$20:$F$33,2,FALSE),1))","v":{"v":1,"d":"1.00"}},1896,0,0,0,0,null,656,0,0,0,0,null,0,0]
[null,null,"Network Specialist","Hourly",{"$f":"IF(F42=\"\",\"\",IF(F42=\"ZAR\",\"Local\",\"Foreign\"))","v":"Local"},"ZAR",{"$f":"IF(E42=\"\",\"\",IF(E42=\"Foreign\",VLOOKUP(F42,Currency!$E$20:$F$33,2,FALSE),1))","v":{"v":1,"d":"1.00"}},1368,0,{"$f":"I42*$G42","v":0},{"$f":"I42*$H42","v":0},{"$f":"J42*$H42","v":0},null,320,0,0,0,0,null,0,0]
[null,null,"Security Specialist","Hourly","Local","ZAR",{"$f":"IF(E43=\"\",\"\",IF(E43=\"Foreign\",VLOOKUP(F43,Currency!$E$20:$F$33,2,FALSE),1))","v":{"v":1,"d":"1.00"}},1368,0,0,0,0,null,320,0,0,0,0,null,0,0]
[6,"Training","Skills Transfer","per Attendee","Local","ZAR",{"$f":"IF(E44=\"\",\"\",IF(E44=\"Foreign\",VLOOKUP(F44,Currency!$E$20:$F$33,2,FALSE),1))","v":{"v":1,"d":"1.00"}},20,0,0,0,0]
[null,null,"Seminars","per Attendee","Local","ZAR",{"$f":"IF(E45=\"\",\"\",IF(E45=\"Foreign\",VLOOKUP(F45,Currency!$E$20:$F$33,2,FALSE),1))","v":{"v":1,"d":"1.00"}},20,0,0,0,0]
[7,"Other\n(Applicable to the Proposed Services)","<Specify>","Sum","Local","ZAR",{"$f":"IF(E46=\"\",\"\",IF(E46=\"Foreign\",VLOOKUP(F46,Currency!$E$20:$F$33,2,FALSE),1))","v":{"v":1,"d":"1.00"}},1,0,0,0,0,null,1,0,{"$f":"O46*$G46","v":0},{"$f":"O46*$N46","v":0},{"$f":"P46*$N46","v":0},null,{"$f":"Q46*9","v":0},{"$f":"R46*9","v":0}]
[null,null,"<Specify>","Sum","Local","ZAR",{"$f":"IF(E47=\"\",\"\",IF(E47=\"Foreign\",VLOOKUP(F47,Currency!$E$20:$F$33,2,FALSE),1))","v":{"v":1,"d":"1.00"}},1,0,0,0,0,null,1,0,0,0,0,null,{"$f":"Q47*9","v":0},{"$f":"R47*9","v":0}]
[null,null,"<Specify>","Sum","Local","ZAR",{"$f":"IF(E48=\"\",\"\",IF(E48=\"Foreign\",VLOOKUP(F48,Currency!$E$20:$F$33,2,FALSE),1))","v":{"v":1,"d":"1.00"}},1,0,0,0,0,null,1,0,0,0,0,null,0,0]
[null,null,"<Specify>","Sum","Local","ZAR",{"$f":"IF(E49=\"\",\"\",IF(E49=\"Foreign\",VLOOKUP(F49,Currency!$E$20:$F$33,2,FALSE),1))","v":{"v":1,"d":"1.00"}},1,0,0,0,0,null,1,0,0,0,0,null,0,0]
[null,"Total ",{"$nulls":9},{"$f":"SUM(L31:L49)","v":0},{"$nulls":5},{"$f":"SUM(R31:R32,R36:R43,R46:R49)","v":0},null,null,{"$f":"SUM(U31:U32,U36:U43,U46:U49)","v":0}]
[]
[null,"GRAND TOTAL",{"$nulls":9},{"$f":"(L50)+(U50)","v":0}]
[]
[]
[null,"TABLE 1: PROVIDE ANY PRICING ASSUMPTIONS USED TO DETERMINE THE QUOTED PRICE"]
[null," "]

{"sheet":"SIP Trunks Details","index":1,"n_rows":355,"n_cols":21,"rows_kept":355,"merged":[[2,1,2,6],[6,4,6,6],[6,9,6,12],[6,14,6,17],[7,4,7,6],[8,0,21,0],[8,1,21,1],[22,0,35,0],[22,1,35,1],[36,0,49,0],[36,1,49,1],[50,0,63,0],[50,1,63,1],[64,0,77,0],[64,1,77,1],[78,0,91,0],[78,1,91,1],[92,0,105,0],[92,1,105,1],[106,0,119,0],[106,1,119,1],[126,4,126,6],[127,0,140,0],[127,1,140,1],[141,0,154,0],[141,1,154,1],[155,0,168,0],[155,1,168,1],[169,0,182,0],[169,1,182,1],[183,0,196,0],[183,1,196,1],[197,0,210,0],[197,1,210,1],[211,0,224,0],[211,1,224,1],[225,0,238,0],[225,1,238,1],[239,0,252,0],[239,1,252,1],[253,0,266,0],[253,1,266,1],[267,0,280,0],[267,1,280,1],[281,0,294,0],[281,1,294,1],[295,0,308,0],[295,1,308,1],[309,0,322,0],[309,1,322,1],[323,0,336,0],[323,1,336,1],[337,0,350,0],[337,1,350,1]]}
[null,"Pricing Schedule : SIP Trunks"]
[]
[null,{"$f":"'SIP Trunks'!B3:G3","v":"VENDOR NAME"}]
[]
[null,"OT PRIMARY SITES"]
[]
[null," ",{"$nulls":7},"PROJECT PHASE - COSTS",{"$nulls":4},"OPERATIONS PHASED COSTS (RECURRING COST OVER CONTRACT DURATION)"]
["Item Number","Category","Detailed Requirements","Unit charge","CURRENCY",null,null,"Total Estimated Quantity",null,"Unit Price in Nominated Currency","Unit Price in ZAR","Total [Nominated Currency]","Total in ZAR",null,"Unit Price in Nominated Currency","Unit Price in ZAR","Total [Nominated Currency]","Total in ZAR",null,null,"CONTRACT PRICE ADJUSTEMENT"]
[1,"Simmerpan (Bandwidth - 20mb/s) (Number of Calls - 240)",null,"sum",{"$f":"IF(F9=\"\",\"\",IF(F9=\"ZAR\",\"Local\",\"Foreign\"))","v":"Local"},"ZAR",{"$f":"IF(E9=\"\",\"\",IF(E9=\"Foreign\",VLOOKUP(F9,Currency!$E$20:$F$33,2,FALSE),1))","v":{"v":1,"d":"1.00"}},1,null,0,{"$f":"J9*$G9","v":0},{"$f":"J9*$H9","v":0},0,null,0,{"$f":"O9*$G9","v":0},{"$f":"O9*$H9","v":0},{"$f":"P9*$H9","v":0}]
[{"$nulls":3},"sum","Local","ZAR",{"$f":"IF(E10=\"\",\"\",IF(E10=\"Foreign\",VLOOKUP(F10,Currency!$E$20:$F$33,2,FALSE),1))","v":{"v":1,"d":"1.00"}},1,null,0,0,0,0,null,0,0,0,0]
[{"$nulls":3},"sum",{"$f":"IF(F11=\"\",\"\",IF(F11=\"ZAR\",\"Local\",\"Foreign\"))","v":"Local"},"ZAR",{"$f":"IF(E11=\"\",\"\",IF(E11=\"Foreign\",VLOOKUP(F11,Currency!$E$20:$F$33,2,FALSE),1))","v":{"v":1,"d":"1.00"}},1,null,0,{"$f":"J11*$G11","v":0},{"$f":"J11*$H11","v":0},{"$f":"K11*$H11","v":0},null,0,0,0,0]
[{"$nulls":3},"sum","Local","ZAR",{"$f":"IF(E12=\"\",\"\",IF(E12=\"Foreign\",VLOOKUP(F12,Currency!$E$20:$F$33,2,FALSE),1))","v":{"v":1,"d":"1.00"}},1,null,0,0,0,0,null,0,0,0,0]
[{"$nulls":3},"sum","Local","ZAR",{"$f":"IF(E13=\"\",\"\",IF(E13=\"Foreign\",VLOOKUP(F13,Currency!$E$20:$F$33,2,FALSE),1))","v":{"v":1,"d":"1.00"}},1,null,0,0,0,0,null,0,0,0,0]
[{"$nulls":3},"sum","Local","ZAR",{"$f":"IF(E14=\"\",\"\",IF(E14=\"Foreign\",VLOOKUP(F14,Currency!$E$20:$F$33,2,FALSE),1))","v":{"v":1,"d":"1.00"}},1,null,0,0,0,0,null,0,0,0,0]
[{"$nulls":3},"sum","Local","ZAR",{"$f":"IF(E15=\"\",\"\",IF(E15=\"Foreign\",VLOOKUP(F15,Currency!$E$20:$F$33,2,FALSE),1))","v":{"v":1,"d":"1.00"}},1,null,0,0,0,0,null,0,0,0,0]
[{"$nulls":3},"sum","Local","ZAR",{"$f":"IF(E16=\"\",\"\",IF(E16=\"Foreign\",VLOOKUP(F16,Currency!$E$20:$F$33,2,FALSE),1))","v":{"v":1,"d":"1.00"}},1,null,0,0,0,0,null,0,0,0,0]
[{"$nulls":3},"sum","Local","ZAR",{"$f":"IF(E17=\"\",\"\",IF(E17=\"Foreign\",VLOOKUP(F17,Currency!$E$20:$F$33,2,FALSE),1))","v":{"v":1,"d":"1.00"}},1,null,0,0,0,0,null,0,0,0,0]
[{"$nulls":3},"sum","Local","ZAR",{"$f":"IF(E18=\"\",\"\",IF(E18=\"Foreign\",VLOOKUP(F18,Currency!$E$20:$F$33,2,FALSE),1))","v":{"v":1,"d":"1.00"}},1,null,0,0,0,0,null,0,0,0,0]
[{"$nulls":3},"sum","Local","ZAR",{"$f":"IF(E19=\"\",\"\",IF(E19=\"Foreign\",VLOOKUP(F19,Currency!$E$20:$F$33,2,FALSE),1))","v":{"v":1,"d":"1.00"}},1,null,0,0,0,0,null,0,0,0,0]
[{"$nulls":3},"sum","Local","ZAR",{"$f":"IF(E20=\"\",\"\",IF(E20=\"Foreign\",VLOOKUP(F20,Currency!$E$20:$F$33,2,FALSE),1))","v":{"v":1,"d":"1.00"}},1,null,0,0,0,0,null,0,0,0,0]
[{"$nulls":3},"sum","Local","ZAR",{"$f":"IF(E21=\"\",\"\",IF(E21=\"Foreign\",VLOOKUP(F21,Currency!$E$20:$F$33,2,FALSE),1))","v":{"v":1,"d":"1.00"}},1,null,0,0,0,0,null,0,0,0,0]
[{"$nulls":3},"sum","Local","ZAR",{"$f":"IF(E22=\"\",\"\",IF(E22=\"Foreign\",VLOOKUP(F22,Currency!$E$20:$F$33,2,FALSE),1))","v":{"v":1,"d":"1.00"}},1,null,0,0,0,0,null,0,0,0,0]
[2,"Duvha (Bandwidth - 20mb/s) (Number of Calls - 240)",null,"sum","Local","ZAR",{"$f":"IF(E23=\"\",\"\",IF(E23=\"Foreign\",VLOOKUP(F23,Currency!$E$20:$F$33,2,FALSE),1))","v":{"v":1,"d":"1.00"}},1,null,0,0,0,0,null,0,0,0,0]
[{"$nulls":3},"sum","Local","ZAR",{"$f":"IF(E24=\"\",\"\",IF(E24=\"Foreign\",VLOOKUP(F24,Currency!$E$20:$F$33,2,FALSE),1))","v":{"v":1,"d":"1.00"}},1,null,0,0,0,0,null,0,0,0,0]
[{"$nulls":3},"sum",{"$f":"IF(F25=\"\",\"\",IF(F25=\"ZAR\",\"Local\",\"Foreign\"))","v":"Local"},"ZAR",{"$f":"IF(E25=\"\",\"\",IF(E25=\"Foreign\",VLOOKUP(F25,Currency!$E$20:$F$33,2,FALSE),1))","v":{"v":1,"d":"1.00"}},1,null,0,{"$f":"J25*$G25","v":0},{"$f":"J25*$H25","v":0},{"$f":"K25*$H25","v":0},null,0,0,0,0]
[{"$nulls":3},"sum","Local","ZAR",{"$f":"IF(E26=\"\",\"\",IF(E26=\"Foreign\",VLOOKUP(F26,Currency!$E$20:$F$33,2,FALSE),1))","v":{"v":1,"d":"1.00"}},1,null,0,0,0,0,null,0,0,0,0]
[{"$nulls":3},"sum","Local","ZAR",{"$f":"IF(E27=\"\",\"\",IF(E27=\"Foreign\",VLOOKUP(F27,Currency!$E$20:$F$33,2,FALSE),1))","v":{"v":1,"d":"1.00"}},1,null,0,0,0,0,null,0,0,0,0]
[{"$nulls":3},"sum","Local","ZAR",{"$f":"IF(E28=\"\",\"\",IF(E28=\"Foreign\",VLOOKUP(F28,Currency!$E$20:$F$33,2,FALSE),1))","v":{"v":1,"d":"1.00"}},1,null,0,0,0,0,null,0,0,0,0]
[{"$nulls":3},"sum","Local","ZAR",{"$f":"IF(E29=\"\",\"\",IF(E29=\"Foreign\",VLOOKUP(F29,Currency!$E$20:$F$33,2,FALSE),1))","v":{"v":1,"d":"1.00"}},1,null,0,0,0,0,null,0,0,0,0]
[{"$nulls":3},"sum","Local","ZAR",{"$f":"IF(E30=\"\",\"\",IF(E30=\"Foreign\",VLOOKUP(F30,Currency!$E$20:$F$33,2,FALSE),1))","v":{"v":1,"d":"1.00"}},1,null,0,0,0,0,null,0,0,0,0]
[{"$nulls":3},"sum","Local","ZAR",{"$f":"IF(E31=\"\",\"\",IF(E31=\"Foreign\",VLOOKUP(F31,Currency!$E$20:$F$33,2,FALSE),1))","v":{"v":1,"d":"1.00"}},1,null,0,0,0,0,null,0,0,0,0]
[{"$nulls":3},"sum","Local","ZAR",{"$f":"IF(E32=\"\",\"\",IF(E32=\"Foreign\",VLOOKUP(F32,Currency!$E$20:$F$33,2,FALSE),1))","v":{"v":1,"d":"1.00"}},1,null,0,0,0,0,null,0,0,0,0]
[{"$nulls":3},"sum","Local","ZAR",{"$f":"IF(E33=\"\",\"\",IF(E33=\"Foreign\",VLOOKUP(F33,Currency!$E$20:$F$33,2,FALSE),1))","v":{"v":1,"d":"1.00"}},1,null,0,0,0,0,null,0,0,0,0]
[{"$nulls":3},"sum","Local","ZAR",{"$f":"IF(E34=\"\",\"\",IF(E34=\"Foreign\",VLOOKUP(F34,Currency!$E$20:$F$33,2,FALSE),1))","v":{"v":1,"d":"1.00"}},1,null,0,0,0,0,null,0,0,0,0]
[{"$nulls":3},"sum","Local","ZAR",{"$f":"IF(E35=\"\",\"\",IF(E35=\"Foreign\",VLOOKUP(F35,Currency!$E$20:$F$33,2,FALSE),1))","v":{"v":1,"d":"1.00"}},1,null,0,0,0,0,null,0,0,0,0]
[{"$nulls":3},"sum","Local","ZAR",{"$f":"IF(E36=\"\",\"\",IF(E36=\"Foreign\",VLOOKUP(F36,Currency!$E$20:$F$33,2,FALSE),1))","v":{"v":1,"d":"1.00"}},1,null,0,0,0,0,null,0,0,0,0]
[3,"Bellvile (Bandwidth - 5mb/s) (Number of Calls - 60)",null,"sum","Local","ZAR",{"$f":"IF(E37=\"\",\"\",IF(E37=\"Foreign\",VLOOKUP(F37,Currency!$E$20:$F$33,2,FALSE),1))","v":{"v":1,"d":"1.00"}},1,null,0,0,0,0,null,0,0,0,0]
[{"$nulls":3},"sum","Local","ZAR",{"$f":"IF(E38=\"\",\"\",IF(E38=\"Foreign\",VLOOKUP(F38,Currency!$E$20:$F$33,2,FALSE),1))","v":{"v":1,"d":"1.00"}},1,null,0,0,0,0,null,0,0,0,0]
[{"$nulls":3},"sum",{"$f":"IF(F39=\"\",\"\",IF(F39=\"ZAR\",\"Local\",\"Foreign\"))","v":"Local"},"ZAR",{"$f":"IF(E39=\"\",\"\",IF(E39=\"Foreign\",VLOOKUP(F39,Currency!$E$20:$F$33,2,FALSE),1))","v":{"v":1,"d":"1.00"}},1,null,0,{"$f":"J39*$G39","v":0},{"$f":"J39*$H39","v":0},{"$f":"K39*$H39","v":0},null,0,0,0,0]
[{"$nulls":3},"sum","Local","ZAR",{"$f":"IF(E40=\"\",\"\",IF(E40=\"Foreign\",VLOOKUP(F40,Currency!$E$20:$F$33,2,FALSE),1))","v":{"v":1,"d":"1.00"}},1,null,0,0,0,0,null,0,0,0,0]
[{"$nulls":3},"sum","Local","ZAR",{"$f":"IF(E41=\"\",\"\",IF(E41=\"Foreign\",VLOOKUP(F41,Currency!$E$20:$F$33,2,FALSE),1))","v":{"v":1,"d":"1.00"}},1,null,0,0,0,0,null,0,0,0,0]
[{"$nulls":3},"sum","Local","ZAR",{"$f":"IF(E42=\"\",\"\",IF(E42=\"Foreign\",VLOOKUP(F42,Currency!$E$20:$F$33,2,FALSE),1))","v":{"v":1,"d":"1.00"}},1,null,0,0,0,0,null,0,0,0,0]
[{"$nulls":3},"sum","Local","ZAR",{"$f":"IF(E43=\"\",\"\",IF(E43=\"Foreign\",VLOOKUP(F43,Currency!$E$20:$F$33,2,FALSE),1))","v":{"v":1,"d":"1.00"}},1,null,0,0,0,0,null,0,0,0,0]
[{"$nulls":3},"sum","Local","ZAR",{"$f":"IF(E44=\"\",\"\",IF(E44=\"Foreign\",VLOOKUP(F44,Currency!$E$20:$F$33,2,FALSE),1))","v":{"v":1,"d":"1.00"}},1,null,0,0,0,0,null,0,0,0,0]
[{"$nulls":3},"sum","Local","ZAR",{"$f":"IF(E45=\"\",\"\",IF(E45=\"Foreign\",VLOOKUP(F45,Currency!$E$20:$F$33,2,FALSE),1))","v":{"v":1,"d":"1.00"}},1,null,0,0,0,0,null,0,0,0,0]
[{"$nulls":3},"sum","Local","ZAR",{"$f":"IF(E46=\"\",\"\",IF(E46=\"Foreign\",VLOOKUP(F46,Currency!$E$20:$F$33,2,FALSE),1))","v":{"v":1,"d":"1.00"}},1,null,0,0,0,0,null,0,0,0,0]
[{"$nulls":3},"sum","Local","ZAR",{"$f":"IF(E47=\"\",\"\",IF(E47=\"Foreign\",VLOOKUP(F47,Currency!$E$20:$F$33,2,FALSE),1))","v":{"v":1,"d":"1.00"}},1,null,0,0,0,0,null,0,0,0,0]
[{"$nulls":3},"sum","Local","ZAR",{"$f":"IF(E48=\"\",\"\",IF(E48=\"Foreign\",VLOOKUP(F48,Currency!$E$20:$F$33,2,FALSE),1))","v":{"v":1,"d":"1.00"}},1,null,0,0,0,0,null,0,0,0,0]
[{"$nulls":3},"sum","Local","ZAR",{"$f":"IF(E49=\"\",\"\",IF(E49=\"Foreign\",VLOOKUP(F49,Currency!$E$20:$F$33,2,FALSE),1))","v":{"v":1,"d":"1.00"}},1,null,0,0,0,0,null,0,0,0,0]
[{"$nulls":3},"sum","Local","ZAR",{"$f":"IF(E50=\"\",\"\",IF(E50=\"Foreign\",VLOOKUP(F50,Currency!$E$20:$F$33,2,FALSE),1))","v":{"v":1,"d":"1.00"}},1,null,0,0,0,0,null,0,0,0,0]
[4,"Sunilaws (Bandwidth - 5mb/s) (Number of Calls - 60)",null,"sum","Local","ZAR",{"$f":"IF(E51=\"\",\"\",IF(E51=\"Foreign\",VLOOKUP(F51,Currency!$E$20:$F$33,2,FALSE),1))","v":{"v":1,"d":"1.00"}},1,null,0,0,0,0,null,0,0,0,0]
[{"$nulls":3},"sum","Local","ZAR",{"$f":"IF(E52=\"\",\"\",IF(E52=\"Foreign\",VLOOKUP(F52,Currency!$E$20:$F$33,2,FALSE),1))","v":{"v":1,"d":"1.00"}},1,null,0,0,0,0,null,0,0,0,0]
[{"$nulls":3},"sum","Local","ZAR",{"$f":"IF(E53=\"\",\"\",IF(E53=\"Foreign\",VLOOKUP(F53,Currency!$E$20:$F$33,2,FALSE),1))","v":{"v":1,"d":"1.00"}},1,null,0,0,0,0,null,0,0,0,0]
[{"$nulls":3},"sum","Local","ZAR",{"$f":"IF(E54=\"\",\"\",IF(E54=\"Foreign\",VLOOKUP(F54,Currency!$E$20:$F$33,2,FALSE),1))","v":{"v":1,"d":"1.00"}},1,null,0,0,0,0,null,0,0,0,0]
[{"$nulls":3},"sum","Local","ZAR",{"$f":"IF(E55=\"\",\"\",IF(E55=\"Foreign\",VLOOKUP(F55,Currency!$E$20:$F$33,2,FALSE),1))","v":{"v":1,"d":"1.00"}},1,null,0,0,0,0,null,0,0,0,0]
[{"$nulls":3},"sum","Local","ZAR",{"$f":"IF(E56=\"\",\"\",IF(E56=\"Foreign\",VLOOKUP(F56,Currency!$E$20:$F$33,2,FALSE),1))","v":{"v":1,"d":"1.00"}},1,null,0,0,0,0,null,0,0,0,0]
[{"$nulls":3},"sum","Local","ZAR",{"$f":"IF(E57=\"\",\"\",IF(E57=\"Foreign\",VLOOKUP(F57,Currency!$E$20:$F$33,2,FALSE),1))","v":{"v":1,"d":"1.00"}},1,null,0,0,0,0,null,0,0,0,0]
[{"$nulls":3},"sum","Local","ZAR",{"$f":"IF(E58=\"\",\"\",IF(E58=\"Foreign\",VLOOKUP(F58,Currency!$E$20:$F$33,2,FALSE),1))","v":{"v":1,"d":"1.00"}},1,null,0,0,0,0,null,0,0,0,0]
[{"$nulls":3},"sum","Local","ZAR",{"$f":"IF(E59=\"\",\"\",IF(E59=\"Foreign\",VLOOKUP(F59,Currency!$E$20:$F$33,2,FALSE),1))","v":{"v":1,"d":"1.00"}},1,null,0,0,0,0,null,0,0,0,0]
[{"$nulls":3},"sum","Local","ZAR",{"$f":"IF(E60=\"\",\"\",IF(E60=\"Foreign\",VLOOKUP(F60,Currency!$E$20:$F$33,2,FALSE),1))","v":{"v":1,"d":"1.00"}},1,null,0,0,0,0,null,0,0,0,0]
{"$rows_left_out":296}
{"sheet":"Currency","index":2,"n_rows":33,"n_cols":8,"rows_kept":33,"merged":[[1,1,1,5],[6,2,6,7],[7,1,9,1],[7,2,7,7],[7,15,7,20],[8,2,8,7],[9,2,9,7],[10,2,10,7],[11,2,11,7],[12,1,14,1],[12,2,12,7],[13,2,13,7],[14,2,14,7],[17,2,17,7]]}
[]
[null,{"$f":"'SIP Trunks'!B3","v":"VENDOR NAME"}]
[]
[null,"EXCHANGE RATES FOR MULTIPLE CURRENCIES"]
[]
[null,"NOTES:"]
[null,1,"The table below needs to be completed if the Employer will be exposed to any currency fluctuation as stipulated in Secondary Clause X3.  For conversion of the foreign portions to Rand, please use the South African Reserve Bank's (SARB) exchange rate at 12:00 on the day of advertisement of the bid.  This is in terms of the Preferential Procurement Policy Framework Act (PPPFA) with which the Employer has to comply.\nNB: Tenderers must submit proof of the SARB rate(s) of exchange used  "]
[null,2,"The following URL (electronic route) is to be followed to access the relevant SARB rates on their web pages:\n"]
[null,null,"www.resbank.co.za"]
[null,null,"-  Select Research\n-  Then select Rates\n-  Click on \"Select historical exchange rates and other interest rates\"\n-  Clicking on the exchange rate in the following page opens the daily rates per currency and SA Rand"]
[null,3,"The Employer deals only in the currencies listed below unless other currencies are specifically approved for this tender.  Kindly notify the Employer of any currency that the tenderer intends to use, but is not stipulated in the table, to consider sanctioning such currency.  Sufficient time must be allowed for the assessment and to respond to such request.  The onus is on the tenderer to submit a bid with approved currencies"]
[null,4,"The format in which the exchange rate must be inserted in the table is:  1 (One) Foreign Currency = R Amount  (i.e. the Rand amount for one of each foreign currency applicable).  Exchange rates must be rounded to 4 decimals\n\nNB :  Only the USD/ZAR, GBP/ZAR and EUR/ZAR are published in this way on the SARB web pages above.  The Rand rate with the other currencies must be inverted (1/Foreign Currency Rate) in order to list it in the required format in the table below\n"]
[null,5,"All information in the table below must conform with all other equivalent information in the offer. "]
[null,null,"Payment in terms of Payment Method 2  is considered as a \"foreign payment\" although it will be effected in South African Rand. However, amounts for  \"F.O.R. Price-Goods supplied from Imported Items\", are NOT considered as \"foreign payments\""]
[null,null,"If more than one payment method apply for a currency, the Tenderer must request an additional row be inserted in the table in order to split the values and identify the relevant method.   "]
[]
[]
[null,null,"MULTIPLE CURRENCIES"]
[null,null,"No","Currency Description","Code","Exchange Rate Currency 1,00 =","Date Published","Source"]
[null,null,1,"Australian Dollar","AUD"]
[null,null,2,"Canadian Dollar","CAN"]
[null,null,3,"Swiss Franc","CHF"]
[null,null,4,"Danish Krone","DKK"]
[null,null,5,"European Currency","EUR"]
[null,null,6,"British Pound","GBP"]
[null,null,7,"Hong Kong Dollar","HKD"]
[null,null,8,"Japanese Yen","JPY"]
[null,null,9,"Norwegian Krone","NOK"]
[null,null,10,"New Zealand Dollar","NZD"]
[null,null,11,"Swedish Krone","SEK"]
[null,null,12,"Singapore Dollar","SGD"]
[null,null,13,"United States Dollar","USD"]
[null,null,14,"South African Rand","ZAR",{"v":1,"d":"R 1.000000"}]