{"text_format":"3","workbook":"xlsx","n_sheets":6,"sheets":["Read Me","Tender Cover Sheet","5.1.0 Preamble","5.1.1 Pricing Table 1-3","5.1.2 CPA Formulae","5.1.3 Summary"],"not_rendered":{"images":1,"external_links":3,"defined_names":22},"read":"whole","date_system":"1900"}

{"sheet":"Read Me","index":0,"n_rows":25,"n_cols":3,"rows_kept":25,"merged":[[7,1,7,2],[8,1,8,2],[9,1,9,2],[10,1,10,2],[15,8,15,15],[16,8,16,15],[21,1,21,2],[22,1,22,2]]}
["Enquiry No.",null,"E2713NTCSAMWP"]
["Package Name:",null,"Telecommunications - Gauteng Region"]
["Tenderer's Name:",null,"Provision of Proactive Monitoring and Prevention of Theft / Damage to Telecommunication’s Infrastructure, Armed Response & Escorting."]
["Category of Offer ( Main Offer Only):",null,"Main Offer Only"]
[]
["READ ME"]
[]
[1,"Read these notes BEFORE you commence input  to this workbook. Changes may not be made to this workbook. No columns may be removed, edited, added or changed on this workbook."]
[2,"Only The Main Offer shall be accepted. No alternative offers are accepted. There must be a separate Excel and PDF file for the main offer."]
[3,"Main offer is = The pricing schedule may not be changed or altered. Tenderer(s) to populate all required information on the Tender cover sheet and also populate as stipulated in (5.1.1 Pricing, 5.1.2 CPA Formulae and 5.1.3 Summary (VAT Portion). "]
[4,"NOTE:  ALL CALCULATIONS ARE THE RESPONSIBILITY OF THE TENDERER, AND MUST BE CHECKED THOROUGHLY.  ANY DISCREPANCY FOUND IN THE CALCULATIONS IN THIS WORKBOOK MUST BE BROUGHT TO THE ATTENTION OF ESKOM NTCSA, THROUGH THE DESIGNATED BUYER!"]
[]
[]
[5,"This workbook contains the following sheets:"]
[null,"Read Me","This sheet provides an overview to the Tenderer of the content and role of the sheets making up the Price Schedule.  It will not form part of the tender or contract.The tender will be awarded to a single supplier for this price list. The units quantities herein are estimates only and are non-committal."]
[null,"Tender Cover Sheet","This is the cover sheet for Worksheets 5.1.0 to 5.1.3 and provides the total tendered price which is mandatory be completed.  It is also the source of the package name, tenderer name etc. for the other worksheets.  It will  form part of the tender or contract. Worksheets Tender Cover Sheet, 5.1.1 Pricing, 5.1.2 CPA Formulae and  5.1.3 Summary are compulsory tender returnables as they are loaded onto the Eskom Tender Bulletin and they may not be changed or altered."]
[null,"5.1.0 Preamble","This sheet provides general guidelines for this section."]
[null,"5.1.1 Pricing","This is the main data entry sheet for the Tenderer to complete. The Tenderer takes responsibility for ensuring correct inputs. Tenderers are to populate their pricing information as stipulated in the pricing schedule. The pricing schedule may not be changed or altered. Tenderer(s) to populate all required information on the Tender cover sheet as stipulated in  (5.1.1 Pricing ) and  (5.1.2 CPA Formulae). "]
[null,"5.1.2 CPA Formulae","This sheet must be completed by the Tenderer for the proposed contract price adjustment (CPA) formulae, (where applicable ) and will be carried forward to worksheet (5.1.1 Pricing). Details of the CPA Formulae to be determined in accordance with the CPA conditions with reference to the NOTES. If the CPA Formulae are not inputted, in worksheet 5.1.2 CPA formulae, the tendered prices will be deemed \"Fixed and Firm\"."]
[]
[]
[6,"Conventions used in this workbook"]
[null,"The following conventions have been used in this workbook to facilitate its accurate use:"]
[null,null,"Only Light Green highlighted cells are to be inputted by the Tenderer."]
[null,null,"There will be no inputting in Grey highlighted cells."]

{"sheet":"Tender Cover Sheet","index":1,"n_rows":44,"n_cols":4,"rows_kept":44}
{"$rows_empty":9}
[null,"PRICING INFORMATION"]
[]
[null,"ENQUIRY No.","E2713NTCSAMWP"]
[]
[null,"NAME OF PACKAGE:"]
[]
[null,"TENDERER’S NAME:  "]
[]
[null,"CATEGORY OF OFFER (MAIN OFFER ONLY):",{"$f":"'[2]Read Me'!C4","v":"Main Offer Only"}]
[]
[null,"TENDERED PRICE:  IN ZAR",{"$f":"'5.1.3 Summary'!C13","v":{"v":0,"d":"  0  RAND"}}]
[null,"(excluding VAT)"]
[]
[null,"RAND VALUE IN WORDS","[Price in Words]"]
[]
[]
[]
[]
[null,"TENDERED PRICE:  IN ZAR",{"$f":"'5.1.3 Summary'!C16","v":{"v":0,"d":"  0  RAND"}}]
[null,"(including VAT)"]
[]
[null,"DATE :"]
[]
[]
[]
[null,"FULL NAMES OF SIGNATORY:"]
[]
[]
[]
[null,"DESIGNATION OF SIGNATORY:"]
[]
[]
[]
[null,"SIGNATURE :"]
[{"$nulls":3}," "]

{"sheet":"5.1.0 Preamble","index":2,"n_rows":18,"n_cols":3,"rows_kept":18,"merged":[[0,0,0,1],[1,0,1,1],[2,0,2,1],[3,0,3,1],[7,1,7,2],[8,1,8,2],[9,1,9,2],[10,1,10,2],[11,1,11,2],[12,1,12,2],[13,1,13,2],[14,1,14,2],[15,1,15,2],[16,1,16,2],[17,1,17,2]]}
["Enquiry No.",null,"E2713NTCSAMWP"]
["Package Name:",null,"Telecommunications - Gauteng Region"]
["Tenderer's Name:",null,"National Transmission Company- South Africa, Telecommunications – Gauteng Province for the provision of Security Services, Static Guarding, Patrols, Armed Escorting and Ad-hoc Services."]
["Category of Offer:",null,{"$f":"'[2]Read Me'!C4","v":"Main Offer Only"}]
[]
["5.1.0 PREAMBLE TO PRICE SCHEDULE "]
[]
[1,"The Price Schedule provides the basis of valuation, price adjustment (CPA) formulae and information for general contract progress monitoring. "]
[2,"This is the main data entry sheet for the Tenderer to complete. The Tenderer takes responsibility for ensuring correct inputs. Tenderers are to populate their pricing information as stipulated in the pricing schedule. The pricing schedule may not be changed or altered. Tenderer(s) to populate all required information on the Tender cover sheet and also populate  as stipulated in  (5.1.1 Pricing ) and (5.1.2 CPA Formulae). CPA Formulae should represent cost breakdown of the goods/commodities/components/items being sourced."]
[3,"The Prices are the amounts stated in the price column of the Price Schedule.  Where an estimated quantity is stated for an item in the Price Schedule, the Price is calculated by multiplying the estimated quantity by the rate."]
[4,"If the Supplier has decided not to identify a particular item in the price schedule at the time of tender the cost to the Supplier of doing the work is assumed to be included in, or spread across, the other Prices and rates in the price schedule in order to fulfil the obligation to Provide the Goods and Services for the tendered total of the Prices.  "]
[5,"The total of the prices must include for all direct and indirect costs, overheads, profit on costs, risks, liabilities, obligations, etc. relative to the contract."]
[6,"The Tenderer must allow for all necessary costs to complete the pricing shedule as required in terms of the specifications, technical scope and conditions of contract whether expressly stated or not in the Price Schedules. The Tenderer must provide any breakdown of prices as may be required for specific items not detailed in the Price Schedule prior to or after contract award."]
[7,"The Prices quoted by the supplier should be exclusive and inclusive of VAT."]
[8," Please note, that the Tenderer is to input the VAT amount as no formulae has been provided for the VAT portion."]
[9,"All worksheets in this Pricing Schedule are to be submitted. Tenderers are not allowed to ommit a worksheet. If specifically worksheets, 5.1.1 or 5.1.2 are ommited, it will be deemed that CPA  are not applicable to this tender. "]
[10,"Only Light Green highlighted cells are to be inputted by the Tenderer."]
[11,"There will be no inputting in Grey highlighted cells."]

{"sheet":"5.1.1 Pricing Table 1-3","index":3,"n_rows":133,"n_cols":21,"rows_kept":133,"merged":[[8,1,8,2],[9,1,9,2],[11,5,11,6],[11,7,11,8],[11,9,11,20],[12,0,13,0],[12,1,13,1],[12,2,13,2],[12,3,13,3],[12,4,13,4],[12,5,13,5],[12,6,13,6],[12,7,13,7],[12,8,13,8],[12,9,13,9],[12,10,13,19],[12,20,13,20],[59,3,59,4],[66,3,66,4],[73,3,73,4],[80,3,80,4],[87,3,87,4],[94,3,94,4]]}
["Enquiry No.","E2713NTCSAMWP"]
["Package Name:","Telecommunications - Gauteng Region"]
["Tenderer's Name:","National Transmission Company- South Africa, Telecommunications – Gauteng Province for the provision of Security Services, Static Guarding, Patrols, Armed Escorting and Ad-hoc Services."]
["Category of Offer:",{"$f":"'[1]Read Me'!C4","v":"Main Offer Only"}]
[]
["5.1.1. Pricing"]
[]
["NOTES:"]
[1,"NB - Column F & Column N in 5.1.1 Pricing is a  drop down cell for tenderer to select the Currency and CPA formula chosen that they would have populated in 5.1.2 CPA Formulae. It is the Tenderer's responsibility to ensure that Column H correctly reflects the intention of the Tenderer."]
[2,"CPA Formulae Codes Column I 5.1.1 Pricing is to be populated by the tenderer by selecting the respective drop down codes CPA formula as  developed by Tenderer in 5.1.2 CPA formulae worksheet   (e.g. Formula A - J ) then  the tenderer must populate their respective CPA formula in  5.1.2 CPA Formulae Worksheet. Codes and descriptions must be selected by the tenderer and inserted into each row of activity. "]
[]
[{"$nulls":5},"Local Currency",{"$nulls":3},"CPA"]
["Line No.","Site Description","Unit of measure","Estimated Quantities","Estimated Duration ( No. of Months)","Tendered Rates (ZAR)","Total Tendered Value (ZAR)","Vat ","Tendered Price Including Vat (ZAR)","CPA Formula No.\n(See Sheet 5.1.2)","CPA Formula No.\n(See Sheet 5.1.2)",{"$nulls":9},"CPA Description\n(See Sheet 5.1.2)"]
[]
[null,"List of required services ",{"$nulls":7},"SELECT DROPDOWN "]
[]
["Table 1","Grade C Armed patrol, armed escorting and armed response for Gauteng Radio Sites (Only When Required)"]
[1.1,"SIM SOUTH"]
["1.1.1","ARMED RESPONSE  1X VEHICLE 4X4 BAKKIE            NB: A maximum of 1000km per vehicle per month","Monthly",1,36,null,{"$f":"D19*E19*F19","v":0},{"$f":"G19*15%","v":0},{"$f":"G19+H19","v":0},null,"A","B","C","D","E","F","G","H","I","J",{"$f":"IF(J19=\"\",\"Fixed\",VLOOKUP(J19,'5.1.2 CPA Formulae'!$B$9:$E$20,2,FALSE))","v":"Fixed"}]
["1.1.2","PANIC BUTTON","Monthly",1,36,null,{"$f":"D20*E20*F20","v":0},{"$f":"G20*15%","v":0},{"$f":"G20+H20","v":0},{"$nulls":11},{"$f":"IF(J20=\"\",\"Fixed\",VLOOKUP(J20,'[1]5.1.2 CPA Formulae'!$B$9:$E$20,2,FALSE))","v":"Fixed"}]
["1.1.3","ARMED RESPONSE GRADE C  guards in full uniform with body armour always. ( Day Shift)- MON-SUN (x2)  Issued with 2 x  firearm 9mm with additional 2 x magazine full of 15 rounds.","Monthly",2,36,null,0,0,0,{"$nulls":11},{"$f":"IF(J21=\"\",\"Fixed\",VLOOKUP(J21,'[1]5.1.2 CPA Formulae'!$B$9:$E$20,2,FALSE))","v":"Fixed"}]
["1.1.4","ARMED RESPONSE GRADE C  guards in full uniform with body armour always.( Night Shift)- MON-SUN (x2)  Issued with 2 x  firearm 9mm with additional 2 x magazine full of 15 rounds.","Monthly",2,36,null,0,{"$f":"G22*15%","v":0},{"$f":"G22+H22","v":0},{"$nulls":11},{"$f":"IF(J22=\"\",\"Fixed\",VLOOKUP(J22,'[1]5.1.2 CPA Formulae'!$B$9:$E$20,2,FALSE))","v":"Fixed"}]
[]
[1.2,"SIM NORTH"]
["1.2.1","ARMED RESPONSE  1X VEHICLE 4X4 BAKKIE            NB: A maximum of 1000km per vehicle per month","Monthly",1,36,null,{"$f":"D25*E25*F25","v":0},{"$f":"G25*15%","v":0},{"$f":"G25+H25","v":0},null,"A","B","C","D","E","F","G","H","I","J",{"$f":"IF(J25=\"\",\"Fixed\",VLOOKUP(J25,'5.1.2 CPA Formulae'!$B$9:$E$20,2,FALSE))","v":"Fixed"}]
["1.2.2","PANIC BUTTON","Monthly",1,36,null,{"$f":"D26*E26*F26","v":0},{"$f":"G26*15%","v":0},{"$f":"G26+H26","v":0},{"$nulls":11},{"$f":"IF(J26=\"\",\"Fixed\",VLOOKUP(J26,'[1]5.1.2 CPA Formulae'!$B$9:$E$20,2,FALSE))","v":"Fixed"}]
["1.2.3","ARMED RESPONSE GRADE C  guards in full uniform with body armour always. ( Day Shift)- MON-SUN (x2)  Issued with 2 x  firearm 9mm with additional 2 x magazine full of 15 rounds.","Monthly",2,36,null,0,0,0,{"$nulls":11},{"$f":"IF(J27=\"\",\"Fixed\",VLOOKUP(J27,'[1]5.1.2 CPA Formulae'!$B$9:$E$20,2,FALSE))","v":"Fixed"}]
["1.2.4","ARMED RESPONSE GRADE C  guards in full uniform with body armour always.( Night Shift)- MON-SUN (x2)  Issued with 2 x  firearm 9mm with additional 2 x magazine full of 15 rounds.","Monthly",2,36,null,0,0,0,{"$nulls":11},{"$f":"IF(J28=\"\",\"Fixed\",VLOOKUP(J28,'[1]5.1.2 CPA Formulae'!$B$9:$E$20,2,FALSE))","v":"Fixed"}]
[]
[1.3,"SIM WEST"]
["1.3.1","ARMED RESPONSE  1X VEHICLE 4X4 BAKKIE            NB: A maximum of 1000km per vehicle per month","Monthly",1,36,null,{"$f":"D31*E31*F31","v":0},{"$f":"G31*15%","v":0},{"$f":"G31+H31","v":0},null,"A","B","C","D","E","F","G","H","I","J",{"$f":"IF(J31=\"\",\"Fixed\",VLOOKUP(J31,'5.1.2 CPA Formulae'!$B$9:$E$20,2,FALSE))","v":"Fixed"}]
["1.3.2","PANIC BUTTON","Monthly",1,36,null,{"$f":"D32*E32*F32","v":0},{"$f":"G32*15%","v":0},{"$f":"G32+H32","v":0},{"$nulls":11},{"$f":"IF(J32=\"\",\"Fixed\",VLOOKUP(J32,'[1]5.1.2 CPA Formulae'!$B$9:$E$20,2,FALSE))","v":"Fixed"}]
["1.3.3","ARMED RESPONSE GRADE C  guards in full uniform with body armour always. ( Day Shift)- MON-SUN (x2)  Issued with 2 x  firearm 9mm with additional 2 x magazine full of 15 rounds.","Monthly",2,36,null,0,0,0,{"$nulls":11},{"$f":"IF(J33=\"\",\"Fixed\",VLOOKUP(J33,'[1]5.1.2 CPA Formulae'!$B$9:$E$20,2,FALSE))","v":"Fixed"}]
["1.3.4","ARMED RESPONSE GRADE C  guards in full uniform with body armour always.( Night Shift)- MON-SUN (x2)  Issued with 2 x  firearm 9mm with additional 2 x magazine full of 15 rounds.","Monthly",2,36,null,0,0,0,{"$nulls":11},{"$f":"IF(J34=\"\",\"Fixed\",VLOOKUP(J34,'[1]5.1.2 CPA Formulae'!$B$9:$E$20,2,FALSE))","v":"Fixed"}]
[]
[1.4,"SIM EAST"]
["1.4.1","ARMED RESPONSE  1X VEHICLE 4X4 BAKKIE            NB: A maximum of 1000km per vehicle per month","Monthly",1,36,null,{"$f":"D37*E37*F37","v":0},{"$f":"G37*15%","v":0},{"$f":"G37+H37","v":0},null,"A","B","C","D","E","F","G","H","I","J",{"$f":"IF(J37=\"\",\"Fixed\",VLOOKUP(J37,'5.1.2 CPA Formulae'!$B$9:$E$20,2,FALSE))","v":"Fixed"}]
["1.4.2","PANIC BUTTON","Monthly",1,36,null,{"$f":"D38*E38*F38","v":0},{"$f":"G38*15%","v":0},{"$f":"G38+H38","v":0},{"$nulls":11},{"$f":"IF(J38=\"\",\"Fixed\",VLOOKUP(J38,'[1]5.1.2 CPA Formulae'!$B$9:$E$20,2,FALSE))","v":"Fixed"}]
["1.4.3","ARMED RESPONSE GRADE C  guards in full uniform with body armour always. ( Day Shift)- MON-SUN (x2)  Issued with 2 x  firearm 9mm with additional 2 x magazine full of 15 rounds.","Monthly",2,36,null,0,0,0,{"$nulls":11},{"$f":"IF(J39=\"\",\"Fixed\",VLOOKUP(J39,'[1]5.1.2 CPA Formulae'!$B$9:$E$20,2,FALSE))","v":"Fixed"}]
["1.4.4","ARMED RESPONSE GRADE C  guards in full uniform with body armour always.( Night Shift)- MON-SUN (x2)  Issued with 2 x  firearm 9mm with additional 2 x magazine full of 15 rounds.","Monthly",2,36,null,0,0,0,{"$nulls":11},{"$f":"IF(J40=\"\",\"Fixed\",VLOOKUP(J40,'[1]5.1.2 CPA Formulae'!$B$9:$E$20,2,FALSE))","v":"Fixed"}]
{"$rows_left_out":94}
{"sheet":"5.1.2 CPA Formulae","index":4,"n_rows":149,"n_cols":67,"rows_kept":149,"merged":[[0,0,0,1],[1,0,1,1],[2,0,2,1],[3,0,3,1],[5,0,5,4],[8,2,8,3],[8,5,8,7],[9,2,9,4],[9,5,19,7],[10,2,10,4],[11,2,11,4],[12,2,12,4],[13,2,13,4],[14,2,14,4],[15,2,15,4],[16,2,16,4],[17,2,17,4],[18,2,18,4],[19,2,19,4],[22,1,22,6],[23,1,23,6],[26,1,26,6],[27,1,27,6],[28,1,28,6],[29,1,29,6],[30,1,30,6],[31,1,31,6],[33,1,33,6],[34,1,34,6],[35,1,35,6],[36,1,36,6],[37,1,37,6],[41,1,41,6],[52,1,52,6],[63,1,63,6],[74,1,74,6],[85,1,85,6],[96,1,96,6],[107,1,107,6],[118,1,118,6],[129,1,129,6],[140,1,140,6]]}
["Enquiry No.",null,"E2713NTCSAMWP"]
["Package Name:",null,"Telecommunications - Gauteng Region"]
["Tenderer's Name:",null,"National Transmission Company- South Africa, Telecommunications – Gauteng Province for the provision of Security Services, Static Guarding, Patrols, Armed Escorting and Ad-hoc Services."]
["Category of Offer:",null,{"$f":"'[1]Read Me'!C4","v":"Main Offer Only"}]
[]
["5.1.2 CONTRACT PRICE ADJUSTMENT (CPA) FOR INFLATION"]
[]
["No.","Formula Code","Summary of the description of the Tenderer's Formulae"]
[1,"Fixed","Firm and Fixed ",null,null,"Prices are 100 % fixed and firm. CPA is not applicable. "]
[2,"A1","Tenderer's description of Multiple Formula ",null,null,"Type in the description of each formula in the tables below"]
[3,"A",{"$f":"B42","v":"Tenderer's description of Formula A"}]
[4,"B",{"$f":"B53","v":"Tenderer's description of Formula B"}]
[5,"C",{"$f":"B64","v":"Tenderer's description of Formula C"}]
[6,"D",{"$f":"B75","v":"Tenderer's description of Formula D"}]
[7,"E",{"$f":"B86","v":"Tenderer's description of Formula E"}]
[8,"F",{"$f":"B97","v":"Tenderer's description of Formula F"}]
[9,"G",{"$f":"B108","v":"Tenderer's description of Formula G"}]
[10,"H",{"$f":"B119","v":"Tenderer's description of Formula H"}]
[11,"I",{"$f":"B130","v":"Tenderer's description of Formula I"}]
[12,"J",{"$f":"B141","v":"Tenderer's description of Formula J"}]
[]
["SPECIFIC REQUIREMENTS"]
[{"v":1,"d":"1."},"Only Main Offer is to be submitted. Main offer tenderers are to fully comply with the requirements in the General Notes and CPA Formulae Notes below."]
[{"v":2,"d":"2."},"No ALTERNATIVE offers are accepted."]
[]
["GENERAL NOTES :"]
[1,"References to \"indices\" below mean \"cost indices or reference prices\"."]
[2,"Where 5 year historical information must be provided as instructed below, internet address references which are accessible to the general public may be submitted by the Tenderer instead, with the specific electronic route and web page reflecting the applicable data."]
[3,"The worksheet  CPA Formula in 5.1.2. has to be populated by the tenderer (columns B - J), unless the tenderer’s prices are fixed and firm for the duration of the contract. Each CPA formula must add up to a total of 100%.  All columns are to be populated. No inhouse CPA indices may be used. Tenderers are to provide all requested information.CPA Formulae should represent cost breakdown of the goods/commodities/components/items being sourced.\n"]
[4,"CPA Formulae Codes Column N 5.1.1 Pricing is to be populated by the tenderer by selecting the respective drop down codes CPA formula as  developed by Tenderer in 5.1.2 CPA formulae worksheet   (e.g. Formula A-J ) then  the tenderer must populate their respective CPA formula in  5.1.2 CPA Formulae Worksheet. Codes and descriptions must be selected by the tenderer and inserted into each row of activity. "]
[5,"Prices will be fixed for the first twelve (12) months after contract signing date and CPA will be applicable and will be applied on the contract 16 months from base date on an annual basis based on the CPA formula agreed on with tenderer."]
[6,"The CPA escalation will be calculated as follows: latest index which is the latest available index at the end of each contractual year vs. the base index which is one month prior to tender closing date. "]
["CPA FORMULA NOTES :"]
[1,"Proportions/weightings in CPA Formulae: The fixed portion of each formula, not subject to CPA, must be at least 15% but Tenderers may submit higher fixed portion percentages.  The other constituent indices and their proportions in each formula must be realistic and relative to the applicable work. The fixed portion and other proportions must add up to 100%.   "]
[2,"Formulae must be linked to independent cost indices or other benchmarks (\"reference prices\") and must be clearly and completely defined. The source must be a recognised and independent statistical publishing organisation.  The Tenderers' in-house indices may not be used."]
[3,"Local Price CPA: Where local indices other than those published by SEIFSA or Statistics SA are specified, the Tenderer must submit 5 years' of month by month historical data for such indices.  The Tenderer must ensure that indices are published and recommended by the source thereof as applicable to the work involved and that they are still in force/use and applicable at the date of submission of the tender. "]
[4,"CPA Base Date: The CPA base date for calculating price movements will be the Base Date, Month before Tender closes. For indices or reference prices published as at certain dates, and where such a date is not the Base Date, the latest date for which it is published before the Base Date will be considered as the Base Date index or reference price.  In instances where the figure or value is not as at the Base Date or considered as the Base Date Index or reference price as explained herein, the date, figure or value as well as the reason for the deviation must be clearly separately stated and must be realistic for purposes of CPA.  ",{"$nulls":10}," "]
[5,"Base Date Index :   The base index or reference price must be inserted in the appropriate column."]
[" "," "]
[]
{"$rows_left_out":110}
{"sheet":"5.1.3 Summary","index":5,"n_rows":16,"n_cols":5,"rows_kept":16,"merged":[[0,0,0,1],[1,0,1,1],[2,0,2,1],[3,0,3,1],[13,3,13,5],[15,3,15,5]]}
["Enquiry No.",null,"E2713NTCSAMWP"]
["Package Name:",null,"Telecommunications - Gauteng Region"]
["Tenderer's Name:",null,"National Transmission Company- South Africa, Telecommunications – Gauteng Province for the provision of Security Services, Static Guarding, Patrols, Armed Escorting and Ad-hoc Services."]
["Category of Offer:",null,{"$f":"'[3]Read Me'!C4","v":"Main Offer Only"}]
[]
["5.1.3 Summary ",{"$nulls":3},"Manual input required"]
[]
[null,null,"All prices in ZAR"]
["Table No.","Section Description","Total Tendered Value "]
[1,{"$f":"'5.1.1 Pricing Table 1-3'!B17","v":"Grade C Armed patrol, armed escorting and armed response for Gauteng Radio Sites (Only When Required)"},{"$f":"'5.1.1 Pricing Table 1-3'!G55","v":0}]
[2,{"$f":"'5.1.1 Pricing Table 1-3'!B56","v":"Grade C Static Guarding for Gauteng Radio Sites (Adhoc Security Services ONLY When Required)"},{"$f":"'5.1.1 Pricing Table 1-3'!G99","v":0}]
[3,{"$f":"'5.1.1 Pricing Table 1-3'!B100","v":"Dog and Dog Handler for Gauteng Radio Sites, Staff, Assets, with Armed escorting, patrol and response officer (Adhoc) (Only When Required)"},{"$f":"'5.1.1 Pricing Table 1-3'!G131","v":0}]
[null,null,{"$f":"SUM(C10:C13)","v":0}]
[null,"TOTAL PRICE EXCLUDING VAT",{"$f":"SUM(C10:C12)","v":0},"Must agree with Price (Excl. VAT) on Tender Cover Page"]
[null,"SOUTH AFRICAN VAT - ON IMPORTED GOODS",{"$f":"C13*15%","v":0}," "]
[null,"TOTAL PRICES INCLUDING VAT",{"$f":"C13+C15","v":0},"Must agree with Price (Incl. VAT) on Tender Cover Page"]