{"text_format":"3","workbook":"xlsx","n_sheets":2,"sheets":["Computer Devices","Currency"],"not_rendered":{"external_links":7,"defined_names":301},"read":"whole","date_system":"1900"}

{"sheet":"Computer Devices","index":0,"n_rows":95,"n_cols":20,"rows_kept":95,"merged":[[2,1,2,6],[25,5,25,7],[25,8,25,11],[25,13,25,17],[26,5,26,7],[27,0,33,0],[27,1,33,1],[36,0,42,0],[36,1,42,1],[45,0,51,0],[45,1,51,1],[54,0,60,0],[54,1,60,1],[63,0,68,0],[63,1,68,1],[71,0,76,0],[71,1,76,1],[79,0,84,0],[79,1,84,1],[87,0,93,0],[87,1,93,1]]}
[null,"Costing Schedule : Computer Costing Schedule"]
[]
[null,"VENDOR NAME"]
[]
[]
[]
[null,"IMPORTANT NOTES"]
[null,"All cells highlighted in GREEN must be completed"]
[null,"Quoted prices MUST be in ZAR, EXCLUDING VAT and ESCALATIONS"]
[]
[null,"Computer Devices and Services"]
[null,"Prices MUST be quoted based on the SCOPE provided"]
[null,"Select the currency from the CURRENCY drop-down list in COLUMN \"G\""]
[]
[null,"Capture the applicable Currency, ROE and ROE Published Date on the \"Currency sheet\". "]
[null,"The adjustments for prevailing rates and the basis for future price adjustments will be determined at time of contracting. "]
[null,"Exchange rate variations may not be claimed for the local mark-up in the pricing structure"]
[]
[null,"PROVIDE A SLIDING SCALE RATE TO ACCOMMODATE DEVICE QUANTITY INCREASE (COLUMNS N TO R)"]
[]
[null,"PROVIDE PRICE ADJUSTMENT FORMULA TO BE USED ON THE ANNIVERSARY OF THE CONTRACT (COLUMN T)"]
[]
[null,"All Prices must be exclusive of VAT"]
[]
[]
[null," ",{"$nulls":6},"UNIT PRICE",{"$nulls":4},"SLIDING SCALE ON DEVICE QUANTITY (CUMULATIVE VOLUMES)"]
["Item Number","Category","Description","Total Estimated Quantity","Unit charge","CURRENCY",null,null,"Unit Price in Nominated Currency","Unit Price in ZAR","Total [Nominated Currency]","Total in ZAR",null,500,1500,2500,3500,4500,null,"PRICE ADJUSTMENT"]
[1,"Engineering/Midrange","Device",1,"sum",{"$f":"IF(G28=\"\",\"\",IF(G28=\"ZAR\",\"Local\",\"Foreign\"))","v":"Local"},"ZAR",{"$f":"IF(F28=\"\",\"\",IF(F28=\"Foreign\",VLOOKUP(G28,Currency!$E$20:$F$33,2,FALSE),1))","v":{"v":1,"d":"1.00"}},0,{"$f":"I28*$H28","v":0},{"$f":"I28*$D28","v":0},{"$f":"J28*$D28","v":0}]
[null,null,"Shipping",1,"sum","Local","ZAR",{"$f":"IF(F29=\"\",\"\",IF(F29=\"Foreign\",VLOOKUP(G29,Currency!$E$20:$F$33,2,FALSE),1))","v":{"v":1,"d":"1.00"}},0,0,{"$f":"I29*$D29","v":0},{"$f":"J29*$D29","v":0}]
[null,null,"Distribution",1,"sum",{"$f":"IF(G30=\"\",\"\",IF(G30=\"ZAR\",\"Local\",\"Foreign\"))","v":"Local"},"ZAR",{"$f":"IF(F30=\"\",\"\",IF(F30=\"Foreign\",VLOOKUP(G30,Currency!$E$20:$F$33,2,FALSE),1))","v":{"v":1,"d":"1.00"}},0,{"$f":"I30*$H30","v":0},{"$f":"I30*$D30","v":0},{"$f":"J30*$D30","v":0}]
[null,null,"Warehousing",1,"sum","Local","ZAR",{"$f":"IF(F31=\"\",\"\",IF(F31=\"Foreign\",VLOOKUP(G31,Currency!$E$20:$F$33,2,FALSE),1))","v":{"v":1,"d":"1.00"}},0,0,0,0]
[null,null,"Packaging",1,"sum","Local","ZAR",{"$f":"IF(F32=\"\",\"\",IF(F32=\"Foreign\",VLOOKUP(G32,Currency!$E$20:$F$33,2,FALSE),1))","v":{"v":1,"d":"1.00"}},0,0,0,0]
[null,null,"Bag",1,"sum",{"$f":"IF(G33=\"\",\"\",IF(G33=\"ZAR\",\"Local\",\"Foreign\"))","v":"Local"},"ZAR",{"$f":"IF(F33=\"\",\"\",IF(F33=\"Foreign\",VLOOKUP(G33,Currency!$E$20:$F$33,2,FALSE),1))","v":{"v":1,"d":"1.00"}},0,{"$f":"I33*$H33","v":0},{"$f":"I33*$D33","v":0},{"$f":"J33*$D33","v":0}]
[null,null,"Extended Warranty",1,"sum","Local","ZAR",{"$f":"IF(F34=\"\",\"\",IF(F34=\"Foreign\",VLOOKUP(G34,Currency!$E$20:$F$33,2,FALSE),1))","v":{"v":1,"d":"1.00"}},0,0,{"$f":"I34*$D34","v":0},{"$f":"J34*$D34","v":0}]
[{"$nulls":11},{"$f":"SUM(L28:L34)","v":0}]
[]
[2,"High-End Laptop ","Device",1,"sum",{"$f":"IF(G37=\"\",\"\",IF(G37=\"ZAR\",\"Local\",\"Foreign\"))","v":"Local"},"ZAR",{"$f":"IF(F37=\"\",\"\",IF(F37=\"Foreign\",VLOOKUP(G37,Currency!$E$20:$F$33,2,FALSE),1))","v":{"v":1,"d":"1.00"}},0,{"$f":"I37*$H37","v":0},{"$f":"I37*$D37","v":0},{"$f":"J37*$D37","v":0}]
[null,null,"Shipping",1,"sum","Local","ZAR",{"$f":"IF(F38=\"\",\"\",IF(F38=\"Foreign\",VLOOKUP(G38,Currency!$E$20:$F$33,2,FALSE),1))","v":{"v":1,"d":"1.00"}},0,0,0,0]
[null,null,"Distribution",1,"sum","Local","ZAR",{"$f":"IF(F39=\"\",\"\",IF(F39=\"Foreign\",VLOOKUP(G39,Currency!$E$20:$F$33,2,FALSE),1))","v":{"v":1,"d":"1.00"}},0,0,0,0]
[null,null,"Warehousing",1,"sum","Local","ZAR",{"$f":"IF(F40=\"\",\"\",IF(F40=\"Foreign\",VLOOKUP(G40,Currency!$E$20:$F$33,2,FALSE),1))","v":{"v":1,"d":"1.00"}},0,0,0,0]
[null,null,"Packaging",1,"sum","Local","ZAR",{"$f":"IF(F41=\"\",\"\",IF(F41=\"Foreign\",VLOOKUP(G41,Currency!$E$20:$F$33,2,FALSE),1))","v":{"v":1,"d":"1.00"}},0,0,0,0]
[null,null,"Bag",1,"sum","Local","ZAR",{"$f":"IF(F42=\"\",\"\",IF(F42=\"Foreign\",VLOOKUP(G42,Currency!$E$20:$F$33,2,FALSE),1))","v":{"v":1,"d":"1.00"}},0,0,0,0]
[null,null,"Extended Warranty",1,"sum","Local","ZAR",{"$f":"IF(F43=\"\",\"\",IF(F43=\"Foreign\",VLOOKUP(G43,Currency!$E$20:$F$33,2,FALSE),1))","v":{"v":1,"d":"1.00"}},0,0,0,0]
[{"$nulls":11},{"$f":"SUM(L37:L43)","v":0}]
[]
[3,"Corporate (Mainstream) Laptop","Device",1,"sum",{"$f":"IF(G46=\"\",\"\",IF(G46=\"ZAR\",\"Local\",\"Foreign\"))","v":"Local"},"ZAR",{"$f":"IF(F46=\"\",\"\",IF(F46=\"Foreign\",VLOOKUP(G46,Currency!$E$20:$F$33,2,FALSE),1))","v":{"v":1,"d":"1.00"}},0,{"$f":"I46*$H46","v":0},{"$f":"I46*$D46","v":0},{"$f":"J46*$D46","v":0}]
[null,null,"Shipping",1,"sum","Local","ZAR",{"$f":"IF(F47=\"\",\"\",IF(F47=\"Foreign\",VLOOKUP(G47,Currency!$E$20:$F$33,2,FALSE),1))","v":{"v":1,"d":"1.00"}},0,0,0,0]
[null,null,"Distribution",1,"sum","Local","ZAR",{"$f":"IF(F48=\"\",\"\",IF(F48=\"Foreign\",VLOOKUP(G48,Currency!$E$20:$F$33,2,FALSE),1))","v":{"v":1,"d":"1.00"}},0,0,0,0]
[null,null,"Warehousing",1,"sum","Local","ZAR",{"$f":"IF(F49=\"\",\"\",IF(F49=\"Foreign\",VLOOKUP(G49,Currency!$E$20:$F$33,2,FALSE),1))","v":{"v":1,"d":"1.00"}},0,0,0,0]
[null,null,"Packaging",1,"sum","Local","ZAR",{"$f":"IF(F50=\"\",\"\",IF(F50=\"Foreign\",VLOOKUP(G50,Currency!$E$20:$F$33,2,FALSE),1))","v":{"v":1,"d":"1.00"}},0,0,0,0]
[null,null,"Bag",1,"sum","Local","ZAR",{"$f":"IF(F51=\"\",\"\",IF(F51=\"Foreign\",VLOOKUP(G51,Currency!$E$20:$F$33,2,FALSE),1))","v":{"v":1,"d":"1.00"}},0,0,0,0]
[null,null,"Extended Warranty",1,"sum","Local","ZAR",{"$f":"IF(F52=\"\",\"\",IF(F52=\"Foreign\",VLOOKUP(G52,Currency!$E$20:$F$33,2,FALSE),1))","v":{"v":1,"d":"1.00"}},0,0,0,0]
[{"$nulls":11},{"$f":"SUM(L46:L52)","v":0}]
[]
[4,"Touch Screen  (2-1) Device","Device",1,"sum",{"$f":"IF(G55=\"\",\"\",IF(G55=\"ZAR\",\"Local\",\"Foreign\"))","v":"Local"},"ZAR",{"$f":"IF(F55=\"\",\"\",IF(F55=\"Foreign\",VLOOKUP(G55,Currency!$E$20:$F$33,2,FALSE),1))","v":{"v":1,"d":"1.00"}},0,{"$f":"I55*$H55","v":0},{"$f":"I55*$D55","v":0},{"$f":"J55*$D55","v":0}]
[null,null,"Shipping",1,"sum","Local","ZAR",{"$f":"IF(F56=\"\",\"\",IF(F56=\"Foreign\",VLOOKUP(G56,Currency!$E$20:$F$33,2,FALSE),1))","v":{"v":1,"d":"1.00"}},0,0,0,0]
[null,null,"Distribution",1,"sum","Local","ZAR",{"$f":"IF(F57=\"\",\"\",IF(F57=\"Foreign\",VLOOKUP(G57,Currency!$E$20:$F$33,2,FALSE),1))","v":{"v":1,"d":"1.00"}},0,0,0,0]
[null,null,"Warehousing",1,"sum","Local","ZAR",{"$f":"IF(F58=\"\",\"\",IF(F58=\"Foreign\",VLOOKUP(G58,Currency!$E$20:$F$33,2,FALSE),1))","v":{"v":1,"d":"1.00"}},0,0,0,0]
[null,null,"Packaging",1,"sum","Local","ZAR",{"$f":"IF(F59=\"\",\"\",IF(F59=\"Foreign\",VLOOKUP(G59,Currency!$E$20:$F$33,2,FALSE),1))","v":{"v":1,"d":"1.00"}},0,0,0,0]
[null,null,"Bag",1,"sum","Local","ZAR",{"$f":"IF(F60=\"\",\"\",IF(F60=\"Foreign\",VLOOKUP(G60,Currency!$E$20:$F$33,2,FALSE),1))","v":{"v":1,"d":"1.00"}},0,0,0,0]
[null,null,"Extended Warranty",1,"sum","Local","ZAR",{"$f":"IF(F61=\"\",\"\",IF(F61=\"Foreign\",VLOOKUP(G61,Currency!$E$20:$F$33,2,FALSE),1))","v":{"v":1,"d":"1.00"}},0,0,0,0]
[{"$nulls":11},{"$f":"SUM(L55:L61)","v":0}]
[]
[5,"High-End Desktop","Device",1,"sum",{"$f":"IF(G64=\"\",\"\",IF(G64=\"ZAR\",\"Local\",\"Foreign\"))","v":"Local"},"ZAR",{"$f":"IF(F64=\"\",\"\",IF(F64=\"Foreign\",VLOOKUP(G64,Currency!$E$20:$F$33,2,FALSE),1))","v":{"v":1,"d":"1.00"}},0,{"$f":"I64*$H64","v":0},{"$f":"I64*$D64","v":0},{"$f":"J64*$D64","v":0}]
[null,null,"Shipping",1,"sum","Local","ZAR",{"$f":"IF(F65=\"\",\"\",IF(F65=\"Foreign\",VLOOKUP(G65,Currency!$E$20:$F$33,2,FALSE),1))","v":{"v":1,"d":"1.00"}},0,0,0,0]
[null,null,"Distribution",1,"sum","Local","ZAR",{"$f":"IF(F66=\"\",\"\",IF(F66=\"Foreign\",VLOOKUP(G66,Currency!$E$20:$F$33,2,FALSE),1))","v":{"v":1,"d":"1.00"}},0,0,0,0]
[null,null,"Warehousing",1,"sum","Local","ZAR",{"$f":"IF(F67=\"\",\"\",IF(F67=\"Foreign\",VLOOKUP(G67,Currency!$E$20:$F$33,2,FALSE),1))","v":{"v":1,"d":"1.00"}},0,0,0,0]
[null,null,"Packaging",1,"sum","Local","ZAR",{"$f":"IF(F68=\"\",\"\",IF(F68=\"Foreign\",VLOOKUP(G68,Currency!$E$20:$F$33,2,FALSE),1))","v":{"v":1,"d":"1.00"}},0,0,0,0]
[null,null,"Extended Warranty",1,"sum","Local","ZAR",{"$f":"IF(F69=\"\",\"\",IF(F69=\"Foreign\",VLOOKUP(G69,Currency!$E$20:$F$33,2,FALSE),1))","v":{"v":1,"d":"1.00"}},0,0,0,0]
[{"$nulls":11},{"$f":"SUM(L64:L69)","v":0}]
[]
[6,"Mainstream Desktop","Device",1,"sum",{"$f":"IF(G72=\"\",\"\",IF(G72=\"ZAR\",\"Local\",\"Foreign\"))","v":"Local"},"ZAR",{"$f":"IF(F72=\"\",\"\",IF(F72=\"Foreign\",VLOOKUP(G72,Currency!$E$20:$F$33,2,FALSE),1))","v":{"v":1,"d":"1.00"}},0,{"$f":"I72*$H72","v":0},{"$f":"I72*$D72","v":0},{"$f":"J72*$D72","v":0}]
[null,null,"Shipping",1,"sum","Local","ZAR",{"$f":"IF(F73=\"\",\"\",IF(F73=\"Foreign\",VLOOKUP(G73,Currency!$E$20:$F$33,2,FALSE),1))","v":{"v":1,"d":"1.00"}},0,0,0,0]
[null,null,"Distribution",1,"sum","Local","ZAR",{"$f":"IF(F74=\"\",\"\",IF(F74=\"Foreign\",VLOOKUP(G74,Currency!$E$20:$F$33,2,FALSE),1))","v":{"v":1,"d":"1.00"}},0,0,0,0]
[null,null,"Warehousing",1,"sum","Local","ZAR",{"$f":"IF(F75=\"\",\"\",IF(F75=\"Foreign\",VLOOKUP(G75,Currency!$E$20:$F$33,2,FALSE),1))","v":{"v":1,"d":"1.00"}},0,0,0,0]
[null,null,"Packaging",1,"sum","Local","ZAR",{"$f":"IF(F76=\"\",\"\",IF(F76=\"Foreign\",VLOOKUP(G76,Currency!$E$20:$F$33,2,FALSE),1))","v":{"v":1,"d":"1.00"}},0,0,0,0]
[null,null,"Extended Warranty",1,"sum","Local","ZAR",{"$f":"IF(F77=\"\",\"\",IF(F77=\"Foreign\",VLOOKUP(G77,Currency!$E$20:$F$33,2,FALSE),1))","v":{"v":1,"d":"1.00"}},0,0,0,0]
[{"$nulls":11},{"$f":"SUM(L72:L77)","v":0}]
[]
[7,"Small form Factor Mini-PC","Device",1,"sum",{"$f":"IF(G80=\"\",\"\",IF(G80=\"ZAR\",\"Local\",\"Foreign\"))","v":"Local"},"ZAR",{"$f":"IF(F80=\"\",\"\",IF(F80=\"Foreign\",VLOOKUP(G80,Currency!$E$20:$F$33,2,FALSE),1))","v":{"v":1,"d":"1.00"}},0,{"$f":"I80*$H80","v":0},{"$f":"I80*$D80","v":0},{"$f":"J80*$D80","v":0}]
[null,null,"Shipping",1,"sum","Local","ZAR",{"$f":"IF(F81=\"\",\"\",IF(F81=\"Foreign\",VLOOKUP(G81,Currency!$E$20:$F$33,2,FALSE),1))","v":{"v":1,"d":"1.00"}},0,0,0,0]
[null,null,"Distribution",1,"sum","Local","ZAR",{"$f":"IF(F82=\"\",\"\",IF(F82=\"Foreign\",VLOOKUP(G82,Currency!$E$20:$F$33,2,FALSE),1))","v":{"v":1,"d":"1.00"}},0,0,0,0]
[null,null,"Warehousing",1,"sum","Local","ZAR",{"$f":"IF(F83=\"\",\"\",IF(F83=\"Foreign\",VLOOKUP(G83,Currency!$E$20:$F$33,2,FALSE),1))","v":{"v":1,"d":"1.00"}},0,0,0,0]
[null,null,"Packaging",1,"sum","Local","ZAR",{"$f":"IF(F84=\"\",\"\",IF(F84=\"Foreign\",VLOOKUP(G84,Currency!$E$20:$F$33,2,FALSE),1))","v":{"v":1,"d":"1.00"}},0,0,0,0]
[null,null,"Extended Warranty",1,"sum","Local","ZAR",{"$f":"IF(F85=\"\",\"\",IF(F85=\"Foreign\",VLOOKUP(G85,Currency!$E$20:$F$33,2,FALSE),1))","v":{"v":1,"d":"1.00"}},0,0,0,0]
[{"$nulls":11},{"$f":"SUM(L80:L85)","v":0}]
[]
[8,"Other laptop","Device",1,"sum",{"$f":"IF(G88=\"\",\"\",IF(G88=\"ZAR\",\"Local\",\"Foreign\"))","v":"Local"},"ZAR",{"$f":"IF(F88=\"\",\"\",IF(F88=\"Foreign\",VLOOKUP(G88,Currency!$E$20:$F$33,2,FALSE),1))","v":{"v":1,"d":"1.00"}},0,{"$f":"I88*$H88","v":0},{"$f":"I88*$D88","v":0},{"$f":"J88*$D88","v":0}]
[null,null,"Shipping",1,"sum","Local","ZAR",{"$f":"IF(F89=\"\",\"\",IF(F89=\"Foreign\",VLOOKUP(G89,Currency!$E$20:$F$33,2,FALSE),1))","v":{"v":1,"d":"1.00"}},0,0,0,0]
[null,null,"Distribution",1,"sum","Local","ZAR",{"$f":"IF(F90=\"\",\"\",IF(F90=\"Foreign\",VLOOKUP(G90,Currency!$E$20:$F$33,2,FALSE),1))","v":{"v":1,"d":"1.00"}},0,0,0,0]
[null,null,"Warehousing",1,"sum","Local","ZAR",{"$f":"IF(F91=\"\",\"\",IF(F91=\"Foreign\",VLOOKUP(G91,Currency!$E$20:$F$33,2,FALSE),1))","v":{"v":1,"d":"1.00"}},0,0,0,0]
[null,null,"Packaging",1,"sum","Local","ZAR",{"$f":"IF(F92=\"\",\"\",IF(F92=\"Foreign\",VLOOKUP(G92,Currency!$E$20:$F$33,2,FALSE),1))","v":{"v":1,"d":"1.00"}},0,0,0,0]
[null,null,"Bag",1,"sum","Local","ZAR",{"$f":"IF(F93=\"\",\"\",IF(F93=\"Foreign\",VLOOKUP(G93,Currency!$E$20:$F$33,2,FALSE),1))","v":{"v":1,"d":"1.00"}},0,0,0,0]
[null,null,"Extended Warranty",1,"sum","Local","ZAR",{"$f":"IF(F94=\"\",\"\",IF(F94=\"Foreign\",VLOOKUP(G94,Currency!$E$20:$F$33,2,FALSE),1))","v":{"v":1,"d":"1.00"}},0,0,0,0]
[{"$nulls":11},{"$f":"SUM(L88:L94)","v":0}]

{"sheet":"Currency","index":1,"n_rows":33,"n_cols":8,"rows_kept":33,"merged":[[1,1,1,5],[6,2,6,7],[7,1,9,1],[7,2,7,7],[7,15,7,20],[8,2,8,7],[9,2,9,7],[10,2,10,7],[11,2,11,7],[12,1,14,1],[12,2,12,7],[13,2,13,7],[14,2,14,7],[17,2,17,7]]}
[]
[null,{"$f":"'Computer Devices'!B3","v":"VENDOR NAME"}]
[]
[null,"EXCHANGE RATES FOR MULTIPLE CURRENCIES"]
[]
[null,"NOTES:"]
[null,1,"The table below needs to be completed if the Employer will be exposed to any currency fluctuation as stipulated in Secondary Clause X3.  For conversion of the foreign portions to Rand, please use the South African Reserve Bank's (SARB) exchange rate at 12:00 on the day of advertisement of the bid.  This is in terms of the Preferential Procurement Policy Framework Act (PPPFA) with which the Employer has to comply.\nNB: Tenderers must submit proof of the SARB rate(s) of exchange used  "]
[null,2,"The following URL (electronic route) is to be followed to access the relevant SARB rates on their web pages:\n"]
[null,null,"www.resbank.co.za"]
[null,null,"-  Select Research\n-  Then select Rates\n-  Click on \"Select historical exchange rates and other interest rates\"\n-  Clicking on the exchange rate in the following page opens the daily rates per currency and SA Rand"]
[null,3,"The Employer deals only in the currencies listed below unless other currencies are specifically approved for this tender.  Kindly notify the Employer of any currency that the tenderer intends to use, but is not stipulated in the table, to consider sanctioning such currency.  Sufficient time must be allowed for the assessment and to respond to such request.  The onus is on the tenderer to submit a bid with approved currencies"]
[null,4,"The format in which the exchange rate must be inserted in the table is:  1 (One) Foreign Currency = R Amount  (i.e. the Rand amount for one of each foreign currency applicable).  Exchange rates must be rounded to 4 decimals\n\nNB :  Only the USD/ZAR, GBP/ZAR and EUR/ZAR are published in this way on the SARB web pages above.  The Rand rate with the other currencies must be inverted (1/Foreign Currency Rate) in order to list it in the required format in the table below\n"]
[null,5,"All information in the table below must conform with all other equivalent information in the offer. "]
[null,null,"Payment in terms of Payment Method 2  is considered as a \"foreign payment\" although it will be effected in South African Rand. However, amounts for  \"F.O.R. Price-Goods supplied from Imported Items\", are NOT considered as \"foreign payments\""]
[null,null,"If more than one payment method apply for a currency, the Tenderer must request an additional row be inserted in the table in order to split the values and identify the relevant method.   "]
[]
[]
[null,null,"MULTIPLE CURRENCIES"]
[null,null,"No","Currency Description","Code","Exchange Rate Currency 1,00 =","Date Published","Source"]
[null,null,1,"Australian Dollar","AUD"]
[null,null,2,"Canadian Dollar","CAN"]
[null,null,3,"Swiss Franc","CHF"]
[null,null,4,"Danish Krone","DKK"]
[null,null,5,"European Currency","EUR"]
[null,null,6,"British Pound","GBP"]
[null,null,7,"Hong Kong Dollar","HKD"]
[null,null,8,"Japanese Yen","JPY"]
[null,null,9,"Norwegian Krone","NOK"]
[null,null,10,"New Zealand Dollar","NZD"]
[null,null,11,"Swedish Krone","SEK"]
[null,null,12,"Singapore Dollar","SGD"]
[null,null,13,"United States Dollar","USD"]
[null,null,14,"South African Rand","ZAR",{"v":1,"d":"R 1.000000"}]