{"text_format":"1","workbook":"xlsx","n_sheets":11,"sheets":["Sheet1","Summary","Demo","Functional","Sheet3","Technical evaluation","Integration and Testing","Demonstration","Priority Ratings","Config","Concerns and Recommendations"],"not_rendered":{"charts":0,"images":3,"macros":1,"external_links":1,"defined_names":22,"comments":0,"pivot_tables":0},"unopened":[],"bounds":{"document_bytes":16777216,"sheet_cells":100000,"rows_first":2000,"rows_last":500,"rows_between":2000,"halvings":0,"cell_chars":16384,"cell_head_chars":4096},"cells_cut":0,"cells_raw":0,"read":"whole","date_system":"1900"}

{"sheet":"Sheet1","index":0,"n_rows":89,"n_cols":13,"rows_kept":89,"cut":false,"hidden":true,"merged":[]}
["ID","Type","Criterion","Solution","Functional Requirement","Requirement description","Comments","Priority Description","Priority\n","Weighted Question","Scoring","Answer\n(0,50,100%)","Weighted Answer"]
[1,"Meeting the Scope of Work Required","How well has the Tenderer described how scope requirements will be met?  Do they understand what needs to be done?  List concerns in Comments.","Chatbot and Social Media API","Design of solution","• Functional Specification and Detailed Design: \nApproved Functional Specification and Detailed (Physical) design based on the User Requirement Specification and Logical Design provided as part of RFP.  ",null,"Important",3,8.9820359281437123E-3,"100%: Fully comply with requirement\n50%:   Partially comply will require development/ customisation\n0%:     No compliance",0.5,4.4910179640718561E-3]
[2,"Meeting the Scope of Work Required","How well has the Tenderer described how scope requirements will be met?  Do they understand what needs to be done?  List concerns in Comments.","Chatbot and Social Media API","• Support of cloud\nStandAlone or cloud solution","Provide solution details indicating whether the solution can be deployed as a standalone or via the cloud\n",null,"Very important",4,1.1976047904191617E-2,"100%: Fully comply with requirement\n50%:   Partially comply will require development/ customisation\n0%:     No compliance",null,0]
[3,"Meeting the Scope of Work Required","How well has the Tenderer described how scope requirements will be met?  Do they understand what needs to be done?  List concerns in Comments.","Chatbot and Social Media API","Breakdown / decomposition of the functionalities  \n"," The functional capabilities are broken down / decomposed\n* Interaction\n* Intelligence\n* Integration\n* Development",null,"Important",3,8.9820359281437123E-3,"100%: Fully comply with requirement\n50%:   Partially comply will require development/ customisation\n0%:     No compliance",null,0]
[4,"Meeting the Scope of Work Required","How well has the Tenderer described how scope requirements will be met?  Do they understand what needs to be done?  List concerns in Comments.","Chatbot and Social Media API","Capability to support customer journey's / service types in conjunction with AI (Chatbot)","Solution capabilities support use cases/Customer jouneys are per Customer journey/service types submitted as attachment. \nThe Customer service interactions (use cases) are categorised by types (Supporting attachment called “Customer Services: Service categories and types”) that are handled by the contact center. \nThe following are the high priorities: \n a. Electricity Supply Problem (high priority) \n   i. receive feedback on faults reported (I,e, using a ref number)\n   ii. And progress feedback on faults a section item\n b. Submit Meter readings (high priority). \n  c. Refer to attachments for a complete list of ALL service \ncategories\n  i. An important one can be data enrichment such as verification and  \n     updating of customer details such as telephone numbers etc.\n",null,"Critical",5,1.4970059880239521E-2,"100%: Fully comply with requirement\n50%:   Partially comply will require development/ customisation\n0%:     No compliance",null,0]
[5,"Meeting the Scope of Work Required","How well has the Tenderer described how scope requirements will be met?  Do they understand what needs to be done?  List concerns in Comments.","Chatbot","Provide reference number feedback","Capability to display reference number that has been generated by Eskom source systems. The solution should include reference number feedback (i.e. Customer calling in to see how far the fault is and getting feedback on it.)",null,"Very important",4,1.1976047904191617E-2,"100%: Out of box functionality\n75%:   Development\n0%:     No compliance",null,0]
[6,"Meeting the Scope of Work Required","How well has the Tenderer described how scope requirements will be met?  Do they understand what needs to be done?  List concerns in Comments.","Chatbot","Flag customers - Low buyer","Ability to interpret flag from backend systems and respond accordingly to customers as per the business rules. ",null,"Important",3,8.9820359281437123E-3,"100%: Fully comply with requirement\n50%:   Partially comply will require development/ customisation\n0%:     No compliance",null,0]
[7,"Meeting the Scope of Work Required","How well has the Tenderer described how scope requirements will be met?  Do they understand what needs to be done?  List concerns in Comments.","Chatbot","Flag customers - Customer previously logged fault","• Another flag should be considered as to whether this customer has previously logged the fault (i.e. to eradicate duplications). (Functionality to be built in OMS) - Discussion with CC&I and OMS for implementation.\n• The outage flags must also include (planned, unplanned, load shedding, load reduction) ",null,"Important",3,8.9820359281437123E-3,"100%: Fully comply with requirement\n50%:   Partially comply will require development/ customisation\n0%:     No compliance",null,0]
[8,"Meeting the Scope of Work Required","How well has the Tenderer described how scope requirements will be met?  Do they understand what needs to be done?  List concerns in Comments.","Chatbot","Inform Customers","Capability , in conjunction with AI(Chatbot) to inform customer that they have been flagged as such and inform them of the business process  that will follow \n * they will be audited in n x days), \n * to inform them to pay a certain amount to be “unblocked”  ",null,"Important",3,8.9820359281437123E-3,"100%: Fully comply with requirement\n50%:   Partially comply will require development/ customisation\n0%:     No compliance",null,0]
[9,"Meeting the Scope of Work Required","How well has the Tenderer described how scope requirements will be met?  Do they understand what needs to be done?  List concerns in Comments.","Social Media API","Provide Geo location of caller","Ability for the social media channel API (WhatsApp) to get geo-locations of the caller, where possible. Indicate how the data will be pass-through. ",null,"Important",3,8.9820359281437123E-3,"100%: Fully comply with requirement\n50%:   Partially comply will require development/ customisation\n0%:     No compliance",null,0]
{"$rows_left_out":80}
{"sheet":"Summary","index":1,"n_rows":33,"n_cols":6,"rows_kept":33,"cut":false,"hidden":false,"merged":[[22,0,22,1],[1,4,3,4],[1,5,3,5],[1,6,3,6],[6,0,6,3],[7,0,7,3],[8,0,8,3],[14,0,14,5],[9,0,9,3],[10,0,10,3],[11,0,11,3],[15,0,15,5],[16,0,16,5],[18,1,18,2],[18,5,19,5],[19,0,21,0],[19,4,21,4],[1,9,3,9],[1,10,3,10],[1,11,3,11],[5,0,5,3],[0,0,0,3],[0,4,0,13],[1,1,1,3],[2,1,2,3],[1,12,3,12],[1,13,3,13],[1,8,3,8],[3,1,3,3],[1,7,3,7]]}
[{"$f":"'Technical evaluation'!A1","v":"MyEskom Outage Mobile App"}]
["CORP xxxx Tender",null,null,null,"Please indicate location of answers to the criteria and where required answer yes or no."]
["Tenderer:"]
["Evaluated by:"]
[]
["Important Notes: "]
["1. Please indicate location of answers to the criteria and where required answer yes or no. To be included in Comments tab per sheet."]
["2. The qualified solution service provider shall do a product demo of the proposed product to be presented to Eskom.  This is mandatory. "]
["3. \"Tenderer(s) to take note of the following key instructions - Please follow the structure of the technical evaluation sheet provided when responding to this enquiry."]
["4.  DO NOT just give YES/NO kind of response to the questions which require more details and information."]
{"$rows_left_out":24}
{"sheet":"Demo","index":2,"n_rows":17,"n_cols":13,"rows_kept":17,"cut":false,"hidden":false,"merged":[[6,10,6,12],[15,0,15,12],[0,0,0,2],[1,0,1,1],[2,0,2,1],[3,0,3,1],[5,0,5,2],[6,8,6,9]]}
[{"$f":"'[1]Technical evaluation'!A1","v":"MyEskom Outage Mobile App"}]
["CORP xxxx Tender"]
["Tenderer:"]
["Evaluated by:"]
[]
["Evaluation Criteria"]
[null,null,null,null,null,null,null,null,"Weight\n(agreed by evaluation team members)",null,"Score\n(determined by each evaluation team member during evaluation. Will be averaged for final scores)"]
["ID","Type","Criterion","Solution","Functional Requirement","Requirement description","Comments","Priority Description","Priority\n","Weighted Question","Scoring","Answer\n(0,50,100%)","Weighted Answer"]
[1,"Meeting the Scope of Work Required","A software demonstration of the functional capabilities of the Bidder's solution.  List concerns in Comments.",null,"User registration and verification","Demonstrate in previous applications deployed, the ability to verify and register users",null,"Important",{"$f":"IF(H9='[1]Priority Ratings'!$C$21,'[1]Priority Ratings'!$B$21,IF(H9='[1]Priority Ratings'!$C$22,'[1]Priority Ratings'!$B$22,IF(H9='[1]Priority Ratings'!$C$23,'[1]Priority Ratings'!$B$23,IF(H9='[1]Priority Ratings'!$C$24,'[1]Priority Ratings'!$B$24,IF(H9='[1]Priority Ratings'!$C$25,'[1]Priority Ratings'!$B$25,IF(H9='[1]Priority Ratings'!$C$26,'[1]Priority Ratings'!$B$26,IF(H9='[1]Priority Ratings'!$C$27,'[1]Priority Ratings'!$B$27,\"No Rating\")))))))","v":3},{"$f":"I9/I$17","v":0.125},"100%: Fully comply with requirement\n50%:   Partially comply with requirement\n0%:     No compliance",0,{"$f":"J9*L9","v":0}]
[2,"Meeting the Scope of Work Required","A software demonstration of the functional capabilities of the Bidder's solution.  List concerns in Comments.",null,"User authentication.\n\n","Demonstrate in previous applications deployed, the ability to authenticate users",null,"Important",{"$f":"IF(H10='[1]Priority Ratings'!$C$21,'[1]Priority Ratings'!$B$21,IF(H10='[1]Priority Ratings'!$C$22,'[1]Priority Ratings'!$B$22,IF(H10='[1]Priority Ratings'!$C$23,'[1]Priority Ratings'!$B$23,IF(H10='[1]Priority Ratings'!$C$24,'[1]Priority Ratings'!$B$24,IF(H10='[1]Priority Ratings'!$C$25,'[1]Priority Ratings'!$B$25,IF(H10='[1]Priority Ratings'!$C$26,'[1]Priority Ratings'!$B$26,IF(H10='[1]Priority Ratings'!$C$27,'[1]Priority Ratings'!$B$27,\"No Rating\")))))))","v":3},0.125,"100%: Fully comply with requirement\n50%:   Partially comply with requirement\n0%:     No compliance",0,0]
{"$rows_left_out":8}
{"sheet":"Functional","index":3,"n_rows":26,"n_cols":13,"rows_kept":26,"cut":false,"hidden":false,"merged":[[6,10,6,12],[24,0,24,12],[0,0,0,2],[1,0,1,1],[2,0,2,1],[3,0,3,1],[5,0,5,2],[6,8,6,9]]}
[{"$f":"'Technical evaluation'!A1","v":"MyEskom Outage Mobile App"}]
["CORP xxxx Tender"]
["Tenderer:"]
["Evaluated by:"]
[]
["Evaluation Criteria"]
[null,null,null,null,null,null,null,null,"Weight\n(agreed by evaluation team members)",null,"Score\n(determined by each evaluation team member during evaluation. Will be averaged for final scores)"]
["ID","Type","Criterion","Solution","Functional Requirement","Requirement description","Comments","Priority Description","Priority\n","Weighted Question","Scoring","Answer\n(0,50,100%)","Weighted Answer"]
[1,"Meeting the Scope of Work Required","How well has the Tenderer described how scope requirements will be met?  Do they understand what needs to be done?  Supporting evidence from a portfolio of previous applications of a similar scope and customer testimonials?  List concerns in Comments.",null,"User registration and verification","The ability for a user to register as an app user, using a cellular number.  An OTP must be sent to the cellular number to verify the cellular number provided.  The registration details and unique device ID must be stored in the mobile backend.  The mobile backend must handle the registration and verification process and must be configurable for future registration and verification requirements.",null,"Critical",{"$f":"IF(H9='Priority Ratings'!$C$21,'Priority Ratings'!$B$21,IF(H9='Priority Ratings'!$C$22,'Priority Ratings'!$B$22,IF(H9='Priority Ratings'!$C$23,'Priority Ratings'!$B$23,IF(H9='Priority Ratings'!$C$24,'Priority Ratings'!$B$24,IF(H9='Priority Ratings'!$C$25,'Priority Ratings'!$B$25,IF(H9='Priority Ratings'!$C$26,'Priority Ratings'!$B$26,IF(H9='Priority Ratings'!$C$27,'Priority Ratings'!$B$27,\"No Rating\")))))))","v":5},{"$f":"I9/I$26","v":6.4935064935064929E-2},"100%: Fully comply with requirement\n50%:   Partially comply with requirement\n0%:     No compliance",0,{"$f":"J9*L9","v":0}]
[2,"Meeting the Scope of Work Required","How well has the Tenderer described how scope requirements will be met?  Do they understand what needs to be done?  Supporting evidence from a portfolio of previous applications of a similar scope and customer testimonials?  List concerns in Comments.",null,"User authentication.\n\n","Once a user has successfully registered on the app, the user / device should be authenticated automatically when using the app\nThe backend must handle the authentication process and must be configurable for future authentication requirements.",null,"Critical",{"$f":"IF(H10='Priority Ratings'!$C$21,'Priority Ratings'!$B$21,IF(H10='Priority Ratings'!$C$22,'Priority Ratings'!$B$22,IF(H10='Priority Ratings'!$C$23,'Priority Ratings'!$B$23,IF(H10='Priority Ratings'!$C$24,'Priority Ratings'!$B$24,IF(H10='Priority Ratings'!$C$25,'Priority Ratings'!$B$25,IF(H10='Priority Ratings'!$C$26,'Priority Ratings'!$B$26,IF(H10='Priority Ratings'!$C$27,'Priority Ratings'!$B$27,\"No Rating\")))))))","v":5},6.4935064935064929E-2,"100%: Fully comply with requirement\n50%:   Partially comply with requirement\n0%:     No compliance",0,0]
{"$rows_left_out":17}
{"sheet":"Sheet3","index":4,"n_rows":9,"n_cols":5,"rows_kept":9,"cut":false,"hidden":true,"merged":[]}
[]
[]
[]
[null,null,null,null,"Test"]
[null,null,null,null,1]
[null,null,null,null,2]
[null,null,null,null,3]
[null,null,null,null,4]
[null,null,null,null,5]

{"sheet":"Technical evaluation","index":5,"n_rows":22,"n_cols":13,"rows_kept":22,"cut":false,"hidden":false,"merged":[[20,0,20,12],[6,10,6,12],[6,8,6,9],[0,0,0,3],[1,0,1,1],[2,0,2,1],[3,0,3,1],[5,0,5,3]]}
["MyEskom Outage Mobile App"]
["CORP xxxx Tender"]
["Tenderer:"]
["Evaluated by:"]
[]
["Evaluation Criteria"]
[null,null,null,null,null,null,null,null,"Weight\n(agreed by evaluation team members)",null,"Score\n(determined by each evaluation team member during evaluation. Will be averaged for final scores)"]
["ID","Type","Solution","Criterion","Requirement","Requirement description","Comments","Priority Description","Priority\n","Weighted Question","Scoring","Answer\n(0,50,100%)","Weighted Answer"]
[1,"Meeting the Scope of Work Required",null,"Provision of proof that the company has successfully developed a mobile application using React Native.","Development","Provide evidence of successful project implementation (evidence such as reference letter, downloadeable from an app store).",null,"Very important",{"$f":"IF(H9='Priority Ratings'!$C$21,'Priority Ratings'!$B$21,IF(H9='Priority Ratings'!$C$22,'Priority Ratings'!$B$22,IF(H9='Priority Ratings'!$C$23,'Priority Ratings'!$B$23,IF(H9='Priority Ratings'!$C$24,'Priority Ratings'!$B$24,IF(H9='Priority Ratings'!$C$25,'Priority Ratings'!$B$25,IF(H9='Priority Ratings'!$C$26,'Priority Ratings'!$B$26,IF(H9='Priority Ratings'!$C$27,'Priority Ratings'!$B$27,\"No Rating\")))))))","v":4},{"$f":"I9/I$22","v":7.407407407407407E-2},"< 2 Evidence sources = 0%\n2 or more evidence sources with\n1 project  = 25 %\n2 projects = 50 %\n3+ projects =100 %",null,{"$f":"J9*L9","v":0}]
[2,"Meeting the Scope of Work Required",null,"Provision of proof of having a minimum of 2 resources that have experience in developing mobile apps using React Native","Development","Provide CV's and evidence of successful project implementation",null,"Show stopper",{"$f":"IF(H10='Priority Ratings'!$C$21,'Priority Ratings'!$B$21,IF(H10='Priority Ratings'!$C$22,'Priority Ratings'!$B$22,IF(H10='Priority Ratings'!$C$23,'Priority Ratings'!$B$23,IF(H10='Priority Ratings'!$C$24,'Priority Ratings'!$B$24,IF(H10='Priority Ratings'!$C$25,'Priority Ratings'!$B$25,IF(H10='Priority Ratings'!$C$26,'Priority Ratings'!$B$26,IF(H10='Priority Ratings'!$C$27,'Priority Ratings'!$B$27,\"No Rating\")))))))","v":6},0.1111111111111111,"<2 CVs = 0%\n2 or more CVs with\n1 project  = 25 %\n2 projects = 50 %\n3+ projects =100 %\n",null,0]
{"$rows_left_out":13}
{"sheet":"Integration and Testing","index":6,"n_rows":27,"n_cols":14,"rows_kept":27,"cut":false,"hidden":false,"merged":[[6,11,6,13],[25,0,25,13],[0,0,0,3],[1,0,1,1],[2,0,2,1],[3,0,3,1],[5,0,5,3],[6,9,6,10]]}
[{"$f":"'Technical evaluation'!A1","v":"MyEskom Outage Mobile App"}]
["CORP xxxx Tender"]
["Tenderer:"]
["Evaluated by:"]
[]
["Evaluation Criteria"]
[null,null,null,null,null,null,null,null,null,"Weight\n(agreed by evaluation team members)",null,"Score\n(determined by each evaluation team member during evaluation. Will be averaged for final scores)"]
["ID","Type","Category","Criterion","Solution","Functional Requirement","Requirement description","Comments","Priority Description","Priority\n","Weighted Question","Scoring","Answer\n(0,50,100%)","Weighted Answer"]
[1,"Meeting the Scope of Work Required","Non Functional","Previous involvement in the end to end testing of a similar system and methodologies used",null,"Testing ","Provide reference customers and sites",null,"Very important",{"$f":"IF(I9='Priority Ratings'!$C$21,'Priority Ratings'!$B$21,IF(I9='Priority Ratings'!$C$22,'Priority Ratings'!$B$22,IF(I9='Priority Ratings'!$C$23,'Priority Ratings'!$B$23,IF(I9='Priority Ratings'!$C$24,'Priority Ratings'!$B$24,IF(I9='Priority Ratings'!$C$25,'Priority Ratings'!$B$25,IF(I9='Priority Ratings'!$C$26,'Priority Ratings'!$B$26,IF(I9='Priority Ratings'!$C$27,'Priority Ratings'!$B$27,\"No Rating\")))))))","v":4},{"$f":"J9/J$27","v":5.2631578947368418E-2},"100%: Fully comply with requirement\n50%:   Partially comply with requirement\n0%:     No compliance",0,{"$f":"K9*M9","v":0}]
[2,"Team Organisation and Member Requirements","Non Functional","Resource model. It is a requirement that sufficient dedicated testers are allocated to the project, independent of the development team",null,"Testing ","Experienced Test Manger must be provided, ISTQB certification is required for all testing resources",null,"Very important",{"$f":"IF(I10='Priority Ratings'!$C$21,'Priority Ratings'!$B$21,IF(I10='Priority Ratings'!$C$22,'Priority Ratings'!$B$22,IF(I10='Priority Ratings'!$C$23,'Priority Ratings'!$B$23,IF(I10='Priority Ratings'!$C$24,'Priority Ratings'!$B$24,IF(I10='Priority Ratings'!$C$25,'Priority Ratings'!$B$25,IF(I10='Priority Ratings'!$C$26,'Priority Ratings'!$B$26,IF(I10='Priority Ratings'!$C$27,'Priority Ratings'!$B$27,\"No Rating\")))))))","v":4},5.2631578947368418E-2,"100%: Good Experience with certification\n50%: Some experience without certification\n0%: No experience, No certification\n",0,{"$f":"K10*M10","v":0}]
{"$rows_left_out":18}
{"sheet":"Demonstration","index":7,"n_rows":76,"n_cols":13,"rows_kept":76,"cut":false,"hidden":true,"merged":[[6,10,6,12],[74,0,74,12],[0,0,0,2],[1,0,1,1],[2,0,2,1],[3,0,3,1],[5,0,5,2],[6,8,6,9]]}
[{"$f":"'Technical evaluation'!A1","v":"MyEskom Outage Mobile App"}]
["CORP xxxx Tender"]
["Tenderer:"]
["Evaluated by:"]
[]
["Evaluation Criteria"]
[null,null,null,null,null,null,null,null,"Weight\n(agreed by evaluation team members)",null,"Score\n(determined by each evaluation team member during evaluation. Will be averaged for final scores)"]
["ID","Type","Criterion","Solution","Functional Requirement","Requirement description","Comments","Priority Description","Priority\n","Weighted Question","Scoring","Answer\n(0,50,100%)","Weighted Answer"]
[1,"Meeting the Scope of Work Required","How well has the Tenderer described how scope requirements will be met?  Do they understand what needs to be done?  List concerns in Comments.","Chatbot and Social Media API","• Support of cloud\nStandAlone or cloud solution","Provide solution details indicating whether the solution can be deployed as a standalone or via the cloud\n",null,"Very important",4,{"$f":"I9/I$76","v":1.4492753623188406E-2},"100%: Fully comply with requirement\n50%:   Partially comply will require development/ customisation\n0%:     No compliance",null,{"$f":"J9*L9","v":0}]
[2,"Meeting the Scope of Work Required","How well has the Tenderer described how scope requirements will be met?  Do they understand what needs to be done?  List concerns in Comments.","Chatbot and Social Media API","Capability to support customer journey's / service types in conjunction with AI (Chatbot)","Solution capabilities support use cases/Customer jouneys are per Customer journey/service types submitted as attachment. \nThe Customer service interactions (use cases) are categorised by types (Supporting attachment called “Customer Services: Service categories and types”) that are handled by the contact center. \nThe following are the high priorities: \n a. Electricity Supply Problem (high priority) \n   i. receive feedback on faults reported (I,e, using a ref number)\n   ii. And progress feedback on faults a section item\n b. Submit Meter readings (high priority). \n  c. Refer to attachments for a complete list of ALL service \nd. Display reference number that has been generated by Eskom source systems.\ncategories\n  i. An important one can be data enrichment such as verification and  \n     updating of customer details such as telephone numbers etc.\nOff the shelf or customisation?",null,"Critical",5,1.8115942028985508E-2,"100%: Fully comply with requirement\n50%:   Partially comply will require development/ customisation\n0%:     No compliance",null,0]
{"$rows_left_out":67}
{"sheet":"Priority Ratings","index":8,"n_rows":27,"n_cols":6,"rows_kept":27,"cut":false,"hidden":false,"merged":[]}
[]
[]
[]
[]
[]
[]
[]
[]
[]
[]
{"$rows_left_out":18}
{"sheet":"Config","index":9,"n_rows":9,"n_cols":7,"rows_kept":9,"cut":false,"hidden":false,"merged":[]}
[]
[null,"Solution",null,"Priority rating","Priority Description",null,"Category"]
[null,"Outage Mobile App",null,0,"No interest",null,"Functional"]
[null,null,null,1,"Nice to have",null,"Technical Evaluation"]
[null,null,null,2,"Useful",null,"Integration and Testing"]
[null,null,null,3,"Important"]
[null,null,null,4,"Very important"]
[null,null,null,5,"Critical"]
[null,null,null,6,"Show stopper"]

{"sheet":"Concerns and Recommendations","index":10,"n_rows":19,"n_cols":2,"rows_kept":19,"cut":false,"hidden":true,"merged":[[2,1,2,2],[3,1,16,14],[18,1,18,2],[19,1,33,14]]}
["Note: Not applicable for the vendors / Tenderers / respondents. This sheet is not needed for issuing the Tendor. Useful for making recommendatins after evaluation."]
[]
[null,"Recommendation"]
[]
[]
[]
[]
[]
[]
[]
{"$rows_left_out":9}