{"text_format":"3","workbook":"xlsx","n_sheets":6,"sheets":["Cover","PS5","PS5 Summary","Transport and Offloading Matrix","CPA Formula","Exchnge Rates"],"not_rendered":{"images":1,"defined_names":4},"read":"whole","date_system":"1900"}

{"sheet":"Cover","index":0,"n_rows":41,"n_cols":1,"rows_kept":41,"merged":[[28,0,28,1],[31,0,31,1]]}
{"$rows_empty":10}
["PRICING INFORMATION"]
[]
["INVITATION TO TENDER"]
[]
[" ENQUIRY No. "]
["FOR"]
["Description:"]
[]
[]
[]
["TENDERER’S NAME:  "]
[]
[]
[]
{"$rows_left_out":18}
{"sheet":"PS5","index":1,"n_rows":89,"n_cols":37,"rows_kept":89,"merged":[[7,9,9,9],[7,10,9,10],[7,11,9,11],[7,12,9,12],[7,13,9,13],[7,14,9,14],[7,15,9,15],[7,16,9,16],[7,17,9,17],[7,18,9,18],[7,19,9,19],[7,20,9,20],[7,21,9,21],[7,22,9,22],[7,23,9,23],[7,24,9,24],[7,25,9,25],[7,26,9,26],[7,27,9,27],[7,28,9,28],[7,29,9,29],[7,30,9,30],[7,31,9,31],[7,32,9,32],[7,33,9,33],[7,34,9,34],[7,35,9,35],[7,36,9,36],[55,9,57,9],[55,10,57,10],[55,11,57,11],[55,12,57,12],[55,13,57,13],[55,14,57,14],[55,15,57,15],[55,16,57,16],[55,17,57,17],[55,18,57,18],[55,19,57,19],[55,20,57,20],[55,21,57,21],[55,22,57,22],[55,23,57,23],[55,24,57,24],[55,25,57,25],[55,26,57,26],[55,27,57,27],[55,28,57,28],[55,29,57,29],[55,30,57,30],[55,31,57,31],[55,32,57,32],[55,33,57,33],[55,34,57,34],[55,35,57,35],[55,36,57,36]]}
["ENQUIRY NUMBER :",{"$nulls":3},"                                      PRICES INCLUSIVE OF VAT (VALUE ADDED TAX)"]
[]
[" PRICE SCHEDULE : C (PS5) :   ",{"$nulls":34},"SUPPLIER:"]
[]
[" PRICE SCHEDULE FOR GOODS MANUFACTURED IN AND OUTSIDE THE R.S.A.  PRICE PER UNIT FOR SUPPLY, DELIVERY AND OFF LOADING.  ALL AMOUNTS EXPRESSED IN RANDS"]
[]
[" REMARKS",{"$nulls":5},"                       ITEM NO",null,null,"Item 1","Item 2","Item 3","Item 4","Item 5","Item 6","Item 7","Item 8","Item 9","Item 10","Item 11","Item 12","Item 13","Item 14","Item 15","Item 16","Item 17","Item 18","Item 19","Item 20","Item 21","Item 22","Item 23","Item 24","Item 25","Item 26","Item 27","Item 28"]
[" *Eskom may effect this insurance which includes war",{"$nulls":5},"                  ITEM DESCRIPTION",null,null,"0000663307-Specific: 48 VDC power supply and X.21 communication interface Generic: includes module rack, CPU module, 4 channels (input/output), Protection Interface Adaptors,  LED (Alarm/Trip) indications, HMI Software, on/off switch","0000663301-Specific: 110 VDC power supply and X.21 communication interface Generic: includes module rack, CPU module, 4 channels (input/output), Protection Interface Adaptors,  LED (Alarm/Trip) indications, HMI Software, on/off switch","0000663304-Specific: 220 VDC power supply and X.21 communication interface Generic: includes module rack, CPU module, 4 channels (input/output), Protection Interface Adaptors,  LED (Alarm/Trip) indications, HMI Software, on/off switch","0000663309-Specific: 48 VDC power supply and Fibre Optic Driver - 1310nm 30km Generic: includes module rack, CPU module, 4 channels (input/output), Protection Interface Adaptors,  LED (Alarm/Trip) indications, HMI Software, on/off switch","0000663412-Specific: 110 VDC power supply and Fibre Optic Driver - 1310nm 30km Generic: includes module rack, CPU module, 4 channels (input/output), Protection Interface Adaptors,  LED (Alarm/Trip) indications, HMI Software, on/off switch","0000663416-Specific: 220 VDC power supply and Fibre Optic Driver - 1310nm 30km Generic: includes module rack, CPU module, 4 channels (input/output), Protection Interface Adaptors,  LED (Alarm/Trip) indications, HMI Software, on/off switch","0000663417-Specific: 48 VDC power supply and Fibre Optic Driver - 1310nm 60km Generic: includes module rack, CPU module, 4 channels (input/output), Protection Interface Adaptors,  LED (Alarm/Trip) indications, HMI Software, on/off switch","0000663418-Specific: 110 VDC power supply and Fibre Optic Driver - 1310nm 60km Generic: includes module rack, CPU module, 4 channels (input/output), Protection Interface Adaptors,  LED (Alarm/Trip) indications, HMI Software, on/off switch","0000663277-Specific: 220 VDC power supply and Fibre Optic Driver - 1310nm 60km Generic: includes module rack, CPU module, 4 channels (input/output), Protection Interface Adaptors,  LED (Alarm/Trip) indications, HMI Software, on/off switch","0000663303-Specific: 48 VDC power supply and Fibre Optic Driver - 1550nm 120km Generic: includes module rack, CPU module, 4 channels (input/output), Protection Interface Adaptors,  LED (Alarm/Trip) indications, HMI Software, on/off switch","0000663306-Specific: 110 VDC power supply and Fibre Optic Driver - 1550nm 120km Generic: includes module rack, CPU module, 4 channels (input/output), Protection Interface Adaptors,  LED (Alarm/Trip) indications, HMI Software, on/off switch","0000663289-Specific: 220 VDC power supply and Fibre Optic Driver - 1550nm 120km Generic: includes module rack, CPU module, 4 channels (input/output), Protection Interface Adaptors,  LED (Alarm/Trip) indications, HMI Software, on/off switch","0000663483-48V DC Power Supply - G3LI","0000663482-110V DC Power Supply - G3LK 100V to 250V DC","0000663480-220V DC Power Supply - G3LK 100V to 230V DC","0000663419-X.21 Communications Module - G3LD","0000663420-FO Driver Module 1310nm - 30km","0000663423-FO Driver Module 1310nm - 60km","0000663421-FO Driver Module 1550nm - 120km","0000663426-E1 2.048Mbps Communications Module - G1LE","0000663424-Ethernet/LAN Communications Module - G3LE","0000663507-CPU and Module Rack - G7BI","0000663427-Channel/Relay Interface (input/output) - G3LRa","0000663509-LED Alarm/Trip Indications Module - Built into Item 22 G7BI","0000663310-HMI Software including instruction manual on CD.","0000663428-Instruction Manual/Handbooks - Hardcopy","0000663486-HMI cable and USB/serial adapter","0000663508-Protection Interface Adaptor (with wiring)"]
["   risk insurance"]
["**Please specify"]
[{"$nulls":9},10,11,12,13,14,15,16,17,18,19,20,21,22,23,24,25,26,27,28,29,30,31,32,33,34,35,36,37]
["SUPPLIED FROM OUTSIDE R.S.A.:",{"$nulls":7},"(In ZAR)"]
["1: F.O.B. PRICE",{"$nulls":7},"(In ZAR)"]
["2: COST OF SEA  FREIGHT",{"$nulls":7},"(In ZAR)"]
["3: COST OF AIR  FREIGHT",{"$nulls":7},"(In ZAR)"]
{"$rows_left_out":75}
{"sheet":"PS5 Summary","index":2,"n_rows":41,"n_cols":24,"rows_kept":41,"merged":[[6,6,6,11],[6,12,6,14],[6,15,6,21],[6,22,8,22],[6,23,8,23],[7,6,7,11],[7,12,7,14],[7,15,7,21]]}
["SCHEDULE OF PRICES"]
[]
["ESKOM NSD TENDER"]
[]
["SUPPLY OF NSD570"]
[]
["YOUR REF: ",{"$nulls":5},{"$f":"'PS5'!A12","v":"SUPPLIED FROM OUTSIDE R.S.A.:"},{"$nulls":5},{"$f":"'PS5'!A29","v":"SUPPLIED FROM INSIDE R.S.A."},null,null,{"$f":"'PS5'!A37","v":" SITE WORK (ERECTION / INSTALLATION INCL. COMMISSIONING) "},{"$nulls":6},"Total Unit Rate","Total Amount (Excl.VAT)"]
[{"$nulls":6},"In Local Currency",{"$nulls":5},"In Local Currency",null,null,"In Local Currency"]
["ITEM","SAP No.","QTY","DESCRIPTION","Unit of Measurement","Qty","R.o.E",{"$f":"'PS5'!A17","v":"5: TOTAL PRICE DELIVERED PORT R.S.A. ..."},"R.o.E",{"$f":"'PS5'!A23","v":"11: COST OF IMPORTATION ..."},{"$f":"'PS5'!A26","v":"14: TOTAL COST OF TRANSPORT S.A. PORT TO WORK/SITE ..."},{"$f":"'PS5'!A27","v":"15: TOTAL PRICE (F.O.B.) DELIVERED TO WORKS/SITE..."},{"$f":"'PS5'!A32","v":"18: TOTAL F.O.R. PRICE ..."},{"$f":"'PS5'!A35","v":"21: COST OF TRANSPORT WORKS TO SITE ...          "},{"$f":"'PS5'!A36","v":"22: PRICE (F.O.R.) DELIVERED TO SITE ...          "},{"$f":"'PS5'!A38","v":"23: LOCAL LABOUR"},"R.o.E",{"$f":"'PS5'!A39","v":"24: EXPATRIATE  LABOUR"},"R.o.E",{"$f":"'PS5'!A41","v":"26: OVERSEAS ENGINEERING SERVICES"},{"$f":"'PS5'!A42","v":"27: LOCAL ENGINEERING SERVICES"},{"$f":"'PS5'!A43","v":"28: TOTAL PRICE FOR ENGINEERING SERVICES..."}]
[]
[1,"0000663307",20,"0000663307-Specific: 48 VDC power supply and X.21 communication interface Generic: includes module rack, CPU module, 4 channels (input/output), Protection Interface Adaptors,  LED (Alarm/Trip) indications, HMI Software, on/off switch","No",{"v":20,"d":"20.00"},null,{"$f":"VLOOKUP(H$9,'PS5'!$A:$AK,INDEX('PS5'!$11:$11,MATCH('PS5 Summary'!$D11,'PS5'!$8:$8,0)),FALSE)","v":0},null,{"$f":"VLOOKUP(J$9,'PS5'!$A:$AK,INDEX('PS5'!$11:$11,MATCH('PS5 Summary'!$D11,'PS5'!$8:$8,0)),FALSE)","v":0},{"$f":"VLOOKUP(K$9,'PS5'!$A:$AK,INDEX('PS5'!$11:$11,MATCH('PS5 Summary'!$D11,'PS5'!$8:$8,0)),FALSE)","v":0},{"$f":"K11+J11+H11","v":0},{"$f":"VLOOKUP(M$9,'PS5'!$A:$AK,INDEX('PS5'!$11:$11,MATCH('PS5 Summary'!$D11,'PS5'!$8:$8,0)),FALSE)","v":0},{"$f":"VLOOKUP(N$9,'PS5'!$A:$AK,INDEX('PS5'!$11:$11,MATCH('PS5 Summary'!$D11,'PS5'!$8:$8,0)),FALSE)","v":0},{"$f":"SUM(M11:N11)","v":0},{"$f":"VLOOKUP(P$9,'PS5'!$A:$AK,INDEX('PS5'!$11:$11,MATCH('PS5 Summary'!$D11,'PS5'!$8:$8,0)),FALSE)","v":0},null,{"$f":"VLOOKUP(R$9,'PS5'!$A:$AK,INDEX('PS5'!$11:$11,MATCH('PS5 Summary'!$D11,'PS5'!$8:$8,0)),FALSE)","v":0},null,{"$f":"VLOOKUP(T$9,'PS5'!$A:$AK,INDEX('PS5'!$11:$11,MATCH('PS5 Summary'!$D11,'PS5'!$8:$8,0)),FALSE)","v":0},{"$f":"VLOOKUP(U$9,'PS5'!$A:$AK,INDEX('PS5'!$11:$11,MATCH('PS5 Summary'!$D11,'PS5'!$8:$8,0)),FALSE)","v":0},{"$f":"P11+R11+T11+U11","v":0},{"$f":"L11+O11+V11","v":0},{"$f":"W11*F11","v":0}]
[2,"0000663301",104,"0000663301-Specific: 110 VDC power supply and X.21 communication interface Generic: includes module rack, CPU module, 4 channels (input/output), Protection Interface Adaptors,  LED (Alarm/Trip) indications, HMI Software, on/off switch","No",{"v":104,"d":"104.00"},null,{"$f":"VLOOKUP(H$9,'PS5'!$A:$AK,INDEX('PS5'!$11:$11,MATCH('PS5 Summary'!$D12,'PS5'!$8:$8,0)),FALSE)","v":0},null,{"$f":"VLOOKUP(J$9,'PS5'!$A:$AK,INDEX('PS5'!$11:$11,MATCH('PS5 Summary'!$D12,'PS5'!$8:$8,0)),FALSE)","v":0},{"$f":"VLOOKUP(K$9,'PS5'!$A:$AK,INDEX('PS5'!$11:$11,MATCH('PS5 Summary'!$D12,'PS5'!$8:$8,0)),FALSE)","v":0},{"$f":"K12+J12+H12","v":0},{"$f":"VLOOKUP(M$9,'PS5'!$A:$AK,INDEX('PS5'!$11:$11,MATCH('PS5 Summary'!$D12,'PS5'!$8:$8,0)),FALSE)","v":0},{"$f":"VLOOKUP(N$9,'PS5'!$A:$AK,INDEX('PS5'!$11:$11,MATCH('PS5 Summary'!$D12,'PS5'!$8:$8,0)),FALSE)","v":0},{"$f":"SUM(M12:N12)","v":0},{"$f":"VLOOKUP(P$9,'PS5'!$A:$AK,INDEX('PS5'!$11:$11,MATCH('PS5 Summary'!$D12,'PS5'!$8:$8,0)),FALSE)","v":0},null,{"$f":"VLOOKUP(R$9,'PS5'!$A:$AK,INDEX('PS5'!$11:$11,MATCH('PS5 Summary'!$D12,'PS5'!$8:$8,0)),FALSE)","v":0},null,{"$f":"VLOOKUP(T$9,'PS5'!$A:$AK,INDEX('PS5'!$11:$11,MATCH('PS5 Summary'!$D12,'PS5'!$8:$8,0)),FALSE)","v":0},{"$f":"VLOOKUP(U$9,'PS5'!$A:$AK,INDEX('PS5'!$11:$11,MATCH('PS5 Summary'!$D12,'PS5'!$8:$8,0)),FALSE)","v":0},{"$f":"P12+R12+T12+U12","v":0},{"$f":"L12+O12+V12","v":0},0]
[3,"0000663304",20,"0000663304-Specific: 220 VDC power supply and X.21 communication interface Generic: includes module rack, CPU module, 4 channels (input/output), Protection Interface Adaptors,  LED (Alarm/Trip) indications, HMI Software, on/off switch","No",{"v":20,"d":"20.00"},null,{"$f":"VLOOKUP(H$9,'PS5'!$A:$AK,INDEX('PS5'!$11:$11,MATCH('PS5 Summary'!$D13,'PS5'!$8:$8,0)),FALSE)","v":0},null,{"$f":"VLOOKUP(J$9,'PS5'!$A:$AK,INDEX('PS5'!$11:$11,MATCH('PS5 Summary'!$D13,'PS5'!$8:$8,0)),FALSE)","v":0},{"$f":"VLOOKUP(K$9,'PS5'!$A:$AK,INDEX('PS5'!$11:$11,MATCH('PS5 Summary'!$D13,'PS5'!$8:$8,0)),FALSE)","v":0},0,{"$f":"VLOOKUP(M$9,'PS5'!$A:$AK,INDEX('PS5'!$11:$11,MATCH('PS5 Summary'!$D13,'PS5'!$8:$8,0)),FALSE)","v":0},{"$f":"VLOOKUP(N$9,'PS5'!$A:$AK,INDEX('PS5'!$11:$11,MATCH('PS5 Summary'!$D13,'PS5'!$8:$8,0)),FALSE)","v":0},0,{"$f":"VLOOKUP(P$9,'PS5'!$A:$AK,INDEX('PS5'!$11:$11,MATCH('PS5 Summary'!$D13,'PS5'!$8:$8,0)),FALSE)","v":0},null,{"$f":"VLOOKUP(R$9,'PS5'!$A:$AK,INDEX('PS5'!$11:$11,MATCH('PS5 Summary'!$D13,'PS5'!$8:$8,0)),FALSE)","v":0},null,{"$f":"VLOOKUP(T$9,'PS5'!$A:$AK,INDEX('PS5'!$11:$11,MATCH('PS5 Summary'!$D13,'PS5'!$8:$8,0)),FALSE)","v":0},{"$f":"VLOOKUP(U$9,'PS5'!$A:$AK,INDEX('PS5'!$11:$11,MATCH('PS5 Summary'!$D13,'PS5'!$8:$8,0)),FALSE)","v":0},0,0,0]
[4,"0000663309",20,"0000663309-Specific: 48 VDC power supply and Fibre Optic Driver - 1310nm 30km Generic: includes module rack, CPU module, 4 channels (input/output), Protection Interface Adaptors,  LED (Alarm/Trip) indications, HMI Software, on/off switch","No",{"v":20,"d":"20.00"},null,{"$f":"VLOOKUP(H$9,'PS5'!$A:$AK,INDEX('PS5'!$11:$11,MATCH('PS5 Summary'!$D14,'PS5'!$8:$8,0)),FALSE)","v":0},null,{"$f":"VLOOKUP(J$9,'PS5'!$A:$AK,INDEX('PS5'!$11:$11,MATCH('PS5 Summary'!$D14,'PS5'!$8:$8,0)),FALSE)","v":0},{"$f":"VLOOKUP(K$9,'PS5'!$A:$AK,INDEX('PS5'!$11:$11,MATCH('PS5 Summary'!$D14,'PS5'!$8:$8,0)),FALSE)","v":0},0,{"$f":"VLOOKUP(M$9,'PS5'!$A:$AK,INDEX('PS5'!$11:$11,MATCH('PS5 Summary'!$D14,'PS5'!$8:$8,0)),FALSE)","v":0},{"$f":"VLOOKUP(N$9,'PS5'!$A:$AK,INDEX('PS5'!$11:$11,MATCH('PS5 Summary'!$D14,'PS5'!$8:$8,0)),FALSE)","v":0},0,{"$f":"VLOOKUP(P$9,'PS5'!$A:$AK,INDEX('PS5'!$11:$11,MATCH('PS5 Summary'!$D14,'PS5'!$8:$8,0)),FALSE)","v":0},null,{"$f":"VLOOKUP(R$9,'PS5'!$A:$AK,INDEX('PS5'!$11:$11,MATCH('PS5 Summary'!$D14,'PS5'!$8:$8,0)),FALSE)","v":0},null,{"$f":"VLOOKUP(T$9,'PS5'!$A:$AK,INDEX('PS5'!$11:$11,MATCH('PS5 Summary'!$D14,'PS5'!$8:$8,0)),FALSE)","v":0},{"$f":"VLOOKUP(U$9,'PS5'!$A:$AK,INDEX('PS5'!$11:$11,MATCH('PS5 Summary'!$D14,'PS5'!$8:$8,0)),FALSE)","v":0},0,0,0]
[5,"0000663412",30,"0000663412-Specific: 110 VDC power supply and Fibre Optic Driver - 1310nm 30km Generic: includes module rack, CPU module, 4 channels (input/output), Protection Interface Adaptors,  LED (Alarm/Trip) indications, HMI Software, on/off switch","No",{"v":30,"d":"30.00"},null,{"$f":"VLOOKUP(H$9,'PS5'!$A:$AK,INDEX('PS5'!$11:$11,MATCH('PS5 Summary'!$D15,'PS5'!$8:$8,0)),FALSE)","v":0},null,{"$f":"VLOOKUP(J$9,'PS5'!$A:$AK,INDEX('PS5'!$11:$11,MATCH('PS5 Summary'!$D15,'PS5'!$8:$8,0)),FALSE)","v":0},{"$f":"VLOOKUP(K$9,'PS5'!$A:$AK,INDEX('PS5'!$11:$11,MATCH('PS5 Summary'!$D15,'PS5'!$8:$8,0)),FALSE)","v":0},0,{"$f":"VLOOKUP(M$9,'PS5'!$A:$AK,INDEX('PS5'!$11:$11,MATCH('PS5 Summary'!$D15,'PS5'!$8:$8,0)),FALSE)","v":0},{"$f":"VLOOKUP(N$9,'PS5'!$A:$AK,INDEX('PS5'!$11:$11,MATCH('PS5 Summary'!$D15,'PS5'!$8:$8,0)),FALSE)","v":0},0,{"$f":"VLOOKUP(P$9,'PS5'!$A:$AK,INDEX('PS5'!$11:$11,MATCH('PS5 Summary'!$D15,'PS5'!$8:$8,0)),FALSE)","v":0},null,{"$f":"VLOOKUP(R$9,'PS5'!$A:$AK,INDEX('PS5'!$11:$11,MATCH('PS5 Summary'!$D15,'PS5'!$8:$8,0)),FALSE)","v":0},null,{"$f":"VLOOKUP(T$9,'PS5'!$A:$AK,INDEX('PS5'!$11:$11,MATCH('PS5 Summary'!$D15,'PS5'!$8:$8,0)),FALSE)","v":0},{"$f":"VLOOKUP(U$9,'PS5'!$A:$AK,INDEX('PS5'!$11:$11,MATCH('PS5 Summary'!$D15,'PS5'!$8:$8,0)),FALSE)","v":0},0,0,0]
{"$rows_left_out":27}
{"sheet":"Transport and Offloading Matrix","index":3,"n_rows":34,"n_cols":12,"rows_kept":34,"merged":[[0,0,0,11],[2,0,3,4],[2,5,3,11],[4,0,5,4],[4,5,5,11],[6,0,7,4],[6,5,7,11],[8,0,11,0],[8,1,11,1],[8,2,8,11],[9,2,9,11],[10,2,10,11],[33,0,33,11],[34,0,34,11],[35,0,35,11],[36,0,36,11]]}
["TRANSPORT AND OFF LOADING COSTS"]
[]
[" ENQUIRY NO"]
[]
["COMMODITY",{"$nulls":4},"TPE"]
[]
["SUPPLIER"]
[]
["Item","Round Trip Distance [km]","Prices in South African Currency (Excluding VAT)"]
[null,null,"Transport to site or regional store and off-loading"]
[null,null,"Total Units [No]"]
[null,null,"0-10","11 - 20","21 - 30","31 - 40","41 - 50","51 - 60","61-70","71 - 80","81 - 90","91 - 100"]
[1,"0 - 100"]
[2,"101 - 200"]
[3,"201 - 300"]
{"$rows_left_out":20}
{"sheet":"CPA Formula","index":4,"n_rows":148,"n_cols":14,"rows_kept":148,"merged":[[0,0,0,1],[1,0,1,1],[2,0,2,1],[3,0,3,1],[5,0,5,4],[8,2,8,3],[8,5,8,7],[9,2,9,4],[9,5,18,7],[10,2,10,4],[11,2,11,4],[12,2,12,4],[13,2,13,4],[14,2,14,4],[15,2,15,4],[16,2,16,4],[17,2,17,4],[18,2,18,4],[21,1,21,6],[22,1,22,6],[25,1,25,6],[26,1,26,6],[27,1,27,6],[28,1,28,6],[29,1,29,6],[30,1,30,6],[32,1,32,6],[33,1,33,6],[34,1,34,6],[35,1,35,6],[36,1,36,6],[40,1,40,6],[51,1,51,6],[62,1,62,6],[73,1,73,6],[84,1,84,6],[95,1,95,6],[106,1,106,6],[117,1,117,6],[128,1,128,6],[139,1,139,6]]}
["Enquiry No."]
["Package Name:"]
["Tenderer's Name:"]
["Category of Offer:",null,"Main Offer Only"]
[]
["CONTRACT PRICE ADJUSTMENT (CPA) FOR INFLATION"]
[]
["No.","Formula Code","Summary of the description of the Tenderer's Formulae"]
[1,"Fixed","Firm and Fixed ",null,null,"Prices are 100 % fixed and firm. CPA is not applicable. "]
[2,"A",{"$f":"B41","v":"Tenderer's description of Formula A"},null,null,"Type in the description of each formula in the tables below"]
[3,"B",{"$f":"B52","v":"Tenderer's description of Formula B"}]
[4,"C",{"$f":"B63","v":"Tenderer's description of Formula C"}]
[5,"D",{"$f":"B74","v":"Tenderer's description of Formula D"}]
[6,"E",{"$f":"B85","v":"Tenderer's description of Formula E"}]
[7,"F",{"$f":"B96","v":"Tenderer's description of Formula F"}]
{"$rows_left_out":134}
{"sheet":"Exchnge Rates","index":5,"n_rows":36,"n_cols":8,"rows_kept":36,"merged":[[0,0,0,1],[0,2,0,4],[1,0,1,1],[1,2,1,4],[2,0,2,1],[2,2,2,4],[7,1,7,6],[8,0,10,0],[8,1,8,6],[8,14,8,19],[9,1,9,6],[10,1,10,6],[11,1,11,6],[12,1,12,6],[13,0,15,0],[13,1,13,6],[14,1,14,6],[15,1,15,6],[20,7,20,12]]}
["Enquiry No.",null,{"$f":"Cover!B15","v":0}]
["Package Name:",null,{"$f":"Cover!B17","v":0}]
["Tenderer's Name:",null,{"$f":"Cover!B21","v":0}]
[]
["5.1.4 EXCHANGE RATES FOR MULTIPLE CURRENCIES"]
[]
["NOTES:"]
[1,"The table below needs to be completed if the Employer will be exposed to any currency fluctuation as stipulated in Secondary Clause X3.  For conversion of the foreign portions to Rand, please use the South African Reserve Bank's (SARB) exchange rate at 12:00 on the day of advertisement of the bid.  This is in terms of the Preferential Procurement Policy Framework Act (PPPFA) with which the Employer has to comply.\nNB: Tenderers must submit proof of the SARB rate(s) of exchange used  "]
[2,"The following URL (electronic route) is to be followed to access the relevant SARB rates on their web pages:\n"]
[null,"www.resbank.co.za"]
[null,"-  Select Research\n-  Then select Rates\n-  Click on \"Select historical exchange rates and other interest rates\"\n-  Clicking on the exchange rate in the following page opens the daily rates per currency and SA Rand"]
[3,"The Employer deals only in the currencies listed below unless other currencies are specifically approved for this tender.  Kindly notify the Employer of any currency that the tenderer intends to use, but is not stipulated in the table, to consider sanctioning such currency.  Sufficient time must be allowed for the assessment and to respond to such request.  The onus is on the tenderer to submit a bid with approved currencies"]
[4,"The format in which the exchange rate must be inserted in the table is:  1 (One) Foreign Currency = R Amount  (i.e. the Rand amount for one of each foreign currency applicable).  Exchange rates must be rounded to 4 decimals\n\nNB :  Only the USD/ZAR, GBP/ZAR and EUR/ZAR are published in this way on the SARB web pages above.  The Rand rate with the other currencies must be inverted (1/Foreign Currency Rate) in order to list it in the required format in the table below\n"]
[5,"All information in the table below must conform with all other equivalent information in the offer. "]
[null,"Payment in terms of Payment Method 2  is considered as a \"foreign payment\" although it will be effected in South African Rand. However, amounts for  \"F.O.R. Price-Goods supplied from Imported Items\", are NOT considered as \"foreign payments\""]
{"$rows_left_out":21}