{"text_format":"3","workbook":"xlsx","n_sheets":2,"sheets":["ELearning","Currency"],"not_rendered":{"external_links":7,"defined_names":222},"read":"whole","date_system":"1900"}

{"sheet":"ELearning","index":0,"n_rows":30,"n_cols":53,"rows_kept":30,"merged":[[2,1,2,6],[22,8,22,12],[22,16,22,21],[23,4,23,6],[24,1,25,1]]}
[{"$nulls":13},1]
[]
[null,"VENDOR NAME",{"$nulls":50},"USD"]
[{"$nulls":52},"EUR"]
[{"$nulls":52},"ZAR"]
[null,"IMPORTANT NOTES"]
[null,"All cells highlighted in Green must be completed"]
[null,"Quoted prices MUST be in ZAR, EXCLUDING VAT and ESCALATIONS"]
[]
[null,"E-Learning Content Development and Software Editing Tools"]
[null,"Provide the ANNUAL SUBSCRIPTION Charge for License categories based on the estimated quantities"]
[null,"Prices MUST be quoted based on the SCOPE provided"]
[null,"Estimated quantities are based on the required number of Licenses"]
[null,"Select the currency from the CURRENCY drop-down list in COLUMN \"F\""]
[]
[null,"The applicable currencies have been indicated on the \"Currency sheet\" for common base comparison purposes. "]
[null,"The adjustments for prevailing rates and the basis for future price adjustments will be determined at time of contracting. "]
[null,"Exchange rate variations may not be claimed for the local mark-up in the pricing structure"]
[]
[null,"All Prices must be exclusive of VAT"]
[]
[]
[{"$nulls":8},"ANNUAL SUBSCRIPTION ( OVER A PERIOD OF 3 YEARS)",{"$nulls":7},"SLIDING SCALE - UNIT PRICE (APPLICABLE FOR THE DURATION OF THE CONTRACT)"]
[null,null,"Unit charge","Software Requirements Details","Currency",{"$nulls":3},"Estimated Quantities","Unit Price in FOREX","Unit Price in ZAR","Total in FOREX","Total in ZAR",null,"Pricing Assumptions / Escalation and Other Additional Information",null,5,10,15,20,25,"30+"]
[null,"E-Learning Content Development and Software Editing Tools","Subscription / License","• Allow for rapid content development\n• Provide content library assets (themes, images, characters, etc.) provided speeds up\ncontent development.\n• Deliver e-learning courses to every device including mobile devices.\n• Allow for the development of interactive courses and assessments.\n• Be a leader across industry.",{"$f":"IF(F25=\"\",\"\",IF(F25=\"ZAR\",\"Local\",\"Foreign\"))","v":"Local"},"ZAR",{"$f":"IF(E25=\"\",\"\",IF(E25=\"Foreign\",VLOOKUP(F25,Currency!$E$20:$F$33,2,FALSE),1))","v":{"v":1,"d":"1.00"}},null,10,0,{"$f":"J25*$G25","v":0},{"$f":"J25*I25","v":0},{"$f":"I25*K25","v":0},{"$nulls":4},{"$f":"K25","v":0}]
[null,null,"Training / User","User Training (For the First Year of the Contract)",{"$f":"IF(F26=\"\",\"\",IF(F26=\"ZAR\",\"Local\",\"Foreign\"))","v":"Local"},"ZAR",{"$f":"IF(E26=\"\",\"\",IF(E26=\"Foreign\",VLOOKUP(F26,Currency!$E$20:$F$33,2,FALSE),1))","v":{"v":1,"d":"1.00"}},null,10,0,{"$f":"J26*$G26","v":0},{"$f":"J26*I26","v":0},{"$f":"I26*K26","v":0}]
[{"$nulls":9},"Total per year",null,null,{"$f":"SUM(M25:M26)","v":0}]
[]
[]
[{"$nulls":9},"Total for 3 years",null,null,{"$f":"(M26)+(M25*3)","v":0}]

{"sheet":"Currency","index":1,"n_rows":33,"n_cols":8,"rows_kept":33,"merged":[[1,1,1,5],[6,2,6,7],[7,1,9,1],[7,2,7,7],[7,15,7,20],[8,2,8,7],[9,2,9,7],[10,2,10,7],[11,2,11,7],[12,1,14,1],[12,2,12,7],[13,2,13,7],[14,2,14,7],[17,2,17,7]]}
[]
[null,{"$f":"ELearning!B3","v":"VENDOR NAME"}]
[]
[null,"EXCHANGE RATES FOR MULTIPLE CURRENCIES"]
[]
[null,"NOTES:"]
[null,1,"The table below needs to be completed if the Employer will be exposed to any currency fluctuation as stipulated in Secondary Clause X3.  For conversion of the foreign portions to Rand, please use the South African Reserve Bank's (SARB) exchange rate at 12:00 on the day of advertisement of the bid.  This is in terms of the Preferential Procurement Policy Framework Act (PPPFA) with which the Employer has to comply.\nNB: Tenderers must submit proof of the SARB rate(s) of exchange used  "]
[null,2,"The following URL (electronic route) is to be followed to access the relevant SARB rates on their web pages:\n"]
[null,null,"www.resbank.co.za"]
[null,null,"-  Select Research\n-  Then select Rates\n-  Click on \"Select historical exchange rates and other interest rates\"\n-  Clicking on the exchange rate in the following page opens the daily rates per currency and SA Rand"]
[null,3,"The Employer deals only in the currencies listed below unless other currencies are specifically approved for this tender.  Kindly notify the Employer of any currency that the tenderer intends to use, but is not stipulated in the table, to consider sanctioning such currency.  Sufficient time must be allowed for the assessment and to respond to such request.  The onus is on the tenderer to submit a bid with approved currencies"]
[null,4,"The format in which the exchange rate must be inserted in the table is:  1 (One) Foreign Currency = R Amount  (i.e. the Rand amount for one of each foreign currency applicable).  Exchange rates must be rounded to 4 decimals\n\nNB :  Only the USD/ZAR, GBP/ZAR and EUR/ZAR are published in this way on the SARB web pages above.  The Rand rate with the other currencies must be inverted (1/Foreign Currency Rate) in order to list it in the required format in the table below\n"]
[null,5,"All information in the table below must conform with all other equivalent information in the offer. "]
[null,null,"Payment in terms of Payment Method 2  is considered as a \"foreign payment\" although it will be effected in South African Rand. However, amounts for  \"F.O.R. Price-Goods supplied from Imported Items\", are NOT considered as \"foreign payments\""]
[null,null,"If more than one payment method apply for a currency, the Tenderer must request an additional row be inserted in the table in order to split the values and identify the relevant method.   "]
[]
[]
[null,null,"MULTIPLE CURRENCIES"]
[null,null,"No","Currency Description","Code","Exchange Rate Currency 1,00 =","Date Published","Source"]
[null,null,1,"Australian Dollar","AUD"]
[null,null,2,"Canadian Dollar","CAN"]
[null,null,3,"Swiss Franc","CHF"]
[null,null,4,"Danish Krone","DKK"]
[null,null,5,"European Currency","EUR"]
[null,null,6,"British Pound","GBP"]
[null,null,7,"Hong Kong Dollar","HKD"]
[null,null,8,"Japanese Yen","JPY"]
[null,null,9,"Norwegian Krone","NOK"]
[null,null,10,"New Zealand Dollar","NZD"]
[null,null,11,"Swedish Krone","SEK"]
[null,null,12,"Singapore Dollar","SGD"]
[null,null,13,"United States Dollar","USD"]
[null,null,14,"South African Rand","ZAR",{"v":1,"d":"R 1.000000"}]