{"text_format":"3","workbook":"xlsx","n_sheets":5,"sheets":["Contractor Baseline template","Consequence rating","Likelihood rating","Risk control effectiveness","Risk matrix"],"not_rendered":{"external_links":7,"defined_names":4,"comments":1},"read":"whole","date_system":"1900"}

{"sheet":"Contractor Baseline template","index":0,"n_rows":106,"n_cols":32,"rows_kept":106,"merged":[[2,0,2,12],[3,1,3,3],[3,4,3,6],[3,7,3,10],[4,0,4,12],[5,0,8,0],[5,1,8,3],[5,4,8,4],[5,5,8,6],[5,7,5,10],[6,7,6,10],[7,7,7,10],[8,7,8,10],[9,0,9,12],[10,9,11,9],[10,10,11,10],[11,17,16,17],[12,0,16,0],[17,0,34,0],[18,19,18,23],[35,0,46,0],[49,0,50,0],[51,0,55,0],[56,0,59,0],[60,0,63,0],[64,0,65,0],[66,0,68,0],[70,0,72,0],[73,0,75,0],[77,0,89,0],[100,0,100,2],[100,4,100,6],[102,0,102,2],[102,4,102,6]]}
[]
[]
["Occupational Health and Safety Baseline risk assessment template"]
["Business/Operating unit:","Eskom  ",{"$nulls":5},"Telecommunications",{"$nulls":3},"Next Review Date \n(every 2 years):  ","Template identifier: "]
[]
[" Date:    ","2023-02-07",null,null,"Prepared By: Zamambo Mkhize, Priscilla Anthony ,Matsebe Moabi","Authorised by:   ",null,"Name:Mark Ganesan",{"$nulls":3},"Document identifier","240-168295322 ",{"$nulls":13},"R","Safety",1,"A","Fully effective","I"]
[{"$nulls":7},"Designation: Centrall Region Manager",{"$nulls":3},"Revision number:",1,{"$nulls":13},"N","Health",2,"B","Mostly effective","II"]
[{"$nulls":7},"Signed:",{"$nulls":3},"Revision date: ","17/01/2024",{"$nulls":15},3,"C","Mostly ineffective","III"]
[{"$nulls":7},"2023-02-07",{"$nulls":20},4,"D","None","IV"]
["Refer to Occupational Health and Safety Risk assessment procedure 32-520",{"$nulls":27},5,"E"]
["Hazard Identification","Associated risk","Risk type","What are the possible consequences?","Existing Controls"," ",null,null,"Risk Priority Rating",null,"RCE\nRisk Control Effectiveness","Control Owner","Legal and Other Requirements",{"$nulls":14},6]
["List specific activities to be performed taking into consideration the equipment to be used, the personnel involved in the task.","Anything  with potential to cause  of harm. \nNote: A hazard can pose more than one risk.","A chance that injury , ill health or damage could occur as a result of uncontrolled hazard.","Safety or health","Consider the worse case scenario without controls?","Include:\n- Preventative Controls\n(controls implemented to eliminate hazards or reduce the likelihood of the risk occurring), and\n- Reactive Controls \n(controls implemented to reduce the immediate impact of the risk occurring)    \n\nElimination\nSubstitution \nEngineering controls \nAdministrative controls \nPersonal protective equipment (PPE)","Consequence","Likelihood",{"$nulls":3},"Person allocated the responsibility for implementing the agreed controls ","Where relevant, list the relevant legislative and or Eskom requirements that prescribe the control.",{"$nulls":4},"Consequences",6,"III","II","I","I","I"]
["Site access and security","Actions and Conditions leading to Hijacking, kidnapping, robbery, assault, rape","Possible assault, rape, stress, trauma, being shot","Safety","Possible Injury or fatality","Evaulate of Tender Returnables , Evaulutions and  Approval of safety files before they mobilise   on iste , Conduction site audits  ",4,"D",{"$f":"CONCATENATE(G13,H13)","v":"4D"},{"$f":"IF(OR(ISBLANK(G13),ISBLANK(H13)),\" \",VLOOKUP(I13,'Risk matrix'!$A$26:$B$55,2,FALSE))","v":"I"},"Mostly effective","Telecommunication s and  contractor ","Line 32.3; Site access procedure (ETPR 0578), Incident Management Procedure (32-95)OHSAS 18001(4.3.1,4.5.3)",{"$nulls":5},5,"III","II","II","I","I"]
[null,"Poor Road Conditions","Vehicle losing control","Safety","Possible MVA which may lead to injury or fatality","Evaulate of Tender Returnables , Evaulutions and  Approval of safety files before they mobilise   on iste , Conduction site audits  ",4,"C",{"$f":"CONCATENATE(G14,H14)","v":"4C"},{"$f":"IF(OR(ISBLANK(G14),ISBLANK(H14)),\" \",VLOOKUP(I14,'Risk matrix'!$A$26:$B$55,2,FALSE))","v":"II"},"Mostly effective","Telecommunication s and  contractor ","Line 32.3, 32-520, Safe travelling procedure 240-62946386; OHSAS 18001(4.3.1,4.5.3)",{"$nulls":5},4,"IV","III","II","I","I"]
[null,"Exposure to Raptors/Insects/Reptiles","Possible venomous, bites and stings","Safety","Possible poisonous bites and stings which may lead to Occupational illness or fatality","Evaulate of Tender Returnables , Evaulutions and  Approval of safety files before they mobilise   on iste , Conduction site audits  ",4,"D",{"$f":"CONCATENATE(G15,H15)","v":"4D"},{"$f":"IF(OR(ISBLANK(G15),ISBLANK(H15)),\" \",VLOOKUP(I15,'Risk matrix'!$A$26:$B$55,2,FALSE))","v":"I"},"Mostly effective","Telecommunication s and  contractor ","Line 32.3; Emergency Plan in case of bees, wasps and tick stings (ETPN1730); OHSAS 18001(4.3.1,4.5.3)",{"$nulls":5},3,"IV","III","II","II","I"]
[null,"Actions and conditions leading to Veld Fires","Possible burns or Smoke Inhalation ","Health","Possible Injury or fatality","Evaulate of Tender Returnables , Evaulutions and  Approval of safety files before they mobilise   on iste , Conduction site audits  ",4,"D",{"$f":"CONCATENATE(G16,H16)","v":"4D"},{"$f":"IF(OR(ISBLANK(G16),ISBLANK(H16)),\" \",VLOOKUP(I16,'Risk matrix'!$A$26:$B$55,2,FALSE))","v":"I"},"Mostly effective","Telecommunication s and  contractor ","Line 32.3; Emergency Preparedness Procedure ETPR 363; OHSAS 18001(4.3.1,4.4.6)",{"$nulls":5},2,"IV","IV","III","II","II"]
[null,"Actions and conditions leading to Vandalism","Theft, vandalism, public injury ","Safety","Possible public injury or Damage to Property","Evaulate of Tender Returnables , Evaulutions and  Approval of safety files before they mobilise   on iste , Conduction site audits  ",2,"B",{"$f":"CONCATENATE(G17,H17)","v":"2B"},{"$f":"IF(OR(ISBLANK(G17),ISBLANK(H17)),\" \",VLOOKUP(I17,'Risk matrix'!$A$26:$B$55,2,FALSE))","v":"IV"},"Mostly effective","Telecommunication s and  contractor ","Line 32.3, Site access Procedure (ETPR0578), Incident Management Procedure ETPR0737",{"$nulls":5},1,"IV","IV","III","III","III"]
["Travelling By Road","Fatigue","Falling asleep while driving,","Safety ","MVA which may lead to injury or fatality","Safety Awareness on fatigue Management, Availability, implementation and Monitoring of adherence to fatigue Management Procedure (ETTB 1517), Availability, implementation and monitoring of adherence to the travelling Procedure 240-62946386, MVA reports are analysed on a monthly basis to determine trends on excessive km travelled ",3,"B",{"$f":"CONCATENATE(G18,H18)","v":"3B"},{"$f":"IF(OR(ISBLANK(G18),ISBLANK(H18)),\" \",VLOOKUP(I18,'Risk matrix'!$A$26:$B$55,2,FALSE))","v":"III"},"Mostly effective","Telecommunication s and  contractor ","Line 32.3, Driver Fatigue management, ETTB 1517, Safe Travelling Procedure 240-62946386; Risk Assessment Procedure 32-520) Task Specific Risk Assessment (ETFM1289)(ETFM1038) OHSAS 18001(4.3.1,4.5.3)",{"$nulls":6},"A","B","C","D","E"]
[null,"Mechanical failures","Defective Vehicle","Safety","MVA which may lead to injury or fatality","Vehicle planned maintenance,pre-trip inspection,",2,"A","2A",{"$f":"IF(OR(ISBLANK(G19),ISBLANK(H19)),\" \",VLOOKUP(I19,'Risk matrix'!$A$26:$B$55,2,FALSE))","v":"IV"},"Mostly effective","Telecommunication s and  contractor ","Line 32.3; Safe travelling procedure 240-62946386; Risk Assessment Procedure 32-520) Task Specific Risk Assessment (ETFM1289)(ETFM1038) OHSAS 18001(4.3.1,4.5.3)",{"$nulls":6},"Likelihood"]
[null,"Wild/stray animals","Hitting a straying animal","Safety","MVA which may lead to injury or fatality","Defensive driving, driver awareness including being vigilant, obeying traffic rules",2,"A","2A",{"$f":"IF(OR(ISBLANK(G20),ISBLANK(H20)),\" \",VLOOKUP(I20,'Risk matrix'!$A$26:$B$55,2,FALSE))","v":"IV"},"Mostly effective","Telecommunication s and  contractor ","Line 32.3, Risk Assessment procedure (32-520), ETFM1038, Task Specific Risk Assessment (ETFM1289); OHSAS 18001(4.3.1,4.5.3)"]
[null,"Over speeding ","Collission, losing control of the vehicle, unable to stop in time","Safety","MVA which may lead to injury or fatality","Scheme and hired Vehicles, driver awareness, disciplinary measures ",4,"C","4C",{"$f":"IF(OR(ISBLANK(G21),ISBLANK(H21)),\" \",VLOOKUP(I21,'Risk matrix'!$A$26:$B$55,2,FALSE))","v":"II"},"Mostly effective","Telecommunication s and  contractor ","Line 32.3, Line 54.1 and line 55.3,  55.5;Travelling Procedure 240-62946386, Risk Assessment procedure (32-520), ETFM1038, Task Specific Risk Assessment (ETFM1289), OHSAS 18001(4.3.1,4.5.3)"]
[null,"Exposure to Hijacking/ robbery ","Possible assault, rape, stress, trauma, being shot","Safety","Vehicle being taken, Possible injury or fatality","Risk Assessment done for every task, Training on advanced and Defensive driving, Awareness on Hijacking, ",4,"C","4C",{"$f":"IF(OR(ISBLANK(G22),ISBLANK(H22)),\" \",VLOOKUP(I22,'Risk matrix'!$A$26:$B$55,2,FALSE))","v":"II"},"Mostly effective","Telecommunication s and  contractor ","Line 32.3, Risk Assessment Procedure (32-520); OHSAS 18001(4.3.1,4.5.3)"]
[null,"Poor Road conditions","Possible puncture or damage to the vehicle tyre","Safety","MVA which may lead to injury or fatality","Awareness on safe driving, training on advance driving, 4x4 training for specific employees",6,"A","6A",{"$f":"IF(OR(ISBLANK(G23),ISBLANK(H23)),\" \",VLOOKUP(I23,'Risk matrix'!$A$26:$B$55,2,FALSE))","v":"I"},"Mostly effective","Telecommunication s and  contractor ","Line 32.3, Safe travelling procedure 240-62946386; OHSAS 18001(4.3.1,4.5.3)"]
[null,"Driving in a 4X4 Terrain without appropriate competence","The vehicle may capsize and roll","Safety","MVA which may lead to injury or fatality","4x4 training by employees using 4x4, driver awareness, availability of suitable type of vehicle, permit issued on 4x4 driving. Flash reports for incidents shared through ET communications",5,"D","5D",{"$f":"IF(OR(ISBLANK(G24),ISBLANK(H24)),\" \",VLOOKUP(I24,'Risk matrix'!$A$26:$B$55,2,FALSE))","v":"I"},"Mostly effective","Telecommunication s and  contractor ","Line 32.3, ETPR0364 and Safe travelling procedure 240-62946386; OHSAS 18001(4.3.1,4.5.3)"]
[null,"Adverse weather conditions (Heavy rain, hail storm, heavy winds, snow)","Hitting vehicle in front or side, Adverse road conditions, hypothermia,  ","Safety & Health","MVA which may lead to injury or fatality","Implementation and monitoring adherence to Procedures prohibiting work in bad weather condition (travelling Procedure Safe travelling procedure 240-62946386), Awareness on travelling during bad weather conditions, training on skidpan, Awareness on limiting working only to extreme cases, defensive driving course, Wearing Personal Protective Clothing (Gloves and Winter Jacket)",5,"D","5D",{"$f":"IF(OR(ISBLANK(G25),ISBLANK(H25)),\" \",VLOOKUP(I25,'Risk matrix'!$A$26:$B$55,2,FALSE))","v":"I"},"Mostly effective","Telecommunication s and  contractor ","Line 32.3, Safe travelling procedure 240-62946386, ET Communication; OHSAS 18001(4.3.1,4.5.3) "]
[null,"Poorly Maintained Gravel Road","Vehicle slipping and capsizing","Safety ","MVA which may lead to injury or fatality","Advanced driver training, driver awareness, availability of a gravel road Practice note(ETPN1249) used to manage driving, Incident Monitoring",4,"D","4D",{"$f":"IF(OR(ISBLANK(G26),ISBLANK(H26)),\" \",VLOOKUP(I26,'Risk matrix'!$A$26:$B$55,2,FALSE))","v":"I"},"Mostly effective","Telecommunication s and  contractor ","Line 32.3, Safe travelling procedure 240-62946386, ET Fleet Policy, Off-road practice note (ETPN1249); ETTB1250; OHSAS 18001(4.3.1,4.5.3)"]
[null,"Pedestrians crossing the road","Hitting a straying animal","Safety","MVA which may lead to injury or fatality including Public","Defensive driving, safe driver awareness, Awareness on safe driving(Put headlights on, limit night time driving)",4,"D","4D",{"$f":"IF(OR(ISBLANK(G27),ISBLANK(H27)),\" \",VLOOKUP(I27,'Risk matrix'!$A$26:$B$55,2,FALSE))","v":"I"},"Mostly effective","Telecommunication s and  contractor ","Line 32.3, Safe travelling procedure 240-62946386, ET Fleet Policy, OHSAS 18001(4.3.1,4.5.3)"]
[null,"Other negligent road users","Colliding with other vehicles","Safety","possible motor vehicle pile-up (MVA) which may lead to injury or fatality including Public","Continuous risk assessment, Safe Driver awareness(Road rage, avoiding reckless drivers, Giving way irrespective of being right)",5,"C","5C",{"$f":"IF(OR(ISBLANK(G28),ISBLANK(H28)),\" \",VLOOKUP(I28,'Risk matrix'!$A$26:$B$55,2,FALSE))","v":"II"},"Mostly effective","Telecommunication s and  contractor ","Line 32.3, Line 54.22, Safe travelling procedure 240-62946386, ET Fleet Policy, OHSAS 18001(4.3.1,4.5.3)"]
[null,"Unsafe driving","causing an accident (Collission, losing control of vehicles)","Safety","possible motor vehicle pile-up (MVA) which may lead to injury or fatality including Public","Awareness raised on dangers of using means of communication while driving, Pool Vehicle Management through Introduction of OBC's, driver training & awareness, apply disciplinary measures for any transgressions to OBC",5,"C","5C",{"$f":"IF(OR(ISBLANK(G29),ISBLANK(H29)),\" \",VLOOKUP(I29,'Risk matrix'!$A$26:$B$55,2,FALSE))","v":"II"},"Mostly effective","Telecommunication s and  contractor ","Line 32.3, Line 54.14, Safe travelling procedure 240-62946386, ET Fleet Policy, OHSAS 18001(4.3.1,4.5.3)"]
[null,"Night driving","Being involved  in an accident (Collission, hitting pedeinstrians, hitting straying animals etc)","Safety","MVA which may lead to injury or fatality including Public"," Awareness on dangers of driving at night, Risk assessment, buddy system.",5,"D","5D",{"$f":"IF(OR(ISBLANK(G30),ISBLANK(H30)),\" \",VLOOKUP(I30,'Risk matrix'!$A$26:$B$55,2,FALSE))","v":"I"},"Mostly effective","Telecommunication s and  contractor ","Line 32.3,  Safe travelling procedure 240-62946386; OHSAS 18001(4.3.1,4.5.3)"]
[null,"Unroadworthy vehicle","Vehicle Breakdown or parts failure","Safety","MVA which may lead to injury or fatality including Public","Pre-trip inspection, vehicle service, Safe vehicle safety specification ( Eskom Vehicle Safety Specification 32-345)",5,"D","5D",{"$f":"IF(OR(ISBLANK(G31),ISBLANK(H31)),\" \",VLOOKUP(I31,'Risk matrix'!$A$26:$B$55,2,FALSE))","v":"I"},"Mostly effective","Telecommunication s and  contractor ","Line 32.3, line 54.10; Procedure 32-95; OHSAS 18001(4.3.1,4.5.3)"]
[null,"Road Works","Vehicle Collision","Safety","MVA which may lead to injury or fatality including Public","Training Defensive driving, Safe driver awareness(obeying traffic rules, Report road works in toolbox talk) , 240-62946386",5,"C","5C",{"$f":"IF(OR(ISBLANK(G32),ISBLANK(H32)),\" \",VLOOKUP(I32,'Risk matrix'!$A$26:$B$55,2,FALSE))","v":"II"},"Mostly effective","Telecommunication s and  contractor ","Line 32.3, Safe travelling procedure 240-62946386;OHSAS 18001(4.3.1,4.5.3) "]
[null,"Driving through a herd of cattle","Damage to vehicle","Safety","Possible damage to vehicle or injury","Staff awareness - allow full herd of cattle to pass across road before driving through",5,"C","5C",{"$f":"IF(OR(ISBLANK(G33),ISBLANK(H33)),\" \",VLOOKUP(I33,'Risk matrix'!$A$26:$B$55,2,FALSE))","v":"II"},"Fully effective","Telecommunication s and  contractor ","Line 32.3; 32-520; OHSAS 18001(4.3.1,4.5.3)"]
[null,"Travelling in areas where there are protests","Loss of control of the vehicle","Safety","Possible damage to vehicle and/or injury/fatality","Safe Driver awareness, protests safety alerts. Sharing protest alerts on possible strike action which enable one to assess the risk. Pre task risk assessment conducted",5,"C","5C",{"$f":"IF(OR(ISBLANK(G34),ISBLANK(H34)),\" \",VLOOKUP(I34,'Risk matrix'!$A$26:$B$55,2,FALSE))","v":"II"},"Mostly effective","Telecommunication s and  contractor ","Line 32.3; 32-520; OHSAS 18001(4.3.1,4.5.3)"]
[null,"Driving below the bridges during flash floods","Loss of control of the vehicle","Safety","Possible damage to vehicle and/or injury/fatality","Awareness raised on hot spot areas",4,"C","4C",{"$f":"IF(OR(ISBLANK(G35),ISBLANK(H35)),\" \",VLOOKUP(I35,'Risk matrix'!$A$26:$B$55,2,FALSE))","v":"II"},"Mostly effective","Telecommunication s and  contractor ","Line 32.3, 32-520; OHSAS 18001(4.3.1,4.5.3)"]
["Movement around and entry in the working environment and carrying out daily ouptputs - During COVID-19 outbreak","Corona Virus Outbreak","Employees contracting the virus leading to reduced productivity or staff atrition","Health","Possible illhealth or death","Lockdown. Essential employees identified and given PPE for protection. Awareness raised on COVID 19",5,"B",{"$f":"CONCATENATE(G36,H36)","v":"5B"},{"$f":"IF(OR(ISBLANK(G36),ISBLANK(H36)),\" \",VLOOKUP(I36,'[2]Risk matrix'!$A$26:$B$55,2,FALSE))","v":"II"},"Mostly ineffective","Responsible Manager","Disaster Management Act 57 of 2002 (updated 2020/03/19)"]
[null,"Poor hygiene practices ","possibility of contracting the disease and spreading it which will in turn lead to productivity decline from fearful and unfit employees","Health","Possible illhealth or death","Awareness raised on the importance of regular handwashing",3,"B",{"$f":"CONCATENATE(G37,H37)","v":"3B"},{"$f":"IF(OR(ISBLANK(G37),ISBLANK(H37)),\" \",VLOOKUP(I37,'[2]Risk matrix'!$A$26:$B$55,2,FALSE))","v":"III"},"Mostly effective","Responsible Manager","Covid 19 control measures protocols"]
[null,"Not maintaining social distancing","possibility of contracting the disease and spreading it which will in turn lead to productivity decline from fearful and unfit employees","Health","Possible illhealth or death","Awareness raised on the importance of social distancing. Employees permited to work from home. Adherence to lockdown managed through work permit system",3,"B",{"$f":"CONCATENATE(G38,H38)","v":"3B"},{"$f":"IF(OR(ISBLANK(G38),ISBLANK(H38)),\" \",VLOOKUP(I38,'[2]Risk matrix'!$A$26:$B$55,2,FALSE))","v":"III"},"Mostly effective","Responsible Manager","Covid 19 control measures protocols"]
[null,"Multiple staff working in overcrowded work areas","Possible spread of infection","Health","Possible illhealth or death","Lockdown measures implemented. Awareness raised on social distancing. ",4,"A",{"$f":"CONCATENATE(G39,H39)","v":"4A"},{"$f":"IF(OR(ISBLANK(G39),ISBLANK(H39)),\" \",VLOOKUP(I39,'[2]Risk matrix'!$A$26:$B$55,2,FALSE))","v":"III"},"Mostly effective","Responsible Manager","Covid 19 control measures protocols"]
[null,"Unhygienic use of breathalisers and biometrics units","Possible spread of infection","Health","Possible illhealth or death","Breatherlyzer testing has been stopped",3,"B",{"$f":"CONCATENATE(G40,H40)","v":"3B"},{"$f":"IF(OR(ISBLANK(G40),ISBLANK(H40)),\" \",VLOOKUP(I40,'[2]Risk matrix'!$A$26:$B$55,2,FALSE))","v":"III"},"Mostly effective","Responsible Manager","Covid 19 control measures protocols"]
{"$rows_left_out":60}
{"sheet":"Consequence rating","index":1,"n_rows":10,"n_cols":3,"rows_kept":10}
[]
[null,null,"Consequence criteria "]
[null,"Consequence rating","Description"]
[null,null,"Health and Safety"]
[null,1,"No injuries or health effects(near misses)"]
[null,2,"First-aid treatment case,  and temporary discomfort case"]
[null,3,"Medical treatment case; occupational disease with reversible/non-permanent effect"]
[null,4,"Lost Time Injury. Irreversible health effects/occupational disease with permanent consequence "]
[null,5,"Fatality or life threatening health effects"]
[null,6,"Multiple fatalities "]

{"sheet":"Likelihood rating","index":2,"n_rows":18,"n_cols":9,"rows_kept":18,"merged":[[1,0,1,5],[2,4,2,5],[4,1,6,1],[4,2,6,2],[4,4,6,4],[4,5,6,5],[7,1,9,1],[7,2,9,2],[7,4,9,4],[7,5,9,5],[10,1,11,1],[10,2,11,2],[10,4,11,4],[10,5,11,5],[12,1,14,1],[12,2,14,2],[12,4,14,4],[12,5,14,5],[15,1,17,1],[15,2,17,2],[15,4,17,4],[15,5,17,5]]}
[]
["Likelihood criteria"]
[null,"Score","Descriptor","Safety","Occupational hygiene"]
[{"$nulls":4},"Exposure","Probability of exceeding OEL"]
[null,"A","Highly unlikely","§  More than a “100 year event” ","Rare (once a year)","No exposure (or exposure < 10% of OEL)"]
[{"$nulls":3},"§  Exceptionally unlikely, even in the long-term future"]
[{"$nulls":3},"§  < 5% probability."]
[null,"B","Unlikely","§  Could occur in “years to decades”","Short periods of time, a few times per day/ intermittent (once in six months, three months, or a month)","Low exposure (< 50% of OEL)"]
[{"$nulls":3},"§  May occur but not anticipated"]
[{"$nulls":3},"§  ≥ 5% and < 20% probability."]
[null,"C","Possible","§  Could occur within “months to years”","Continuous for between one and two hours (often/ weekly)","Moderate exposure (chronic exposure > 50% of OEL or acute exposure ≥ OEL)"]
[{"$nulls":3},"§  May occur shortly but a distinct probability it will not, or ≥ 20% and < 70% probability."]
[null,"D","Likely","§  Could occur within “weeks to months”","Continuous for between two and four hours (frequent/daily)","High exposure (chronic exposure > OEL, or exposure exceeding OEL-STEL)",null,null,"gv g"]
[{"$nulls":3},"§  Balance of probability will occur"]
[{"$nulls":3},"§  ≥ 70% and < 90% probability."]
[null,"E","Unavoidable","§  Could occur within “days to weeks”","Continuous for eight-hour shift","Very high exposure (chronic exposure > 2 x OEL or exposure exceeding OEL-C)"]
[{"$nulls":3},"§  Impact is imminent"]
[{"$nulls":3},"§  ≥ 90% probability."]

{"sheet":"Risk control effectiveness","index":3,"n_rows":8,"n_cols":3,"rows_kept":8,"merged":[[2,1,2,2]]}
[]
[]
[null,"RISK CONTROL EFFECTIVENESS GUIDE"]
[null,"             RCE","Guide"]
[null,"Fully effective","Nothing more to be done except review and monitor the existing controls. Controls are well designed for the risk, are largely preventive and address the root causes. Management believes that they are effective and reliable at all times. Reactive controls only support preventive controls."]
[null,"Mostly effective","Most controls are designed correctly and are in place and effective. Some more work to be done to improve operating effectiveness or management has doubts about operational effectiveness and reliability of the controls."]
[null,"Mostly ineffective","While the design of controls may be largely correct in that they treat most of the root causes of the risk, they are not currently operationally very effective. There may be an over-reliance on reactive controls, or some of the controls do not seem correctly designed in that they do not treat root causes."]
[null,"None","Virtually no credible control. Management has no confidence that any degree of control is being achieved."]

{"sheet":"Risk matrix","index":4,"n_rows":55,"n_cols":15,"rows_kept":55,"merged":[[1,4,1,8],[2,2,7,2],[9,4,9,8],[12,5,12,6],[13,5,13,6],[14,5,14,6],[15,5,15,6],[16,5,16,6]]}
[]
[{"$nulls":4},"RISK MATRIX"]
[null,null,"Consequences",6,"I","I","I","I","I"]
[{"$nulls":3},5,"II","II","II","I","I"]
[{"$nulls":3},4,"III","III","II","I","I"]
[{"$nulls":3},3,"IV","III","II","II","I"]
[{"$nulls":3},2,"IV","IV","III","II","II"]
[{"$nulls":3},1,"IV","IV","III","III","III"]
[{"$nulls":4},"A","B","C","D","E"]
[{"$nulls":4},"Likelihood"]
[]
[]
[{"$nulls":3},"Priority","Risk ranking","Action required"]
[{"$nulls":3},"I","Very high","Immediate action required, and these risks to be captured on IRM system."]
[{"$nulls":3},"II","High","Strong mandatory action required, and these risks to be captured on IRM system."]
[{"$nulls":3},"III","Medium","Action required, possibly at administrative level."]
[{"$nulls":3},"IV","Low","Minor or no action required."]
{"$rows_empty":8}
["1A","IV","1A",{"$f":"VLOOKUP(C26,$A$26:$B$55,2,FALSE)","v":"IV"},null,"Yes","Safety",null,null,"F","I",null,null,"A1","1A"]
["1B","IV","1B","IV",null,"No","Health",null,null,"P","II",null,null,"B1","1B"]
["1C","III","1C","III",{"$nulls":5},"I","III",null,null,"C1","1C"]
["1D","III","1D","III",{"$nulls":5},"Ti","IV",null,null,"D1","1D"]
["2A","IV","2A","IV",{"$nulls":5},"N",{"$nulls":3},"A2","2A"]
["2B","IV","2B","IV",{"$nulls":9},"B2","2B"]
["1E","III","1E","III",{"$nulls":9},"E1","1E"]
["2C","III","2C","III",{"$nulls":9},"C2","2C"]
["2D","II","2D","II",{"$nulls":9},"D2","2D"]
["3A","IV","3A","IV",{"$nulls":9},"A3","3A"]
["3B","III","3B","III",{"$nulls":9},"B3","3B"]
["4A","III","4A","III",{"$nulls":9},"A4","4A"]
["5A","II","5A","II"]
["2E","II","2E","II"]
["3E","I","3E","I"]
["3D","II","3D","II"]
["3C","II","3C","II"]
["4C","II","4C","II"]
["4B","III","4B","III"]
["5B","II","5B","II"]
["4D","I","4D","I"]
["4E","I","4E","I"]
{"$rows_left_out":8}