{"text_format":"3","workbook":"xlsx","n_sheets":3,"sheets":["Licence fee","Resources","Currency"],"not_rendered":{"external_links":9,"defined_names":220},"read":"whole","date_system":"1900"}

{"sheet":"Licence fee","index":0,"n_rows":109,"n_cols":40,"rows_kept":109,"merged":[[2,1,2,6],[26,1,26,7],[26,14,26,32],[28,1,29,1],[34,1,34,10],[34,13,34,16],[35,4,35,6],[36,0,37,0],[36,33,37,33],[38,0,39,0],[38,33,39,33],[88,0,89,0],[88,33,89,33],[90,0,91,0],[90,33,91,33],[92,0,93,0],[92,33,93,33],[94,0,95,0],[94,33,95,33],[96,0,99,0],[96,33,99,33],[100,0,101,0],[100,33,101,33],[102,0,103,0],[104,0,105,0],[104,33,105,33]]}
[null,"Costing : Enterprise Historian"]
[]
[null,"VENDOR NAME"]
[]
[]
[]
[null,"IMPORTANT NOTES"]
[null,"All cells highlighted in GREEN must be completed"]
[null,"Quoted prices MUST be in ZAR, EXCLUDING VAT and ESCALATIONS"]
[]
[null,"Enterprise Historian"]
[null,"Prices MUST be quoted based on the SCOPE provided"]
[null,"Select the currency from the CURRENCY drop-down list in COLUMN \"G\""]
[]
[null,"Capture the applicable Currency, ROE and ROE Published Date on the \"Currency sheet\". "]
[null,"The adjustments for prevailing rates and the basis for future price adjustments will be determined at time of contracting. "]
[null,"Exchange rate variations may not be claimed for the local mark-up in the pricing structure"]
[]
[null,"NB: PROVIDE THE REQUIRED LICENSES, COSTS AND THE ASSOCIATED MAINTENANCE & SUPPORT IN TABLE 2"]
[]
[null,"Provide Maintenance & Support Price Adjustment Formula in COLUMN U"]
[]
[null,"All Prices must be exclusive of VAT"]
[]
[]
[]
[{"$nulls":14},"MAINTENANCE AND SUPPORT"]
[null,null,"DESCRIPTION","YEAR 1","YEAR 2","YEAR 3","YEAR 4","YEAR 5"]
[null,"ENTERPRISE HISTORIAN","License",{"$f":"K107","v":0}]
[null,null,"Maintenance & Support",{"$f":"Q107","v":0},{"$f":"D30","v":0},{"$f":"E30","v":0},{"$f":"F30","v":0},{"$f":"G30","v":0}]
[null,null,"TOTAL",{"$f":"SUM(D29:D30)","v":0},{"$f":"SUM(E29:E30)","v":0},{"$f":"SUM(F29:F30)","v":0},{"$f":"SUM(G29:G30)","v":0},{"$f":"SUM(H29:H30)","v":0}]
[null,null,"GRAND TOTAL",{"$f":"SUM(D31,E31,F31,G31,H31)","v":0}]
[]
[]
[null,"TABLE 2: LICENSES",{"$nulls":11},"ANNUAL MAINTENANCE & SUPPORT"]
[null,"PART NUMBER","DESCRIPTION","TOTAL ESTIMATED QUANTITIES","CURRENCY",null,null,"Unit Price in Nominated Currency","Unit Price in ZAR","Total [Nominated Currency]","Total in ZAR",null,null,"Unit Price in Nominated Currency","Unit Price in ZAR","Total [Nominated Currency]","Total in ZAR",null,"MAINTENANCE %",null,"CONTRACT PRICE ADJUSTMENT"]
[{"$nulls":4},{"$f":"IF(F37=\"\",\"\",IF(F37=\"ZAR\",\"Local\",\"Foreign\"))","v":"Local"},"ZAR",{"$f":"IF(E37=\"\",\"\",IF(E37=\"Foreign\",VLOOKUP(F37,Currency!$E$20:$F$33,2,FALSE),1))","v":{"v":1,"d":"1.00"}},0,{"$f":"H37*$G37","v":0},{"$f":"H37*$D37","v":0},0,null,null,0,{"$f":"N37*$G37","v":0},{"$f":"N37*$D37","v":0},0,null,{"$f":"N37/H37","v":{"$error":"#DIV/0!"}},{"$nulls":20},"DKK"]
[{"$nulls":4},"Local","ZAR",{"$f":"IF(E38=\"\",\"\",IF(E38=\"Foreign\",VLOOKUP(F38,Currency!$E$20:$F$33,2,FALSE),1))","v":{"v":1,"d":"1.00"}},0,{"$f":"H38*$G38","v":0},0,0,null,null,0,{"$f":"N38*$G38","v":0},0,0,null,{"$f":"N38/H38","v":{"$error":"#DIV/0!"}}]
[{"$nulls":4},"Local","ZAR",{"$f":"IF(E39=\"\",\"\",IF(E39=\"Foreign\",VLOOKUP(F39,Currency!$E$20:$F$33,2,FALSE),1))","v":{"v":1,"d":"1.00"}},0,0,0,0,null,null,0,0,0,0,null,{"$f":"N39/H39","v":{"$error":"#DIV/0!"}},{"$nulls":20},"DKK"]
[{"$nulls":4},"Local","ZAR",{"$f":"IF(E40=\"\",\"\",IF(E40=\"Foreign\",VLOOKUP(F40,Currency!$E$20:$F$33,2,FALSE),1))","v":{"v":1,"d":"1.00"}},0,0,0,0,null,null,0,0,0,0,null,{"$error":"#DIV/0!"}]
[{"$nulls":4},"Local","ZAR",{"$f":"IF(E41=\"\",\"\",IF(E41=\"Foreign\",VLOOKUP(F41,Currency!$E$20:$F$33,2,FALSE),1))","v":{"v":1,"d":"1.00"}},0,0,0,0,null,null,0,0,0,0,null,{"$error":"#DIV/0!"}]
[{"$nulls":4},"Local","ZAR",{"$f":"IF(E42=\"\",\"\",IF(E42=\"Foreign\",VLOOKUP(F42,Currency!$E$20:$F$33,2,FALSE),1))","v":{"v":1,"d":"1.00"}},0,0,0,0,null,null,0,0,0,0,null,{"$error":"#DIV/0!"}]
[{"$nulls":4},"Local","ZAR",{"$f":"IF(E43=\"\",\"\",IF(E43=\"Foreign\",VLOOKUP(F43,Currency!$E$20:$F$33,2,FALSE),1))","v":{"v":1,"d":"1.00"}},0,0,0,0,null,null,0,0,0,0,null,{"$error":"#DIV/0!"}]
[{"$nulls":4},"Local","ZAR",{"$f":"IF(E44=\"\",\"\",IF(E44=\"Foreign\",VLOOKUP(F44,Currency!$E$20:$F$33,2,FALSE),1))","v":{"v":1,"d":"1.00"}},0,0,0,0,null,null,0,0,0,0,null,{"$error":"#DIV/0!"}]
[{"$nulls":4},"Local","ZAR",{"$f":"IF(E45=\"\",\"\",IF(E45=\"Foreign\",VLOOKUP(F45,Currency!$E$20:$F$33,2,FALSE),1))","v":{"v":1,"d":"1.00"}},0,0,0,0,null,null,0,0,0,0,null,{"$error":"#DIV/0!"}]
[{"$nulls":4},"Local","ZAR",{"$f":"IF(E46=\"\",\"\",IF(E46=\"Foreign\",VLOOKUP(F46,Currency!$E$20:$F$33,2,FALSE),1))","v":{"v":1,"d":"1.00"}},0,0,0,0,null,null,0,0,0,0,null,{"$error":"#DIV/0!"}]
[{"$nulls":4},"Local","ZAR",{"$f":"IF(E47=\"\",\"\",IF(E47=\"Foreign\",VLOOKUP(F47,Currency!$E$20:$F$33,2,FALSE),1))","v":{"v":1,"d":"1.00"}},0,0,0,0,null,null,0,0,0,0,null,{"$error":"#DIV/0!"}]
[{"$nulls":4},"Local","ZAR",{"$f":"IF(E48=\"\",\"\",IF(E48=\"Foreign\",VLOOKUP(F48,Currency!$E$20:$F$33,2,FALSE),1))","v":{"v":1,"d":"1.00"}},0,0,0,0,null,null,0,0,0,0,null,{"$error":"#DIV/0!"}]
[{"$nulls":4},"Local","ZAR",{"$f":"IF(E49=\"\",\"\",IF(E49=\"Foreign\",VLOOKUP(F49,Currency!$E$20:$F$33,2,FALSE),1))","v":{"v":1,"d":"1.00"}},0,0,0,0,null,null,0,0,0,0,null,{"$error":"#DIV/0!"}]
[{"$nulls":4},"Local","ZAR",{"$f":"IF(E50=\"\",\"\",IF(E50=\"Foreign\",VLOOKUP(F50,Currency!$E$20:$F$33,2,FALSE),1))","v":{"v":1,"d":"1.00"}},0,0,0,0,null,null,0,0,0,0,null,{"$error":"#DIV/0!"}]
[{"$nulls":4},"Local","ZAR",{"$f":"IF(E51=\"\",\"\",IF(E51=\"Foreign\",VLOOKUP(F51,Currency!$E$20:$F$33,2,FALSE),1))","v":{"v":1,"d":"1.00"}},0,0,0,0,null,null,0,0,0,0,null,{"$error":"#DIV/0!"}]
[{"$nulls":4},"Local","ZAR",{"$f":"IF(E52=\"\",\"\",IF(E52=\"Foreign\",VLOOKUP(F52,Currency!$E$20:$F$33,2,FALSE),1))","v":{"v":1,"d":"1.00"}},0,0,0,0,null,null,0,0,0,0,null,{"$error":"#DIV/0!"}]
[{"$nulls":4},"Local","ZAR",{"$f":"IF(E53=\"\",\"\",IF(E53=\"Foreign\",VLOOKUP(F53,Currency!$E$20:$F$33,2,FALSE),1))","v":{"v":1,"d":"1.00"}},0,0,{"$f":"H53*$D53","v":0},0,null,null,0,0,{"$f":"N53*$D53","v":0},0,null,{"$error":"#DIV/0!"}]
[{"$nulls":4},"Local","ZAR",{"$f":"IF(E54=\"\",\"\",IF(E54=\"Foreign\",VLOOKUP(F54,Currency!$E$20:$F$33,2,FALSE),1))","v":{"v":1,"d":"1.00"}},0,0,0,0,null,null,0,0,0,0,null,{"$error":"#DIV/0!"}]
[{"$nulls":4},"Local","ZAR",{"$f":"IF(E55=\"\",\"\",IF(E55=\"Foreign\",VLOOKUP(F55,Currency!$E$20:$F$33,2,FALSE),1))","v":{"v":1,"d":"1.00"}},0,0,0,0,null,null,0,0,0,0,null,{"$error":"#DIV/0!"}]
[{"$nulls":4},"Local","ZAR",{"$f":"IF(E56=\"\",\"\",IF(E56=\"Foreign\",VLOOKUP(F56,Currency!$E$20:$F$33,2,FALSE),1))","v":{"v":1,"d":"1.00"}},0,0,0,0,null,null,0,0,0,0,null,{"$error":"#DIV/0!"}]
[{"$nulls":4},"Local","ZAR",{"$f":"IF(E57=\"\",\"\",IF(E57=\"Foreign\",VLOOKUP(F57,Currency!$E$20:$F$33,2,FALSE),1))","v":{"v":1,"d":"1.00"}},0,0,0,0,null,null,0,0,0,0,null,{"$error":"#DIV/0!"}]
[{"$nulls":4},"Local","ZAR",{"$f":"IF(E58=\"\",\"\",IF(E58=\"Foreign\",VLOOKUP(F58,Currency!$E$20:$F$33,2,FALSE),1))","v":{"v":1,"d":"1.00"}},0,0,0,0,null,null,0,0,0,0,null,{"$error":"#DIV/0!"}]
[{"$nulls":4},"Local","ZAR",{"$f":"IF(E59=\"\",\"\",IF(E59=\"Foreign\",VLOOKUP(F59,Currency!$E$20:$F$33,2,FALSE),1))","v":{"v":1,"d":"1.00"}},0,0,0,0,null,null,0,0,0,0,null,{"$error":"#DIV/0!"}]
[{"$nulls":4},"Local","ZAR",{"$f":"IF(E60=\"\",\"\",IF(E60=\"Foreign\",VLOOKUP(F60,Currency!$E$20:$F$33,2,FALSE),1))","v":{"v":1,"d":"1.00"}},0,0,0,0,null,null,0,0,0,0,null,{"$error":"#DIV/0!"}]
[{"$nulls":4},"Local","ZAR",{"$f":"IF(E61=\"\",\"\",IF(E61=\"Foreign\",VLOOKUP(F61,Currency!$E$20:$F$33,2,FALSE),1))","v":{"v":1,"d":"1.00"}},0,0,0,0,null,null,0,0,0,0,null,{"$error":"#DIV/0!"}]
[{"$nulls":4},"Local","ZAR",{"$f":"IF(E62=\"\",\"\",IF(E62=\"Foreign\",VLOOKUP(F62,Currency!$E$20:$F$33,2,FALSE),1))","v":{"v":1,"d":"1.00"}},0,0,0,0,null,null,0,0,0,0,null,{"$error":"#DIV/0!"}]
[{"$nulls":4},"Local","ZAR",{"$f":"IF(E63=\"\",\"\",IF(E63=\"Foreign\",VLOOKUP(F63,Currency!$E$20:$F$33,2,FALSE),1))","v":{"v":1,"d":"1.00"}},0,0,0,0,null,null,0,0,0,0,null,{"$error":"#DIV/0!"}]
[{"$nulls":4},"Local","ZAR",{"$f":"IF(E64=\"\",\"\",IF(E64=\"Foreign\",VLOOKUP(F64,Currency!$E$20:$F$33,2,FALSE),1))","v":{"v":1,"d":"1.00"}},0,0,0,0,null,null,0,0,0,0,null,{"$error":"#DIV/0!"}]
[{"$nulls":4},"Local","ZAR",{"$f":"IF(E65=\"\",\"\",IF(E65=\"Foreign\",VLOOKUP(F65,Currency!$E$20:$F$33,2,FALSE),1))","v":{"v":1,"d":"1.00"}},0,0,0,0,null,null,0,0,0,0,null,{"$error":"#DIV/0!"}]
[{"$nulls":4},"Local","ZAR",{"$f":"IF(E66=\"\",\"\",IF(E66=\"Foreign\",VLOOKUP(F66,Currency!$E$20:$F$33,2,FALSE),1))","v":{"v":1,"d":"1.00"}},0,0,0,0,null,null,0,0,0,0,null,{"$error":"#DIV/0!"}]
[{"$nulls":4},"Local","ZAR",{"$f":"IF(E67=\"\",\"\",IF(E67=\"Foreign\",VLOOKUP(F67,Currency!$E$20:$F$33,2,FALSE),1))","v":{"v":1,"d":"1.00"}},0,0,0,0,null,null,0,0,0,0,null,{"$error":"#DIV/0!"}]
[{"$nulls":4},"Local","ZAR",{"$f":"IF(E68=\"\",\"\",IF(E68=\"Foreign\",VLOOKUP(F68,Currency!$E$20:$F$33,2,FALSE),1))","v":{"v":1,"d":"1.00"}},0,0,0,0,null,null,0,0,0,0,null,{"$error":"#DIV/0!"}]
[{"$nulls":4},"Local","ZAR",{"$f":"IF(E69=\"\",\"\",IF(E69=\"Foreign\",VLOOKUP(F69,Currency!$E$20:$F$33,2,FALSE),1))","v":{"v":1,"d":"1.00"}},0,0,0,0,null,null,0,0,0,0,null,{"$error":"#DIV/0!"}]
[{"$nulls":4},"Local","ZAR",{"$f":"IF(E70=\"\",\"\",IF(E70=\"Foreign\",VLOOKUP(F70,Currency!$E$20:$F$33,2,FALSE),1))","v":{"v":1,"d":"1.00"}},0,0,0,0,null,null,0,0,0,0,null,{"$error":"#DIV/0!"}]
[{"$nulls":4},"Local","ZAR",{"$f":"IF(E71=\"\",\"\",IF(E71=\"Foreign\",VLOOKUP(F71,Currency!$E$20:$F$33,2,FALSE),1))","v":{"v":1,"d":"1.00"}},0,0,0,0,null,null,0,0,0,0,null,{"$error":"#DIV/0!"}]
[{"$nulls":4},"Local","ZAR",{"$f":"IF(E72=\"\",\"\",IF(E72=\"Foreign\",VLOOKUP(F72,Currency!$E$20:$F$33,2,FALSE),1))","v":{"v":1,"d":"1.00"}},0,0,0,0,null,null,0,0,0,0,null,{"$error":"#DIV/0!"}]
[{"$nulls":4},"Local","ZAR",{"$f":"IF(E73=\"\",\"\",IF(E73=\"Foreign\",VLOOKUP(F73,Currency!$E$20:$F$33,2,FALSE),1))","v":{"v":1,"d":"1.00"}},0,0,0,0,null,null,0,0,0,0,null,{"$error":"#DIV/0!"}]
[{"$nulls":4},"Local","ZAR",{"$f":"IF(E74=\"\",\"\",IF(E74=\"Foreign\",VLOOKUP(F74,Currency!$E$20:$F$33,2,FALSE),1))","v":{"v":1,"d":"1.00"}},0,0,0,0,null,null,0,0,0,0,null,{"$error":"#DIV/0!"}]
[{"$nulls":4},"Local","ZAR",{"$f":"IF(E75=\"\",\"\",IF(E75=\"Foreign\",VLOOKUP(F75,Currency!$E$20:$F$33,2,FALSE),1))","v":{"v":1,"d":"1.00"}},0,0,0,0,null,null,0,0,0,0,null,{"$error":"#DIV/0!"}]
[{"$nulls":4},"Local","ZAR",{"$f":"IF(E76=\"\",\"\",IF(E76=\"Foreign\",VLOOKUP(F76,Currency!$E$20:$F$33,2,FALSE),1))","v":{"v":1,"d":"1.00"}},0,0,0,0,null,null,0,0,0,0,null,{"$error":"#DIV/0!"}]
[{"$nulls":4},"Local","ZAR",{"$f":"IF(E77=\"\",\"\",IF(E77=\"Foreign\",VLOOKUP(F77,Currency!$E$20:$F$33,2,FALSE),1))","v":{"v":1,"d":"1.00"}},0,0,0,0,null,null,0,0,0,0,null,{"$error":"#DIV/0!"}]
[{"$nulls":4},"Local","ZAR",{"$f":"IF(E78=\"\",\"\",IF(E78=\"Foreign\",VLOOKUP(F78,Currency!$E$20:$F$33,2,FALSE),1))","v":{"v":1,"d":"1.00"}},0,0,0,0,null,null,0,0,0,0,null,{"$error":"#DIV/0!"}]
[{"$nulls":4},"Local","ZAR",{"$f":"IF(E79=\"\",\"\",IF(E79=\"Foreign\",VLOOKUP(F79,Currency!$E$20:$F$33,2,FALSE),1))","v":{"v":1,"d":"1.00"}},0,0,0,0,null,null,0,0,0,0,null,{"$error":"#DIV/0!"}]
[{"$nulls":4},"Local","ZAR",{"$f":"IF(E80=\"\",\"\",IF(E80=\"Foreign\",VLOOKUP(F80,Currency!$E$20:$F$33,2,FALSE),1))","v":{"v":1,"d":"1.00"}},0,0,0,0,null,null,0,0,0,0,null,{"$error":"#DIV/0!"}]
{"$rows_left_out":30}
{"sheet":"Resources","index":1,"n_rows":125,"n_cols":40,"rows_kept":125,"merged":[[2,2,2,7],[26,15,26,38],[27,6,27,8],[27,9,27,12],[27,16,27,39],[28,6,28,8],[29,1,36,1],[29,2,36,2],[38,1,41,1],[38,2,41,2],[45,2,45,6],[47,2,52,2],[53,2,58,2],[59,2,64,2],[65,2,70,2],[71,2,77,2],[78,2,83,2],[84,2,89,2],[90,2,95,2],[96,2,101,2],[104,9,104,32],[105,5,105,7],[105,9,105,12],[105,14,105,17],[105,19,105,22],[105,24,105,27],[105,29,105,32],[106,5,106,7],[108,1,111,1],[108,2,111,2],[112,1,113,1],[112,2,113,2]]}
[null,null,"Pricing Schedule : Enterprise Historian"]
[]
[null,null,"VENDOR NAME"]
[]
[]
[]
[null,null,"IMPORTANT NOTES"]
[null,null,"All cells highlighted in GREEN must be completed"]
[null,null,"Quoted prices MUST be in ZAR, EXCLUDING VAT and ESCALATIONS"]
[]
[null,null,"Enterprise Historian"]
[null,null,"Prices MUST be quoted based on the SCOPE provided"]
[null,null,"Estimated quantities are based on the required number of Licenses"]
[null,null,"Select the currency from the CURRENCY drop-down list in COLUMN \"H\""]
[]
[null,null,"Capture the applicable Currency, ROE and ROE Published Date on the \"Currency sheet\". "]
[null,null,"The adjustments for prevailing rates and the basis for future price adjustments will be determined at time of contracting. "]
[null,null,"Exchange rate variations may not be claimed for the local mark-up in the pricing structure"]
[]
[null,null,"NB: Provide details on the CONTRACT PRICE ADJUSTMENT in Column O for the Implementation phase and Column AI for the Maintenance phase. "]
[null,null,"Provide Cash-Flow projections for the Solution Implementation phase"]
[null,null,"Provide the Detailed Resource plan for the Implementation phase in TABLE 1: RESOURCES FOR IMPLEMENTATION"]
[]
[null,null,"All Prices must be exclusive of VAT"]
[]
[]
[]
[null,null," ",{"$nulls":6},"SOLUTION IMPLEMENTATION",{"$nulls":6},"CASH FLOW PROJECTIONS"]
[null,"Item Number","Category","Description","Total Estimated Quantity","Unit charge","CURRENCY",null,null,"Unit Price in Nominated Currency","Unit Price in ZAR","Total [Nominated Currency]","Total in ZAR",null,"CONTRACT PRICE ADJUSTMENT",null,"Month 1","Month 2","Month 3","Month 4","Month 5","Month 6","Month 7","Month 8","Month 9","Month 10","Month 11","Month 12","Month 13","Month 14","Month 15","Month 16","Month 17","Month 18","Month 19","Month 20","Month 21","Month 22","Month 23","Month 24"]
[null,1,"Solution Implementation","Infrastructure Provisioning and Configuration",1,"sum",{"$f":"IF(H30=\"\",\"\",IF(H30=\"ZAR\",\"Local\",\"Foreign\"))","v":"Local"},"ZAR",{"$f":"IF(G30=\"\",\"\",IF(G30=\"Foreign\",VLOOKUP(H30,[9]Currency!$E$20:$F$33,2,FALSE),1))","v":{"v":1,"d":"1.00"}},0,{"$f":"J30*$I30","v":0},{"$f":"J30*$E30","v":0},{"$f":"H53","v":0},{"$nulls":3},0,0,0,0,0,0,0,0,0,0,0,0,0,0,0,0,0,0,0,0,0,0,0,0]
[{"$nulls":3},"Installation of Enterprise Historian components",1,"sum","Local","ZAR",{"$f":"IF(G31=\"\",\"\",IF(G31=\"Foreign\",VLOOKUP(H31,[9]Currency!$E$20:$F$33,2,FALSE),1))","v":{"v":1,"d":"1.00"}},0,0,0,{"$f":"H59","v":0},{"$nulls":3},0,0,0,0,0,0,0,0,0,0,0,0,0,0,0,0,0,0,0,0,0,0,0,0]
[{"$nulls":3},"Installation of data collectors",1,"sum","Local","ZAR",{"$f":"IF(G32=\"\",\"\",IF(G32=\"Foreign\",VLOOKUP(H32,[9]Currency!$E$20:$F$33,2,FALSE),1))","v":{"v":1,"d":"1.00"}},0,0,0,{"$f":"H65","v":0},{"$nulls":3},0,0,0,0,0,0,0,0,0,0,0,0,0,0,0,0,0,0,0,0,0,0,0,0]
[{"$nulls":3},"Migration of eDNA data to PI",1,"sum","Local","ZAR",{"$f":"IF(G33=\"\",\"\",IF(G33=\"Foreign\",VLOOKUP(H33,[9]Currency!$E$20:$F$33,2,FALSE),1))","v":{"v":1,"d":"1.00"}},0,0,0,{"$f":"H71","v":0},{"$nulls":3},0,0,0,0,0,0,0,0,0,0,0,0,0,0,0,0,0,0,0,0,0,0,0,0]
[{"$nulls":3},"Enterprise Historian Interfaces (Integration)",1,"sum","Local","ZAR",{"$f":"IF(G34=\"\",\"\",IF(G34=\"Foreign\",VLOOKUP(H34,[9]Currency!$E$20:$F$33,2,FALSE),1))","v":{"v":1,"d":"1.00"}},0,0,0,{"$f":"H78","v":0},{"$nulls":3},0,0,0,0,0,0,0,0,0,0,0,0,0,0,0,0,0,0,0,0,0,0,0,0]
[{"$nulls":3},"Testing and Bug fixes",1,"sum","Local","ZAR",{"$f":"IF(G35=\"\",\"\",IF(G35=\"Foreign\",VLOOKUP(H35,[9]Currency!$E$20:$F$33,2,FALSE),1))","v":{"v":1,"d":"1.00"}},0,0,0,{"$f":"H90","v":0},{"$nulls":3},0,0,0,0,0,0,0,0,0,0,0,0,0,0,0,0,0,0,0,0,0,0,0,0]
[{"$nulls":3},"Deployment",1,"sum","Local","ZAR",{"$f":"IF(G36=\"\",\"\",IF(G36=\"Foreign\",VLOOKUP(H36,[9]Currency!$E$20:$F$33,2,FALSE),1))","v":{"v":1,"d":"1.00"}},0,0,0,{"$f":"H96","v":0},{"$nulls":3},0,0,0,0,0,0,0,0,0,0,0,0,0,0,0,0,0,0,0,0,0,0,0,0]
[{"$nulls":3},"Stabilisation & Go-Live Support",1,"sum","Local","ZAR",{"$f":"IF(G37=\"\",\"\",IF(G37=\"Foreign\",VLOOKUP(H37,[9]Currency!$E$20:$F$33,2,FALSE),1))","v":{"v":1,"d":"1.00"}},0,0,0,{"$f":"H102","v":0},{"$nulls":3},0,0,0,0,0,0,0,0,0,0,0,0,0,0,0,0,0,0,0,0,0,0,0,0]
[null,2,"Project Management","Project Management",1,"sum","Local","ZAR",{"$f":"IF(G38=\"\",\"\",IF(G38=\"Foreign\",VLOOKUP(H38,[9]Currency!$E$20:$F$33,2,FALSE),1))","v":{"v":1,"d":"1.00"}},0,0,0,0,{"$nulls":3},0,0,0,0,0,0,0,0,0,0,0,0,0,0,0,0,0,0,0,0,0,0,0,0]
[null,3,"Training","System user",1,"sum","Local","ZAR",{"$f":"IF(G39=\"\",\"\",IF(G39=\"Foreign\",VLOOKUP(H39,[9]Currency!$E$20:$F$33,2,FALSE),1))","v":{"v":1,"d":"1.00"}},0,0,0,0,{"$nulls":3},0,0,0,0,0,0,0,0,0,0,0,0,0,0,0,0,0,0,0,0,0,0,0,0]
[{"$nulls":3},"System Administrator",1,"sum","Local","ZAR",{"$f":"IF(G40=\"\",\"\",IF(G40=\"Foreign\",VLOOKUP(H40,[9]Currency!$E$20:$F$33,2,FALSE),1))","v":{"v":1,"d":"1.00"}},0,0,0,0]
[{"$nulls":3},"Train the Trainer (Including User Manuals)",1,"sum","Local","ZAR",{"$f":"IF(G41=\"\",\"\",IF(G41=\"Foreign\",VLOOKUP(H41,[9]Currency!$E$20:$F$33,2,FALSE),1))","v":{"v":1,"d":"1.00"}},0,0,0,0]
[{"$nulls":3},"Skills Transfer",1,"sum","Local","ZAR",{"$f":"IF(G42=\"\",\"\",IF(G42=\"Foreign\",VLOOKUP(H42,[9]Currency!$E$20:$F$33,2,FALSE),1))","v":{"v":1,"d":"1.00"}},0,0,0,{"$f":"K42*$E42","v":0},{"$nulls":3},0,0,0,0,0,0,0,0,0,0,0,0,0,0,0,0,0,0,0,0,0,0,0,0]
[null,null,"Total ",{"$nulls":9},{"$f":"SUM(M30:M42)","v":0},{"$nulls":3},{"$f":"SUM(Q30:Q42)","v":0},0,0,0,0,0,0,0,0,0,0,0,0,0,0,0,0,0,0,0,0,0,0,0]
[]
[]
[null,null,"TABLE 1: RESOURCES FOR IMPLEMENTATION"]
[null,null,"Stage","Skill","No. of Hours","Hourly Rate","Total"]
[null,null,"Infrastructure Provisioning and Configuration","Integration Architect",0,0,{"$f":"F48*E48","v":0}]
[{"$nulls":3},"Solution Architect",0,0,0]
[{"$nulls":3},"Technical Architect",0,0,0]
[{"$nulls":3},"<Please specify>",0,0,0]
[{"$nulls":3},"<Please specify>",0,0,0]
[{"$nulls":3},"<Please specify>",0,0,0,{"$f":"SUM(G48:G53)","v":0}]
[null,null,"Installation of Enterprise Historian components","Implementation Specialists",0,0,0]
[{"$nulls":3},"Technical Application Specialist",0,0,0]
[{"$nulls":3},"Data Engineers",0,0,0]
[{"$nulls":3},"<Please specify>",0,0,0]
[{"$nulls":3},"<Please specify>",0,0,0]
[{"$nulls":3},"<Please specify>",0,0,0,{"$f":"SUM(G54:G59)","v":0}]
[null,null,"Installation of data collectors","Application Engineer",0,0,0]
[{"$nulls":3},"Implementation Specialists"]
[{"$nulls":3},"Technical Application Specialist",0,0,{"$f":"F62*E62","v":0}]
[{"$nulls":3},"<Please specify>",0,0,0]
[{"$nulls":3},"<Please specify>",0,0,0]
[{"$nulls":3},"<Please specify>",0,0,0,{"$f":"SUM(G60:G65)","v":0}]
[null,null,"Migration of eDNA data to PI","eDNA System and Process Engineer",0,0,0]
[{"$nulls":3},"Technical Application Specialist",0,0,0]
[{"$nulls":3},"Data Engineers",0,0,0]
[{"$nulls":3},"<Please specify>",0,0,0]
[{"$nulls":3},"<Please specify>",0,0,0]
[{"$nulls":3},"<Please specify>",0,0,0,{"$f":"SUM(G66:G71)","v":0}]
[null,null,"Enterprise Historian Interfaces","Integration Architect",0,0,0]
[{"$nulls":3},"Technical Application Specialist",0,0,0]
[{"$nulls":3},"Application Developer",0,0,0]
[{"$nulls":3},"Data Engineers",0,0,0]
[{"$nulls":3},"<Please specify>",0,0,0]
[{"$nulls":3},"<Please specify>",0,0,0]
[{"$nulls":3},"<Please specify>",0,0,0,{"$f":"SUM(G72:G78)","v":0}]
[{"$nulls":3},"Integration Architect",0,0,0]
[{"$nulls":3},"Technical Application Specialist",0,0,0]
{"$rows_left_out":46}
{"sheet":"Currency","index":2,"n_rows":33,"n_cols":8,"rows_kept":33,"merged":[[1,1,1,5],[6,2,6,7],[7,1,9,1],[7,2,7,7],[7,15,7,20],[8,2,8,7],[9,2,9,7],[10,2,10,7],[11,2,11,7],[12,1,14,1],[12,2,12,7],[13,2,13,7],[14,2,14,7],[17,2,17,7]]}
[]
[null,{"$f":"#REF!","v":{"$error":"#REF!"}}]
[]
[null,"EXCHANGE RATES FOR MULTIPLE CURRENCIES"]
[]
[null,"NOTES:"]
[null,1,"The table below needs to be completed if the Employer will be exposed to any currency fluctuation as stipulated in Secondary Clause X3.  For conversion of the foreign portions to Rand, please use the South African Reserve Bank's (SARB) exchange rate at 12:00 on the day of advertisement of the bid.  This is in terms of the Preferential Procurement Policy Framework Act (PPPFA) with which the Employer has to comply.\nNB: Tenderers must submit proof of the SARB rate(s) of exchange used  "]
[null,2,"The following URL (electronic route) is to be followed to access the relevant SARB rates on their web pages:\n"]
[null,null,"www.resbank.co.za"]
[null,null,"-  Select Research\n-  Then select Rates\n-  Click on \"Select historical exchange rates and other interest rates\"\n-  Clicking on the exchange rate in the following page opens the daily rates per currency and SA Rand"]
[null,3,"The Employer deals only in the currencies listed below unless other currencies are specifically approved for this tender.  Kindly notify the Employer of any currency that the tenderer intends to use, but is not stipulated in the table, to consider sanctioning such currency.  Sufficient time must be allowed for the assessment and to respond to such request.  The onus is on the tenderer to submit a bid with approved currencies"]
[null,4,"The format in which the exchange rate must be inserted in the table is:  1 (One) Foreign Currency = R Amount  (i.e. the Rand amount for one of each foreign currency applicable).  Exchange rates must be rounded to 4 decimals\n\nNB :  Only the USD/ZAR, GBP/ZAR and EUR/ZAR are published in this way on the SARB web pages above.  The Rand rate with the other currencies must be inverted (1/Foreign Currency Rate) in order to list it in the required format in the table below\n"]
[null,5,"All information in the table below must conform with all other equivalent information in the offer. "]
[null,null,"Payment in terms of Payment Method 2  is considered as a \"foreign payment\" although it will be effected in South African Rand. However, amounts for  \"F.O.R. Price-Goods supplied from Imported Items\", are NOT considered as \"foreign payments\""]
[null,null,"If more than one payment method apply for a currency, the Tenderer must request an additional row be inserted in the table in order to split the values and identify the relevant method.   "]
[]
[]
[null,null,"MULTIPLE CURRENCIES"]
[null,null,"No","Currency Description","Code","Exchange Rate Currency 1,00 =","Date Published","Source"]
[null,null,1,"Australian Dollar","AUD"]
[null,null,2,"Canadian Dollar","CAN"]
[null,null,3,"Swiss Franc","CHF"]
[null,null,4,"Danish Krone","DKK"]
[null,null,5,"European Currency","EUR"]
[null,null,6,"British Pound","GBP"]
[null,null,7,"Hong Kong Dollar","HKD"]
[null,null,8,"Japanese Yen","JPY"]
[null,null,9,"Norwegian Krone","NOK"]
[null,null,10,"New Zealand Dollar","NZD"]
[null,null,11,"Swedish Krone","SEK"]
[null,null,12,"Singapore Dollar","SGD"]
[null,null,13,"United States Dollar","USD"]
[null,null,14,"South African Rand","ZAR",{"v":1,"d":"R 1.000000"}]