{"text_format":"3","workbook":"xlsx","n_sheets":14,"sheets":["Cover Sheet","E2994GXPOU Pump Data Addendum","Technical Clarifications","Q&As","Ankerlig - OCGT","Ankerlig - GAS1","Critical Spares","Drakensberg","Gariep","Gourikwa","Ingula P Station","Palmiet","Vanderkloof","Catalogue_Lookup"],"not_rendered":{"defined_names":1},"read":"whole","date_system":"1900"}

{"sheet":"Cover Sheet","index":0,"n_rows":53,"n_cols":2,"rows_kept":53,"merged":[[0,0,0,5],[1,0,1,5],[2,0,2,5],[3,0,3,5],[16,0,16,5],[17,0,17,5],[18,0,18,5],[19,0,19,5],[20,0,20,5],[21,0,21,5],[22,0,22,5],[23,0,23,5],[24,0,24,5],[25,0,25,5],[26,0,26,5],[27,0,27,5],[28,0,28,5],[29,0,29,5],[30,0,30,5],[31,0,31,5],[32,0,32,5],[33,0,33,5],[35,0,35,5],[51,0,51,5],[52,0,52,5]]}
["PUMP DATA PACKAGE - TENDER ADDENDUM"]
["TENDER E2994GXPOU"]
["SUPPLY AND DELIVERY OF PUMPS FOR 5 YEARS AT PEAKING OPERATING UNIT"]
["Contract Period: Five (5) Years on an 'As and When Required' Basis"]
[]
["KEY TENDER DATES:"]
{"$rows_left_out":48}
{"sheet":"E2994GXPOU Pump Data Addendum","index":1,"n_rows":106,"n_cols":28,"rows_kept":106,"merged":[[0,0,0,24],[0,26,0,29],[2,0,2,24],[2,27,2,29],[3,27,3,29],[4,27,4,29],[5,27,5,29],[6,27,6,29],[7,27,7,29],[8,27,8,29],[9,27,9,29],[10,27,10,29]]}
[{"$nulls":26},"COLOR LEGEND"]
[]
[{"$nulls":27},"Missing Data"]
["Item of requisition","Material","Short Text","Storage Location","Full Description","OEM / Manufacturer","Pump Type","Size","Capacity / Flow","Head","Speed (RPM)","Stage","Body / Casing Material","Impeller Material","Driver / Motor Details","Connection Type","Seal / Packing Type","Medium / Application","Operating Temperature","Pressure / Rating","Reference / Part No.","NPSH","Mounting","Special Requirements","Supplier Comment",null,null,"Ankerlig"]
["10","0177401","PUMP RTRY:GEAR;90 MM;400 L/MIN;960 RPM","Drakensberg",{"$f":"IFERROR(VLOOKUP(TEXT(B5,\"0000000\"),Catalogue_Lookup!$A:$B,2,FALSE),\"\")","v":"PUMP, ROTARY: TYPE: GEAR; PORT SIZE: 90 MM; CAPACITY: 400 L/MIN; SPEED: 960 RPM; RATING: 490 KPA; REFERENCE NO: K6Q700082; DRIVER 380 VAC 15.5 A 3PH 50 HZ 7.5 KW"},null,"GEAR","90 MM","400 L/MIN",null,"960 RPM",{"$nulls":3},"7.5 KW; 380 VAC; 15.5 A",{"$nulls":4},"490 KPA","K6Q700082",{"$nulls":6},"Critical Spares"]
["20","0239820","ASSY:LUBE OIL PUMP;DIA 158 MM","Critical Spares",{"$f":"IFERROR(VLOOKUP(TEXT(B6,\"0000000\"),Catalogue_Lookup!$A:$B,2,FALSE),\"\")","v":"ASSEMBLY: TYPE: LUBE OIL PUMP; DIMENSIONS: DIA 158 MM; SUPPL P/N: NSS V50-160; REFERENCE NO: W-69-T-1330-GL112; 7045803; SPEED 2100 RPM, NSPH 1.6 M"},null,"LUBE OIL",{"$nulls":3},"2100 RPM, NSPH 1.6 M",{"$nulls":9},"NSS V50-160; W-69-T-1330-GL112",{"$nulls":6},"Drakensberg"]
{"$rows_left_out":101}
{"sheet":"Technical Clarifications","index":2,"n_rows":20,"n_cols":6,"rows_kept":20,"merged":[[0,0,0,5],[1,0,1,5],[2,0,2,5],[3,0,3,5],[4,0,4,5],[5,1,5,5],[6,1,6,4],[7,1,7,4],[8,1,8,4],[9,1,9,4],[10,1,10,4],[11,0,11,5],[19,0,19,4]]}
["TECHNICAL CLARIFICATIONS"]
["TENDER E2994GXPOU"]
["SUPPLY AND DELIVERY OF PUMPS FOR 5 YEARS AT PEAKING OPERATING UNIT"]
["This sheet records technical clarifications and queries. Tenderers must read this in conjunction with the Scope of Work and NEC Contract documents."]
["IMPORTANT TENDER CLAUSES"]
["Clause Reference","Description"]
{"$rows_left_out":15}
{"sheet":"Q&As","index":3,"n_rows":0,"n_cols":0,"rows_kept":0}

{"sheet":"Ankerlig - OCGT","index":4,"n_rows":7,"n_cols":25,"rows_kept":7,"merged":[[0,0,0,23],[1,0,1,24]]}
[]
[]
["Item of requisition","Material","Short Text","Storage Location","Full Description","OEM / Manufacturer","Pump Type","Size","Capacity / Flow","Head","Speed (RPM)","Stage","Body / Casing Material","Impeller Material","Driver / Motor Details","Connection Type","Seal / Packing Type","Medium / Application","Operating Temperature","Pressure / Rating","Reference / Part No.","NPSH","Mounting","Special Requirements","Supplier Comment"]
[40,553136,"PUMP:PERISTALLIC DRAIN;DN4/6;300 CM3/HR","Ankerlig - OCGT","PUMP: TYPE: PERISTALLIC DRAIN; SIZE: DN4/6; CAPACITY: 300 CM3/HR; SPEED: 5 RPM; RATING: 200-2200 MBAR; DRIVER: ELECTRICAL MOTOR; SPECIFICATION: EN61010/50081/50082; POTENTIAL: 230 VAC; APPLICATION: OEMS CONDENSOR; MANUF P/N: SR25.2-W(01P1307); ENCLOSURE RATING: IP52; TEMP RATING: MAX 60 DEG C; TUBE CONNECTIONS: DN4/6 MM; M AND C; 230 VAC WITH CONNECTION TERMINALS FOR SURFACE AND WALL MOUNTING; IP10 EN60529; REPLACING SR25.1 P/N1P1000","M&C TechGroup","POSITIVE DISPLACEMENT PERISTALTIC","DN4/6 MM","300 CM3/HR","N/A","5 RPM","N/A",null,"N/A","ELECTRICAL MOTOR; 230 VAC","PVDF wetted connections","N/A","Gas cooler Condensate fluid","MAX 60 DEG C","200-2200 MBAR","SR25.2-W(01P1307)","N/A","Wall/Panel mount","The offered equipment shall be a peristaltic condensate drainage pump fully interchangeable with M&C SR25.2-W (Part No. 01P1307) installed on CEMS and sample gas conditioning equipment"]
[60,568041,"PUMP:HEAD PERISTALTIC;4 MM;300 CM3/HR;5","Ankerlig - OCGT","PUMP: TYPE: HEAD PERISTALTIC; SIZE: 4 MM; CAPACITY: 300 CM3/HR; SPEED: 5 RPM; RATING: 1 KPA; DRIVER: ELECTRIC MOTOR; CASING MATERIAL: PLASTIC; MANUF P/N: 90P1030; USED ON CEMS SYSTEM","ABB/M&C","PERISTALTIC PUMP HEAD","4 MM tubing","300 CM3/HR","N/A","5 RPM","N/A","PLASTIC","N/A","ELECTRIC MOTOR 230VAC ",{"$nulls":4},"1 KPA","90P1030",null,null,"The supplier shall confirm compatibility with the SR25.1 peristaltic pump where 90P1030 is offered as a replacement pump head."]
[80,570352,"PUMP:PISTON;1 IN;59.4 L/MIN;1500/3300","Ankerlig - OCGT","PUMP: TYPE: PISTON; SIZE: 1 IN; CAPACITY: 59.4 L/MIN; SPEED: 1500/3300 RPM; RATING: 350 BAR; DRIVER: MOTOR; SPECIFICATION: A10 VS/018/31; APPLICATION: HYDRAULIC OIL SKID; MANUF P/N: A10 VS0 18; REFERENCE NO: R910949268","Rexroth","AXIAL PISTON PUMP","1 IN","59.4 L/MIN","350 bar","1500/3300 RPM","N/A",null,null,"MOTOR; 10 V",null,null,"HYDRAULIC OIL",null,"350 BAR","Model: A10 VS0 18; Ref: R910949268"]
{"$rows_left_out":2}
{"sheet":"Ankerlig - GAS1","index":5,"n_rows":4,"n_cols":25,"rows_kept":4,"merged":[[0,0,0,23],[1,0,1,24]]}
[]
[]
["Item of requisition","Material","Short Text","Storage Location","Full Description","OEM / Manufacturer","Pump Type","Size","Capacity / Flow","Head","Speed (RPM)","Stage","Body / Casing Material","Impeller Material","Driver / Motor Details","Connection Type","Seal / Packing Type","Medium / Application","Operating Temperature","Pressure / Rating","Reference / Part No.","NPSH","Mounting","Special Requirements","Supplier Comment"]
[590,684709,"PUMP:DOSING;0-10 BAR;0-10 BAR, 11 WATTS","Ankerlig - GAS1","PUMP: TYPE: DOSING; SIZE: 0-10 BAR; CAPACITY: 0-10 BAR, 11 WATTS; SPEED: VARIABLE; RATING: 10 BAR, FLOW RATE 3 L/HOUR; DRIVER: INCLUDED; SPECIFICATION: ISO; POTENTIAL: 220-240 VAC; CASING MATERIAL: PVC; APPLICATION: DOSING; SUPPL P/N: 208-3.0-10000","Grundfos/Alldos","Diaphragm Dosing","0-10 BAR","3l/h","10 bar","VARIABLE",null,"PVC",null,"INCLUDED; 240 VAC","Hose compression fitting, DN 4",null,"Anti Scaling Dosing",null,"10 BAR, FLOW RATE 3 L/HOUR","Primus M208-3-10000"]

{"sheet":"Critical Spares","index":6,"n_rows":6,"n_cols":25,"rows_kept":6,"merged":[[0,0,0,23],[1,0,1,24]]}
[]
[]
["Item of requisition","Material","Short Text","Storage Location","Full Description","OEM / Manufacturer","Pump Type","Size","Capacity / Flow","Head","Speed (RPM)","Stage","Body / Casing Material","Impeller Material","Driver / Motor Details","Connection Type","Seal / Packing Type","Medium / Application","Operating Temperature","Pressure / Rating","Reference / Part No.","NPSH","Mounting","Special Requirements","Supplier Comment"]
[20,239820,"ASSY:LUBE OIL PUMP;DIA 158 MM","Critical Spares","ASSEMBLY: TYPE: LUBE OIL PUMP; DIMENSIONS: DIA 158 MM; SUPPL P/N: NSS V50-160; REFERENCE NO: W-69-T-1330-GL112; 7045803; SPEED 2100 RPM, NSPH 1.6 M",null,"LUBE OIL",{"$nulls":3},"2100 RPM, NSPH 1.6 M",{"$nulls":9},"NSS V50-160; W-69-T-1330-GL112"]
[30,239821,"ASSY:LUBE OIL PUMP;DIA 230 MM","Critical Spares","ASSEMBLY: TYPE: LUBE OIL PUMP; DIMENSIONS: DIA 230 MM; SUPPL P/N: VSS V65-250; REFERENCE NO: 7045802; W-69-T-1330/200L; SPEED 2900 RPM",null,"LUBE OIL",{"$nulls":3},"2900 RPM",{"$nulls":9},"VSS V65-250; 7045802"]
[720,646932,"PUMP:HAND;3/4 IN;VARIABLE;0-100 PCT;PN10","Critical Spares","PUMP: TYPE: HAND; SIZE: 3/4 IN; CAPACITY: VARIABLE; SPEED: 0-100 PCT; RATING: PN10; DRIVER: HAND OPERATED; SPECIFICATION: ISO 9001; CASING MATERIAL: CI; APPLICATION: INLET VALVE CONTROL",null,"HAND","3/4 IN","VARIABLE",null,"0-100 PCT",null,"CI",null,"HAND OPERATED",null,null,"INLET VALVE CONTROL",null,"PN10"]
{"$rows_left_out":1}
{"sheet":"Drakensberg","index":7,"n_rows":32,"n_cols":25,"rows_kept":32,"merged":[[0,0,0,23],[1,0,1,24]]}
[]
[]
["Item of requisition","Material","Short Text","Storage Location","Full Description","OEM / Manufacturer","Pump Type","Size","Capacity / Flow","Head","Speed (RPM)","Stage","Body / Casing Material","Impeller Material","Driver / Motor Details","Connection Type","Seal / Packing Type","Medium / Application","Operating Temperature","Pressure / Rating","Reference / Part No.","NPSH","Mounting","Special Requirements","Supplier Comment"]
[10,177401,"PUMP RTRY:GEAR;90 MM;400 L/MIN;960 RPM","Drakensberg","PUMP, ROTARY: TYPE: GEAR; PORT SIZE: 90 MM; CAPACITY: 400 L/MIN; SPEED: 960 RPM; RATING: 490 KPA; REFERENCE NO: K6Q700082; DRIVER 380 VAC 15.5 A 3PH 50 HZ 7.5 KW","VIKING/ALBANY PUMPS","GEAR","90 MM","400 L/MIN","58.8M","960 RPM","N/A","Cast Iron (ASTM A48 Class 30 / EN-GJL-250 or equivalent)","N/A","7.5 KW; 380 VAC; 15.5 A","FLANGES","SINGLE MECHANICAL SEAL","OIL","120-150 Deg","490 KPA","K6Q700082"," ","HORIZONTAL","N/A"," "]
[110,764619,"PUMP:CENTRIFUGAL;BS2400.402 HT243 ACRE","Drakensberg","PUMP: TYPE: CENTRIFUGAL; SIZE: BS2400.402 HT243 ACRE; CAPACITY: 25 L/S; SPEED: 2960 RPM; RATING: 90 KW , 380V, 155A ACRE; REFERENCE NO: BS2400.402 HT243","ACRE","CENTRIFUGAL","BS2400.402 HT243 ACRE","25 L/S","60-80M","2960 RPM",1,"CAST IRON","BRONZE/ STAINLESS STEEL","90 KW; 380V; 243 A","FLANGES","MECHANICAL SEAL","WATER","5-50 Deg","90 KW , 380V, 155A ACRE","BS2400.402 HT243","N/A","hORIZONTAL","N/A"," "]
[150,767474,"PUMP:SINE CURVE GEAR PUMP;125 MM;5000;75","Drakensberg","PUMP: TYPE: SINE CURVE GEAR PUMP; SIZE: 125 MM; CAPACITY: 5000 L/S; SPEED: 725 RPM; RATING: 75 KW; APPLICATION: THRUST GUIDE BEARING OIL SYSTEM; DRAWING NO:","VIKING/KRAL/ROPER PUMPS","GEAR","125 MM","5000 L/S","30-60M","725 RPM","N/A","CAST IRON","N/A","75 KW","FLANGES","SINGLE MECHANICAL SEAL","THRUST GUIDE BEARING OIL SYSTEM","30-70 Deg","75 KW","N/A","N/A","HORIZONTAL","N/A"," "]
{"$rows_left_out":27}
{"sheet":"Gariep","index":8,"n_rows":4,"n_cols":25,"rows_kept":4,"merged":[[0,0,0,23],[1,0,1,24]]}
[]
[]
["Item of requisition","Material","Short Text","Storage Location","Full Description","OEM / Manufacturer","Pump Type","Size","Capacity / Flow","Head","Speed (RPM)","Stage","Body / Casing Material","Impeller Material","Driver / Motor Details","Connection Type","Seal / Packing Type","Medium / Application","Operating Temperature","Pressure / Rating","Reference / Part No.","NPSH","Mounting","Special Requirements","Supplier Comment"]
[400,23664,"PUMP RTRY:GEAR;220 GAL/MIN;960 RPM;28.44","Gariep","PUMP, ROTARY: TYPE: GEAR; CAPACITY: 220 GAL/MIN; SPEED: 960 RPM; RATING: 28.44 LB; REFERENCE NO: EP8360455; ENCLOSED PORT SIZE; OIL CIRC GEN BEARING",null,"GEAR",null,"220 GAL/MIN",null,"960 RPM",{"$nulls":8},"28.44 LB","EP8360455"]

{"sheet":"Gourikwa","index":9,"n_rows":12,"n_cols":25,"rows_kept":12,"merged":[[0,0,0,23],[1,0,1,24]]}
[]
[]
["Item of requisition","Material","Short Text","Storage Location","Full Description","OEM / Manufacturer","Pump Type","Size","Capacity / Flow","Head","Speed (RPM)","Stage","Body / Casing Material","Impeller Material","Driver / Motor Details","Connection Type","Seal / Packing Type","Medium / Application","Operating Temperature","Pressure / Rating","Reference / Part No.","NPSH","Mounting","Special Requirements","Supplier Comment"]
[50,553136,"PUMP:PERISTALLIC DRAIN;DN4/6;300 CM3/HR","Gourikwa","PUMP: TYPE: PERISTALLIC DRAIN; SIZE: DN4/6; CAPACITY: 300 CM3/HR; SPEED: 5 RPM; RATING: 200-2200 MBAR; DRIVER: ELECTRICAL MOTOR; SPECIFICATION: EN61010/50081/50082; POTENTIAL: 230 VAC; APPLICATION: OEMS CONDENSOR; MANUF P/N: SR25.2-W(01P1307); ENCLOSURE RATING: IP52; TEMP RATING: MAX 60 DEG C; TUBE CONNECTIONS: DN4/6 MM; M AND C; 230 VAC WITH CONNECTION TERMINALS FOR SURFACE AND WALL MOUNTING; IP10 EN60529; REPLACING SR25.1 P/N1P1000","M&C TechGroup","POSITIVE DISPLACEMENT PERISTALTIC","DN4/6 MM","300 CM3/HR","N/A","5 RPM","N/A",null,"N/A","ELECTRICAL MOTOR; 230 VAC","PVDF wetted connections","N/A","Gas cooler Condensate fluid","MAX 60 DEG C","200-2200 MBAR","SR25.2-W(01P1307)","N/A","Wall/Panel mount","The offered equipment shall be a peristaltic condensate drainage pump fully interchangeable with M&C SR25.2-W (Part No. 01P1307) installed on CEMS and sample gas conditioning equipment"]
[70,568041,"PUMP:HEAD PERISTALTIC;4 MM;300 CM3/HR;5","Gourikwa","PUMP: TYPE: HEAD PERISTALTIC; SIZE: 4 MM; CAPACITY: 300 CM3/HR; SPEED: 5 RPM; RATING: 1 KPA; DRIVER: ELECTRIC MOTOR; CASING MATERIAL: PLASTIC; MANUF P/N: 90P1030; USED ON CEMS SYSTEM","ABB/M&C","PERISTALTIC PUMP HEAD","4 MM tubing","300 CM3/HR","N/A","5 RPM","N/A","PLASTIC","N/A","ELECTRIC MOTOR 230VAC ",{"$nulls":4},"1 KPA","90P1030",null,null,"The supplier shall confirm compatibility with the SR25.1 peristaltic pump where 90P1030 is offered as a replacement pump head."]
[90,570352,"PUMP:PISTON;1 IN;59.4 L/MIN;1500/3300","Gourikwa","PUMP: TYPE: PISTON; SIZE: 1 IN; CAPACITY: 59.4 L/MIN; SPEED: 1500/3300 RPM; RATING: 350 BAR; DRIVER: MOTOR; SPECIFICATION: A10 VS/018/31; APPLICATION: HYDRAULIC OIL SKID; MANUF P/N: A10 VS0 18; REFERENCE NO: R910949268","Rexroth","AXIAL PISTON PUMP","1 IN","59.4 L/MIN","350 bar","1500/3300 RPM","N/A",null,null,"MOTOR; 10 V",null,null,"HYDRAULIC OIL",null,"350 BAR","Model: A10 VS0 18; Ref: R910949268"]
{"$rows_left_out":7}
{"sheet":"Ingula P Station","index":10,"n_rows":15,"n_cols":25,"rows_kept":15,"merged":[[0,0,0,23],[1,0,1,24]]}
[]
[]
["Item of requisition","Material","Short Text","Storage Location","Full Description","OEM / Manufacturer","Pump Type","Size","Capacity / Flow","Head","Speed (RPM)","Stage","Body / Casing Material","Impeller Material","Driver / Motor Details","Connection Type","Seal / Packing Type","Medium / Application","Operating Temperature","Pressure / Rating","Reference / Part No.","NPSH","Mounting","Special Requirements","Supplier Comment"]
[490,620403,"PUMP RTRY:VANES;1 X 1-1/2 IN;29 CM3;980","Ingula P Station","PUMP, ROTARY: TYPE: VANES; PORT SIZE: 1 X 1-1/2 IN; CAPACITY: 29 CM3; SPEED: 980 RPM; RATING: 21 MPA; DRIVER: ELECTRIC MOTOR; APPLICATION: GENERATOR; MOUNT: FOOT; OEM P/N: A10VO28DR/31R-PPC12N00M; DRAWING NO: M680-5V7129CP2 REV 0; REXROTH","REXROTH","VANES","1 X 1-1/2 IN","29 CM3",null,"980 RPM",{"$nulls":3},"ELECTRIC MOTOR; 10V","Spider coupling","LIP SEAL","GENERATOR",null,"21 MPA","A10VO28DR/31R-PPC12N00M; M680-5V7129CP2 REV 0",null,"FOOT"]
[540,658356,"ASSY:OIL PUMP;INLET VLV CTRL;STL","Ingula P Station","ASSEMBLY: TYPE: OIL PUMP; APPLICATION: INLET VLV CTRL; DIMENSIONS: LG 1070 X HT 540 MM; MATERIAL: STEEL; COMPRISING: MOTOR AND PUMP; B35 DF; IPV5-64 171 EXTENSION PIECE; MOTOR SPECIFICATIONS: REFERENCE NUMBER 5013480609-1; PHASE 3; INSULATION CLASS F; ENCLOSURE RATING IP 55, FRAME IM B35 (400); POWER 30 KW; VOLTAGE 400/690 V; POWER FACTOR 0.86; AMPERAGE 54.6/31.5A; SPEED 1465 RPM; ARTICAL NUMBER 250-00705410; KUENLE; STANDARD ISO 9001","VOITH","Gear Pump","LG 1070 X HT",null,null,"1465 RPM",null,"STEEL",null,"30 KW; 690 V; 31.5A",null,null,"INLET VLV CTRL",null,"IP 55, FRAME IM B35 (400)"]
[550,658358,"ASSY:LUBE OIL PUMP;TURBINE;STL","Ingula P Station","ASSEMBLY: TYPE: LUBE OIL PUMP; APPLICATION: TURBINE; DIMENSIONS: LG 1360 X HT 450 MM; MATERIAL: STEEL; COMPRISING: MOTOR, COUPLING, COUPLING HOUSING AND PUMP; REFERENCE NO: 132273-000; PUMP: TYPE L3MF-070/140; IFOKUI-G; MOTOR: TYPE WEG; PHASE 3; FRAME 160M-04; ENCLOSURE RATING IP55; INSULATION CLASS F; VOLTAGE 380/660 V 400/690 V; POWER 11 KW; SPEED 1465 RPM; AMPERAGE 21.9/12.6 A; POWER FACTOR 0.85; EFFIECENCY 89.8 PCT; LEISTRITZ; STANDARD ISO 9001","Lestritz Pumpen GmbH","Screw Pump L3MF","70/140","1 to 2,943 gpm","16 Bar","1465 RPM",null,"HIGH GRADE NITRIDED STEEL","PRIMARY SCREWS ARE MADE OF HIGH GRADE  NIRIDED STEEL.SEC SCREWS MADE OF GREY CAST IRON ","11 KW; 660 V; 12.6 A","FLANGE","RADIAL SHAFT SEAL PERBUNAN OR VITON","TURBINE LUBE OIL PUMP","UP TO 100°C","IP55 UP TO 100 BAR","132273-000",null,"FLANGE"]
{"$rows_left_out":10}
{"sheet":"Palmiet","index":11,"n_rows":34,"n_cols":25,"rows_kept":34,"merged":[[0,0,0,23],[1,0,1,24]]}
[]
[]
["Item of requisition","Material","Short Text","Storage Location","Full Description","OEM / Manufacturer","Pump Type","Size","Capacity / Flow","Head","Speed (RPM)","Stage","Body / Casing Material","Impeller Material","Driver / Motor Details","Connection Type","Seal / Packing Type","Medium / Application","Operating Temperature","Pressure / Rating","Reference / Part No.","NPSH","Mounting","Special Requirements","Supplier Comment"]
[440,140716,"PUMP ASSY:MOTOR;CA90 CALPEDA SPA","Palmiet","PUMP, ASSEMBLY: TYPE: MOTOR; REFERENCE NO: CA90 CALPEDA SPA; RATING 220/380 VOLT; 3/1.73 AMP; 0.75HP; 0.55KW; 2900RPM; 50HZ; 3 PHASE; DELEVERY 8/40 M 42/17; VENDORS ARE RESPONSIBLE FOR ENSURING THAT THEY ARE PERFORMING AGAINST THE CORRECT DRAWING REVISION NUMBER (IF APPLICABLE).","CALPEDA","MOTOR",{"$nulls":7},"0.55KW; 380 V; 1.73 AMP",{"$nulls":4},"220/380 VOLT","CA90 CALPEDA SPA"]
[610,725185,"PUMP:SUBMERSIBLE;80 MM;12 L/S;2905 RPM","Palmiet","PUMP: TYPE: SUBMERSIBLE; SIZE: 80 MM; CAPACITY: 12 L/S; SPEED: 2905 RPM; RATING: 11 KW; POTENTIAL: 400 V; FURNISHED ITEMS: 30M CABLE; CASING MATERIAL: HARD IRON; SUPPL P/N: NP 3153.181 SH 273; WET PIT(P): SEMI PERMANENT, SUBMERSIBLE PUMP INSTALLATION. WET PIT ARRANGEMENT WITH THE PUMP INSTALLED; CABLE TO BE CONTINUOUS AND NOT JOINT; PUMP PERFORMANCE TEST RESULTS TO BE SUPPLIED UPON DELIVERY.OPERATIONS AND MAINTENANCE INSTRUCTION MANUALS TO BE SUPPLIED UPON DELIVERY",null,"SUBMERSIBLE","80 MM","12 L/S",null,"2905 RPM",null,"HARD IRON",null,"11 KW; 400 V",{"$nulls":4},"11 KW","NP 3153.181 SH 273",null,null,"PUMP PERFORMANCE TEST RESULTS TO BE SUPPLIED UPON DELIVERY.OPERATIONS AND MAINTENANCE INSTRUCTION MANUALS TO BE SUPPLIED UPON DELIVERY"]
[630,739173,"PUMP CNTRFGL:1 M;30 L/S;80 M;6 IN;1450;7","Palmiet","PUMP, CENTRIFUGAL: NPSH: 1 M; CAPACITY: 30 L/S; TOTAL HEAD: 80 M; SIZE: 6 IN; SPEED: 1450 RPM; STAGE: 7; TYPE: VERTICAL CENTRIFUGAL SUMP PUMP; MOUNT: FLANGE; MANUF P/N: M10 VTLV ; A. TYPE: VERTICAL TURBINE CENTRIFUGAL PUMP; B. RATED FLOW AND HEAD: 30L/S AT 78M HEAD; C. PUMP PRESSURE RANGE: 71M TO 78M; D. TOTAL PUMP LENGTH MUST BE BETWEEN 9000MM AND 9130 MM; E. IMPELLER BOWLS (CAST IRON), COLUMNS AND DISCHARGE CONNECTION HEAD MATERIAL CARBON STEEL; F. PUMP CONNECTING SHAFTS MATERIAL CARBON STEEL; G. PUMP CONNECTING SHAFT SOCKET / NUT MATERIAL CARBON STEEL; H. PUMP DISCHARGE HEAD SEALING ARRANGEMENT GLAND PACKING ASBESTOS FREE MATERIAL; I. THE IMPELLER IS CAST (STAINLESS STEEL 316) IN ONE PIECE WITH WEAR RINGS FOR EASY MAINTENANCE OF RUNNING CLEARANCES; J. CORROSION SPECIFICATION AS PER OEM RECOMMENDED SPECIFICATION FOR REVIEW AND ACCEPTANCE BY ESKOM. CORROSION PROTECTION APPLIED TO THE IMPELLER BOWLS, SHAFTS, COLUMNS AND DISCHARGE CONNECTING HEAD; K. THE PUMPS ARE PROVIDED WITH RENEWABLE WEAR RINGS; L. THE PUMPS ARE PROVIDED WITH INTAKE SCREENS; M. ALL BEARINGS SHALL BE DESIGNED FOR A MINIMUM LIFE OF 100 000 HOURS WITH CONTINUOUS OPERATION AT MAXIMUM RADIAL AND AXIAL LOADS; N. ALL PUMPS SHALL HAVE A PERMANENTLY ATTACHED CORROSION RESISTANT NAMEPLATE, DETAILING THE NAME, MANUFACTURER, MODEL NUMBER, MODEL TYPE, BEARINGS SPECIFICATIONS, HEAD, HEAD RANGE, SIZE, DISCHARGE FLOW RATE, DIRECTION OF ROTATION ETC. MOUNTED TO THE DISCHARGE HEAD; O. WARRANTY ON THE PUMP IS MINIMUM 1 YEAR ON DELIVERY OR 6 MONTHS AFTER INSTALLATION WHICHEVER IS LONGER; P. THE CONTRACTOR SUPPLIES EACH PUMP TO THE FOLLOWING DISCHARGE HEAD DIMENSIONAL SPECIFICATION FOR INTERFACE WITH THE EXISTING COMPONENTS. IF THE DIMENSIONS DISCHARGE HEAD CANNOT MEET THE SPECIFICATION, ADAPTORS MUST BE SUPPLIED TO INTERFACE THE PUMP WITH THE EXISTING PIPING AND HEAD BASE PLATE;",null,"VERTICAL CENTRIFUGAL","6 IN","30 L/S","80 M","1450 RPM",7,null,null,"10 V","HEAD MATERIAL CARBON STEEL","ASBESTOS FREE MATERIAL",null,null,"RANGE: 71M TO 78M","M10 VTLV","1 M","FLANGE"]
{"$rows_left_out":29}
{"sheet":"Vanderkloof","index":12,"n_rows":4,"n_cols":25,"rows_kept":4,"merged":[[0,0,0,23],[1,0,1,24]]}
[]
[]
["Item of requisition","Material","Short Text","Storage Location","Full Description","OEM / Manufacturer","Pump Type","Size","Capacity / Flow","Head","Speed (RPM)","Stage","Body / Casing Material","Impeller Material","Driver / Motor Details","Connection Type","Seal / Packing Type","Medium / Application","Operating Temperature","Pressure / Rating","Reference / Part No.","NPSH","Mounting","Special Requirements","Supplier Comment"]
[240,754580,"PUMP:AUX SUBMERSIBLE;H991 X D500 MM;160","Vanderkloof","PUMP: TYPE: AUX SUBMERSIBLE; SIZE: H991 X D500 MM; CAPACITY: 160 M3/HR; SPEED: 2895 RPM; RATING: 18 KW; APPLICATION: AUXILARY SUMP PUMP; SUPPL P/N: BS2870HT 3~251 FLYGT; BS2870HT3- 251, SUBMERSIBLE PUMP, HIGH HEAD, 18 KW 3-PHASE, 400 VOLT, 2895RPM","FLYGT","SUBMERSIBLE","H991 X D500 MM","160 M3/HR",null,"2895 RPM",{"$nulls":3},"18 KW; 400 V",null,null,"AUXILARY SUMP PUMP",null,"18 KW","BS2870HT 3~251 FLYGT"]

{"sheet":"Catalogue_Lookup","index":13,"n_rows":84,"n_cols":2,"rows_kept":84,"hidden":true}
["ERP Number","Full Description"]
["0581218","PUMP, CENTRIFUGAL: NPSH: 0; CAPACITY: 39 L/S; TOTAL HEAD: 49 M; SIZE: 856 MM; SPEED: 1450 RPM; STAGE: SINGLE; TYPE: SUBMERSIBLE; REFERENCE NO: MJP 053 4054; 150MH-SBO-4P55-D150-HZ-02; POWER INSTALLED: 55KW; VOLTAGE: 400V; AMPS: 105A FULL LOAD; PUMP WEIGHT: 1184KG; HYDRAULIC END; IMPELLER TYPE: OPEN VANE; IMPELLER DIAMETER 394MM; VANE HEIGHT: 24MM; NUMBER OF VANES IS 5; MAX SPHERE THROUGH IMPELLER: 30MM PRODUCT PUMPED SLURRY; PUMP TOTAL LENGTH: 1648; DISCHARGE FLANGE DETAIL: 150 NOM TO BS4504 1613 OD: 288MM 8 HOLE FLANGE PCD: 240"]
["0763291","PUMP, CENTRIFUGAL: NPSH: 1.8 M; CAPACITY: 80 M3/HR; TOTAL HEAD: 60 M; SIZE: DIA 400 MM; SPEED: 1460 RPM; STAGE: 1; DRIVER: BHP: 19.3 KW, MOTOR: 30 KW; TYPE: FUEL TREATMENT; SPECIFICATION: PUMP TYPE: CENTRIFUGAL,  KRC-80F/400-100/GN, Q: 80 M3/H, H: 60M, BHP: 19.3 KW, SPED: 1460 RPM, PUMPING MEDIUM: DIESEL; MOUNT: HORIZONTAL; MANUF P/N:  KRC-80F/400-100/GN, SERIAL NUMBER:1277485/01-1, APOLLO GÖSSNITZ GMBH"]
["0239821","ASSEMBLY: TYPE: LUBE OIL PUMP; DIMENSIONS: DIA 230 MM; SUPPL P/N: VSS V65-250; REFERENCE NO: 7045802; W-69-T-1330/200L; SPEED 2900 RPM"]
["0627091","PUMP: TYPE: HYDRAULIC; SIZE: 1-1/2 IN; CAPACITY: 41 L/MIN; SPEED: 1465 RPM; RATING: 320 BAR; DRIVER: MOTOR; POTENTIAL: 400 V; APPLICATION: MBV LIFT OIL GAS1; REFERENCE NO: T7B B09 2R00"]
["0586241","PUMP, CENTRIFUGAL: NPSH: 1 M; CAPACITY: 130 M3/HR; TOTAL HEAD: 42.2 M; SIZE: 100 X 80; SPEED: 2940 RPM; STAGE: SINGLE; MANUF P/N: KSBETANORM100-080-200GGA10GA302202B; REFERENCE NO: M063/11E; SUCTION DIAMETER: DN100; DISCHARGE DIAMETER: DN80; CODE:9972464992"]
{"$rows_left_out":78}