{"text_format":"3","workbook":"xlsx","n_sheets":16,"sheets":["Index","Instructions","00-Submission Guidelines","01-Gate Keepers","02-Questionnaire","03-Technical Schedules","Scoring","Lists","04-Offered Cells","05-Temp Derating Factors","06-Ancillary Equipment","Photos","07-Track Record","08-Type Testing","09-Customer Details","10-Overall Deviation List"],"not_rendered":{"images":4,"external_links":3,"defined_names":9},"read":"whole","date_system":"1900"}

{"sheet":"Index","index":0,"n_rows":19,"n_cols":3,"rows_kept":19,"merged":[[0,0,0,2],[1,0,1,1],[2,0,2,2],[3,0,3,2],[4,0,4,2]]}
["VENTED LEAD ACID BATTERIES DISTRIBUTION NATIONAL CONTRACT"]
["Tenderer Name:"]
["Document Reference #: 240-56360034_1"]
["Document Title: Technical Schedule A&B for 240-56360034, Rev 3, STATIONARY VENTED LEAD ACID BATTERIES STANDARD"]
["Revision 1"]
[]
["#","Worksheet Tab Title","Description / Instructions"]
[1,"Instructions","Technical Schedules completion instructions."]
[2,"00-Submission Guidelines","Guidelines to aid in the tender evaluation process for both tenderer and Technical Evaluation Team. It is strongly encouraged for tenderers to comply with the set of guidelines."]
[3,"01 - Gatekeepers","Mandatory requirements as per 240-95240645, Technical Evaluation Criteria for Standby Batteries"]
[4,"02-Questionnaire","Tenderer and Original Equipment Manufacturer information"]
[5,"03-Technical Schedules","Technical requirements"]
[6,"04-Offered Cells","Information of the offered equipment"]
[7,"05-Temp Derating Factors","Temperature derating factors of the rated capacity"]
[8,"06-Ancillary Equipment","Information of the Maintenance and Safety equipment"]
{"$rows_left_out":5}
{"sheet":"Instructions","index":1,"n_rows":18,"n_cols":2,"rows_kept":18,"merged":[[0,0,0,1],[1,0,1,1],[2,0,2,1],[3,0,3,1],[4,0,4,1],[7,0,7,1]]}
[{"$f":"Index!A1","v":"VENTED LEAD ACID BATTERIES DISTRIBUTION NATIONAL CONTRACT"}]
["Click here to go back to \"Worksheets Index\""]
[{"$f":"Index!A3","v":"Document Reference #: 240-56360034_1"}]
[{"$f":"Index!A4","v":"Document Title: Technical Schedule A&B for 240-56360034, Rev 3, STATIONARY VENTED LEAD ACID BATTERIES STANDARD"}]
[{"$f":"Index!A5","v":"Revision 1"}]
[]
["#","INSTRUCTIONS"]
["A - EVALUATION CRITERIA"]
[1,"The Tenderer shall respond to ALL clauses as stated on the Technical Schedules Worksheet/s. \nComplete all Light Green shaded areas with the relevant requested information. Where the colour shading is not shown, complete the accessible cells."]
[2,"Note that the requirements stated in Technical Schedules are not necessarily verbatim clause/s as per 240-56360034, Rev 3, STATIONARY VENTED LEAD ACID BATTERIES STANDARD. Therefore it is OBLIGATORY on the Tenderer to review the applicable clauses in 240-56360034, Rev 3, STATIONARY VENTED LEAD ACID BATTERIES STANDARD, in order to provide an informed response."]
[3,"It is encumbent of the Tenderer to make sure that each clause is understood fully and an appropriate response provided.\nClause-for-clause compliance confirmation is not required, however there are instances where information need to be provided by the Tenderer.\nThe Tenderer shall further indicate the number of Devations taken.\nThe Tenderer shall list the Deviations taken on the document specific deviation worksheet or if not available, use Overall Deviation List Worksheet. Reasons for deviations as well as alternatives shall be clearly stated. The applicable document reference number and title shall be stated with the exact clause and deviation stated."]
[4,"When completing the Schedule B and Reference Section, the Tenderer is requested to take cognisance of the following:\nIt is expected of the Tenderer to state clearly, for each clause that requires a statement of compliance in the Schedule B, with one of the following options:\na) Comply - Confirmation of FULL compliance to all clauses of the applicable Section of the Technical Standard. NO deviations.\nb) Partially Comply - Confirmation of PARTIAL Compliance and that FULL Compliance is not possible. Deviations taken. Non-compliances also possible.\nc) Do Not Comply - Confirmation of Non-compliance to ALL requirements in Section.\nA drop down list with these options is provided in Schedule B for this purpose. ALL dropdowns shall show a selection, where applicable."]
[5,"Where supporting documentation is requested e.g. “Comply with Reference”, the Tenderer shall provide a hyperlink to the supporting documentation in the “Reference / Statement (Supporting Evidence)” column. If the supporting evidence relates to a paragraph, graph, table or subset of a document, then the exact location in the relevant document shall be indicated e.g. Chapter, page number and the applicable section framed with a red border. Internet links are not acceptable."]
[6,"Where supporting documentation is NOT requested, the Tenderer shall state the level of compliance which shall serve as a confirmation of intended compliance at a later stage (post contract award) of the project."]
[7,"All graphs and tables shall be properly labelled and associated with a detailed explanation of how it relates to the requirement."]
{"$rows_left_out":4}
{"sheet":"00-Submission Guidelines","index":2,"n_rows":16,"n_cols":5,"rows_kept":16,"merged":[[0,0,0,4],[1,0,1,4],[2,0,2,4],[3,1,3,4],[4,1,4,4],[5,1,5,4],[6,1,6,4],[7,1,7,4],[8,1,8,4],[9,1,9,4],[10,1,10,4],[11,1,11,4],[12,1,12,4]]}
[{"$f":"Index!A1","v":"VENTED LEAD ACID BATTERIES DISTRIBUTION NATIONAL CONTRACT"}]
["Click here to go back to \"Worksheets Index\""]
["Submission Guidelines"]
[1," Answers shall be concise and sufficiently detailed to give the Technical Evaluation Team (TET) a clear understanding of the answer. Unclear and insufficiently detailed answers could result in items being ambiguous and misinterpreted and could result in an unfavourable score."]
[2," Arrange the folders and subfolders into a well organised and structured hierarchy making them logical and sensible to navigate."]
[3,"Name the files that constitute the electronic returnables appropriately based on the content of the document or file."]
[4,"Have returnable digital PDF documents searchable as far as possible. This is preferred to scanned documents that cannot be searched."]
[5,"Have returnable digital PDF documents and include a table of contents as far as possible."]
[6,"The supporting documents may be Datasheets, Technical Drawings, Brochures, Technical Manuals, Type Test Certificates, Test reports, video clips, etc. "]
[7,"The Technical Schedules excel documents must be provided in duplicate with the name of the duplicate being, the filename with the words, “- Copy” appended. (In Windows a copy and paste into the same directory will automatically create this duplicate file with the correct name)."]
[8,"The supporting evidence shall be filed under the appropriate folders as per the folder structure. If an obvious folder is not available, then the document shall be filed under the 12-Other folder."]
[9,"Submit technical drawings and photos of Battery Stands and Battery Connectors under the 05-Offered Equipment folder to demonstrate capability to comply with the requirements."]
[10,"Example of how a deviation shall be recorded."]
["Item #","Document Reference #","Document Title","Clause #","Proposed Deviation"]
[1,"240-139687256","BATTERY ENERGY STORAGE SYSTEMS FOR GRID-SCALE APPLICATIONS","3.2.2 a)","The BESS comprise of an assembly of separate cabinets which are integrated at site."]
{"$rows_left_out":2}
{"sheet":"01-Gate Keepers","index":3,"n_rows":8,"n_cols":8,"rows_kept":8,"merged":[[0,0,0,5],[2,0,3,0],[2,1,3,1],[2,2,3,2],[2,3,3,3],[2,4,2,5],[2,6,2,7]]}
["Technical Gatekeepers as per 240-95240645, Technical Evaluation Criteria for Standby Batteries"]
["Note: All gatekeepers need to be \"Yes\" in order to proceed with evaluation"]
["#","Mandatory Technical Criteria Description","Comply","Reference to evidence (where applicable)","Evaluator 1",null,"Evaluator 2"]
[{"$nulls":4},"Schedule B","Comment/s","Schedule B","Comment/s"]
[1,"The tenderer shall offer the FULL Scope of the Project (Equipment and Services):\n1) Cells, Cabinets, Stands, Accessories and Ancillary Equipment\n2) Supply, Factory Acceptance Testing (FAT), Transportation, Loading and Offloading, Installation and Commissioning, Decommissioning and Disposal","(Select Option)",null,"(Select Option)",null,"(Select Option)"]
[2,"The tenderer shall submit Type Test Certificates and Type Test Reports for ALL the offered equipment (Cells, Batteries). SANS 60896-11","(Select Option)",null,"(Select Option)",null,"(Select Option)"]
[3,"Tenderer has submitted an OEM letter meeting the requirements as listed in Section 3.2.1.2.","(Select Option)",null,"(Select Option)",null,"(Select Option)"]
[4,"The tenderer has a local (South African) office and workshop.","(Select Option)",null,"(Select Option)",null,"(Select Option)"]

{"sheet":"02-Questionnaire","index":4,"n_rows":50,"n_cols":4,"rows_kept":50,"merged":[[7,0,8,0],[7,3,8,3],[9,0,10,0],[9,3,10,3],[11,0,12,0],[11,3,12,3],[16,0,21,0],[35,0,36,0],[35,3,36,3],[37,0,38,0],[37,3,38,3],[39,0,40,0],[39,3,40,3]]}
[null,"Question","Response","Proof to be submitted"]
["A","Tenderer"]
[1,"Company name"]
[2,"Address of Head Quarters"]
[3,"Contact details"]
[4,"Website adress"]
[5,"Company organogram",null,"Organogram"]
[6,"Does your company have ISO 9001:2008 or similar certification?",null,"Copy of Certificate"]
[null,"If yes, what is the expiration date of such certification?"]
[7,"Does your company have ISO 14001:2004 or similar certification?",null,"Copy of Certificate"]
[null,"If yes, what is the expiration date of such certification?"]
[8,"Does your company have OHSAS 18001:2007 or similar certification?",null,"Copy of Certificate"]
[null,"If yes, what is the expiration date of such certification?"]
[9,"If other certifications exist, please state them here.",null,"Copy of Certificate/s"]
[10,"Is there a formal agreement between your company and the manufacturer (OEM)?",null,"Copy of Certificate or Agreement"]
{"$rows_left_out":36}
{"sheet":"03-Technical Schedules","index":5,"n_rows":189,"n_cols":14,"rows_kept":189,"merged":[[0,0,0,9],[2,0,2,9],[4,0,4,9],[6,0,7,0],[6,1,7,1],[6,2,7,3],[6,4,6,5],[6,6,6,7],[6,8,6,9],[6,12,7,12],[6,13,7,13],[11,0,14,0],[26,0,28,0],[26,5,28,5],[139,4,142,4],[139,5,142,5],[139,6,142,6],[139,7,142,7],[139,8,142,8],[139,9,142,9],[139,10,142,10],[139,11,142,11]]}
["TECHNICAL SCHEDULES - Flat plate (Fauré X) (2 V nominal) "]
[]
["Reference refers to the filename or document title and the page number/s and clause number in the document where the said compliance is indicated or mentioned."]
[]
["Specification: 240-56360086, Rev 3, STATIONARY VENTED NICKEL CADMIUM BATTERIES STANDARD"]
[]
["Caluse #","Description of Clause","Schedule A\n(Employer's Particular Requirement)",null,"Flat Plate",null,"Evaluator 1",null,"Evaluator 2",null,"Evaluator 1","Evaluator 2","#","Category"]
[{"$nulls":4},"Schedule B\n(Compliance)","Reference / Statement\n(Supporting Evidence)","Schedule B","Comment/s","Schedule B","Comment/s","Score","Score"]
[3,"Stationary vented lead acid batteries standard",null,null,"XXXXXXXXXXXXXXX","XXXXXXXXXXXXXXX","XXXXXXXXXXXXXXX","XXXXXXXXXXXXXXX","XXXXXXXXXXXXXXX","XXXXXXXXXXXXXXX"]
["3.1","General Requirements",null,null,"XXXXXXXXXXXXXXX","XXXXXXXXXXXXXXX","XXXXXXXXXXXXXXX","XXXXXXXXXXXXXXX","XXXXXXXXXXXXXXX","XXXXXXXXXXXXXXX"]
["a)","Scope","As specified",null,"(Select Option)",null,"(Select Option)",null,"(Select Option)",null,{"$f":"VLOOKUP(G11,ComplianceList,2,0)","v":0},{"$f":"VLOOKUP(I11,ComplianceList,2,0)","v":0},{"$f":"VLOOKUP(N11,Scoring!$B$3:$D$9,2,0)","v":1},"General requirements"]
["b)","Required cell types",null,null,"XXXXXXXXXXXXXXX","XXXXXXXXXXXXXXX","XXXXXXXXXXXXXXX","XXXXXXXXXXXXXXX","XXXXXXXXXXXXXXX","XXXXXXXXXXXXXXX"]
[null,"Flat plate (Fauré X) (2 V nominal) ","Yes",null,"(Select Option)","XXXXXXXXXXXXXXX","(Select Option)",null,"(Select Option)",null,{"$f":"VLOOKUP(G13,ComplianceList,2,0)","v":0},{"$f":"VLOOKUP(I13,ComplianceList,2,0)","v":0},{"$f":"VLOOKUP(N13,Scoring!$B$3:$D$9,2,0)","v":1},"General requirements"]
[null,"Planté plate (2 V nominal)","No",null,"(Select Option)","XXXXXXXXXXXXXXX","(Select Option)",null,"(Select Option)",null,{"$f":"VLOOKUP(G14,ComplianceList,2,0)","v":0},{"$f":"VLOOKUP(I14,ComplianceList,2,0)","v":0},{"$f":"VLOOKUP(N14,Scoring!$B$3:$D$9,2,0)","v":1},"General requirements"]
[null,"Tubular plate (2 V nominal)","No",null,"(Select Option)","XXXXXXXXXXXXXXX","(Select Option)",null,"(Select Option)",null,{"$f":"VLOOKUP(G15,ComplianceList,2,0)","v":0},{"$f":"VLOOKUP(I15,ComplianceList,2,0)","v":0},{"$f":"VLOOKUP(N15,Scoring!$B$3:$D$9,2,0)","v":1},"General requirements"]
{"$rows_left_out":175}
{"sheet":"Scoring","index":6,"n_rows":10,"n_cols":8,"rows_kept":10,"hidden":true,"merged":[[0,0,1,0],[0,1,1,1],[0,2,1,2],[0,3,1,3],[0,4,0,7]]}
["#","Qualitative Technical Criteria Description","#","Weight","Flat Plate"]
[{"$nulls":4},"S1","S2","WS1","WS2"]
[1,"General requirements",1,{"v":0.1,"d":"10%"},{"$f":"SUMIF('03-Technical Schedules'!$M$9:$M$189,Scoring!$C3,'03-Technical Schedules'!$K$9:$K$189)/(COUNTIF('03-Technical Schedules'!$M$9:$M$189,Scoring!$C3)*5)","v":{"v":0,"d":"0%"}},{"$f":"SUMIF('03-Technical Schedules'!$M$9:$M$189,Scoring!$C3,'03-Technical Schedules'!$L$9:$L$189)/(COUNTIF('03-Technical Schedules'!$M$9:$M$189,Scoring!$C3)*5)","v":{"v":0,"d":"0%"}},{"$f":"$D3*E3","v":{"v":0,"d":"0%"}},{"$f":"$D3*F3","v":{"v":0,"d":"0%"}}]
[2,"Electrical performance requirements",2,{"v":0.25,"d":"25%"},{"$f":"SUMIF('03-Technical Schedules'!$M$9:$M$189,Scoring!$C4,'03-Technical Schedules'!$K$9:$K$189)/(COUNTIF('03-Technical Schedules'!$M$9:$M$189,Scoring!$C4)*5)","v":{"v":0,"d":"0%"}},{"$f":"SUMIF('03-Technical Schedules'!$M$9:$M$189,Scoring!$C4,'03-Technical Schedules'!$L$9:$L$189)/(COUNTIF('03-Technical Schedules'!$M$9:$M$189,Scoring!$C4)*5)","v":{"v":0,"d":"0%"}},{"v":0,"d":"0%"},{"v":0,"d":"0%"}]
[3,"Mechanical requirements",3,{"v":0.1,"d":"10%"},{"$f":"SUMIF('03-Technical Schedules'!$M$9:$M$189,Scoring!$C5,'03-Technical Schedules'!$K$9:$K$189)/(COUNTIF('03-Technical Schedules'!$M$9:$M$189,Scoring!$C5)*5)","v":{"v":0,"d":"0%"}},{"$f":"SUMIF('03-Technical Schedules'!$M$9:$M$189,Scoring!$C5,'03-Technical Schedules'!$L$9:$L$189)/(COUNTIF('03-Technical Schedules'!$M$9:$M$189,Scoring!$C5)*5)","v":{"v":0,"d":"0%"}},{"v":0,"d":"0%"},{"v":0,"d":"0%"}]
[4,"Operational requirements",4,{"v":0.15,"d":"15%"},{"$f":"SUMIF('03-Technical Schedules'!$M$9:$M$189,Scoring!$C6,'03-Technical Schedules'!$K$9:$K$189)/(COUNTIF('03-Technical Schedules'!$M$9:$M$189,Scoring!$C6)*5)","v":{"v":0,"d":"0%"}},{"$f":"SUMIF('03-Technical Schedules'!$M$9:$M$189,Scoring!$C6,'03-Technical Schedules'!$L$9:$L$189)/(COUNTIF('03-Technical Schedules'!$M$9:$M$189,Scoring!$C6)*5)","v":{"v":0,"d":"0%"}},{"v":0,"d":"0%"},{"v":0,"d":"0%"}]
[5,"Ancillary equipment",5,{"v":0.1,"d":"10%"},{"$f":"SUMIF('03-Technical Schedules'!$M$9:$M$189,Scoring!$C7,'03-Technical Schedules'!$K$9:$K$189)/(COUNTIF('03-Technical Schedules'!$M$9:$M$189,Scoring!$C7)*5)","v":{"v":0,"d":"0%"}},{"$f":"SUMIF('03-Technical Schedules'!$M$9:$M$189,Scoring!$C7,'03-Technical Schedules'!$L$9:$L$189)/(COUNTIF('03-Technical Schedules'!$M$9:$M$189,Scoring!$C7)*5)","v":{"v":0,"d":"0%"}},{"v":0,"d":"0%"},{"v":0,"d":"0%"}]
[6,"Tests",6,{"v":0.2,"d":"20%"},{"$f":"SUMIF('03-Technical Schedules'!$M$9:$M$189,Scoring!$C8,'03-Technical Schedules'!$K$9:$K$189)/(COUNTIF('03-Technical Schedules'!$M$9:$M$189,Scoring!$C8)*5)","v":{"v":0,"d":"0%"}},{"$f":"SUMIF('03-Technical Schedules'!$M$9:$M$189,Scoring!$C8,'03-Technical Schedules'!$L$9:$L$189)/(COUNTIF('03-Technical Schedules'!$M$9:$M$189,Scoring!$C8)*5)","v":{"v":0,"d":"0%"}},{"v":0,"d":"0%"},{"v":0,"d":"0%"}]
[7,"Packaging, labelling, marking and transport",7,{"v":0.1,"d":"10%"},{"$f":"SUMIF('03-Technical Schedules'!$M$9:$M$189,Scoring!$C9,'03-Technical Schedules'!$K$9:$K$189)/(COUNTIF('03-Technical Schedules'!$M$9:$M$189,Scoring!$C9)*5)","v":{"v":0,"d":"0%"}},{"$f":"SUMIF('03-Technical Schedules'!$M$9:$M$189,Scoring!$C9,'03-Technical Schedules'!$L$9:$L$189)/(COUNTIF('03-Technical Schedules'!$M$9:$M$189,Scoring!$C9)*5)","v":{"v":0,"d":"0%"}},{"v":0,"d":"0%"},{"v":0,"d":"0%"}]
[{"$nulls":3},{"$f":"SUM(D3:D9)","v":{"v":0.9999999999999999,"d":"100%"}}]

{"sheet":"Lists","index":7,"n_rows":22,"n_cols":2,"rows_kept":22,"hidden":true}
["(Select Option)",0]
["Comply",5]
["Partially Comply",4]
["Do Not Comply",2]
[]
["(Select Option)",0]
["Certificate",2]
["Test Report",2]
["Certificate & Test Report",5]
["Not Available",2]
[]
["Cell Configuration Options:"]
["(Select Option)"]
["Single Cells"]
["Multicell Blocks"]
{"$rows_left_out":8}
{"sheet":"04-Offered Cells","index":8,"n_rows":29,"n_cols":15,"rows_kept":29,"merged":[[1,0,2,0],[1,1,1,14]]}
[{"$f":"\"C10 Capacity @ 25°C to Veod = \"&'[2]Technical Schedules'!C29&\"V/cell\"","v":"C10 Capacity @ 25°C to Veod = 1.80V/cell"}]
["Required Capacity [Ah]","Vented Flat Plate"]
[null,"Offered Capacity [Ah]","Cell Model No.","Short Circuit Current [A]","Internal Resistance [mW]","Recommended Torque Levels for Connections [N.m]","Terminating Devices Code 1)","Intercell Connectors Code","Interrow Connectors Code 2)","Electrolyte Volume to Max Level [l]","Electrolyte Volume to Min Level [l]","Cell Dimensions  - LxWxH [mm]","Dry Cell Weight [kg]","Wet Cell Weight [kg]","Lead Content [kg]"]
[50]
[100]
[150]
[200]
[250]
[300]
[350]
[400]
[450]
[500]
[550]
[600]
{"$rows_left_out":15}
{"sheet":"05-Temp Derating Factors","index":9,"n_rows":20,"n_cols":4,"rows_kept":20,"merged":[[4,1,4,3],[5,0,6,0],[19,1,19,3]]}
["Temperature Derating Factors"]
["Note: The discharge rate time period (e.g. 10 - 12 hrs for slow rate) shall be indicate in the space provided"]
["Also indicate the Filename and page number where the requested information may be found in the technical brochures."]
[]
[null,{"$f":"'04-Offered Cells'!B2","v":"Vented Flat Plate"}]
["Temperature [°C]","Slow rate","Med rate","High rate"]
[null,"10-12 h"]
[-5]
[0]
[5]
[10]
[15]
[20]
[25]
[30]
{"$rows_left_out":6}
{"sheet":"06-Ancillary Equipment","index":10,"n_rows":41,"n_cols":13,"rows_kept":41,"merged":[[0,0,0,1],[37,1,37,3],[40,1,40,3]]}
["List of Accessories",{"$nulls":11},"Y"]
[null,null,"Available [Y/N]","Comments",{"$nulls":8},"N"]
[1,"Jug"]
[2,"Funnel"]
[3,"Anti-corrosion lubricant (at least 250ml)"]
[4,"Glass Hydrometer 1)"]
[5,"Glass Thermometer 1)"]
[6,"Electronic Hydrometer 1)"]
[7,"Electronic Thermometer 1)"]
[8,"Maintenance & safety equipment board / rack"]
[9,"Lead acid battery logbook 2)"]
[10,"Battery stand touch-up paint (500ml)"]
[11,"Battery stand touch-up paint (1000ml)"]
[12,"Paint brush - 50mm wide"]
[13,"Battery room safety sign, DCSS1 3)"]
{"$rows_left_out":27}
{"sheet":"Photos","index":11,"n_rows":1,"n_cols":10,"rows_kept":1}
["MAINTENANCE & SAFETY EQUIPMENT BOARD",{"$nulls":8},"MAINTENANCE & SAFETY EQUIPMENT KIT"]

{"sheet":"07-Track Record","index":12,"n_rows":74,"n_cols":3,"rows_kept":74,"merged":[[2,1,2,5],[3,1,3,5],[4,1,4,5],[5,1,5,5],[6,1,6,5],[9,2,9,5],[10,2,10,5],[12,2,12,5],[13,0,14,0],[15,0,16,0],[23,2,23,5],[25,2,25,5],[26,2,26,5],[28,2,28,5],[29,0,30,0],[31,0,32,0],[39,2,39,5],[41,2,41,5],[42,2,42,5],[44,2,44,5],[45,0,46,0],[47,0,48,0],[55,2,55,5],[57,2,57,5],[58,2,58,5],[60,2,60,5],[61,0,62,0],[63,0,64,0],[71,2,71,5],[73,2,73,5],[74,2,74,5],[75,2,75,5],[76,2,76,5],[77,2,77,5],[78,2,78,5],[79,2,79,5],[80,2,80,5],[81,2,81,5],[82,2,82,5],[83,2,83,5],[84,2,84,5],[85,2,85,5],[86,2,86,5]]}
[null,"Instruction to complete the Track Record for Offered Cells"]
[null,"Note: The track record provided shall be exclusively for the equipment offered."]
[null,"1) First list countries with similar climatic conditions as South Africa."]
[null,"2) Then list any other countries for which you have information."]
[null,"3) To make the list not too exhaustive, you may in addition to the track records provided for the four countries make mention of other countries and mention the references in the space provided."]
[null,"4) The track record provided shall be exclusively for the equipment offered."]
[null,"5) Any other relevant references that will aid in forming an idea of the track record of the company as a battery supplier can be entered under Section E Other References."]
[]
[null,"Track Record of the Equipment on Offer"]
[null,"Reference - FileName or Document Title"]
[null,"Cell Type",{"$f":"'04-Offered Cells'!B2","v":"Vented Flat Plate"}]
[null,"Model number"]
["A","Country 1:","SOUTH AFRICA"]
[1,"Oldest installation (Insert Customer/Site Name)"]
[null,"Date of installation"]
{"$rows_left_out":60}
{"sheet":"08-Type Testing","index":13,"n_rows":11,"n_cols":8,"rows_kept":11,"merged":[[2,0,3,0],[2,1,3,1],[2,2,3,2],[2,3,3,3],[2,4,3,4],[2,6,3,6],[2,7,3,7]]}
["Type Tests Results for Offered Cells"]
[]
["Item","Test","Standard","Clause","Required Performance Criteria","Obtained Performance","Test Certficates Provided [Y/N]","References"]
[{"$nulls":5},"Flat Plate"]
[1,"Capacity Test @ 25°C","SANS 60896-11-2003",14,"PASS: Clause 14.10","(Select Option)","(Select Option)"]
[2,"Suitability for floating battery operation test","SANS 60896-11-2003",15,"PASS: Clause 8.2 a) - d)","(Select Option)","(Select Option)"]
[3,"Endurance discharge cycle test","SANS 60896-11-2003",16,"PASS: Clause 9.1","(Select Option)","(Select Option)"]
[4,"Endurance test in overcharge","SANS 60896-11-2003",17,"PASS: Clause 9.2","(Select Option)","(Select Option)"]
[5,"Charge retention test","SANS 60896-11-2003",18,"Specify obtained results","(Select Option)","(Select Option)"]
[6,"Internal resistance test","SANS 60896-11-2003",19,"Tested","(Select Option)","(Select Option)"]
[7,"Short-circuit current test","SANS 60896-11-2003",19,"Tested","(Select Option)","(Select Option)"]

{"sheet":"09-Customer Details","index":14,"n_rows":33,"n_cols":7,"rows_kept":33,"merged":[[0,1,0,6]]}
[null,"CUSTOMER DETAILS - Contactable References"]
[]
[null,"Company Name","Contact Person","Country","Email","Telephone","Mobile"]
[1]
[2]
[3]
[4]
[5]
[6]
[7]
[8]
[9]
[10]
[11]
[12]
{"$rows_left_out":19}
{"sheet":"10-Overall Deviation List","index":15,"n_rows":64,"n_cols":5,"rows_kept":64,"merged":[[0,0,0,4],[1,0,1,4],[2,0,2,4],[3,0,3,4],[4,0,4,4],[5,0,5,4],[6,0,6,4],[7,0,7,4]]}
[{"$f":"Index!A1","v":"VENTED LEAD ACID BATTERIES DISTRIBUTION NATIONAL CONTRACT"}]
[{"$f":"IF('[3]Worksheets Index'!C2=\"\",\"\",'[3]Worksheets Index'!C2)","v":""}]
["Click here to go back to \"Worksheets Index\""]
["DEVIATIONS LIST"]
["Any deviations from this specification shall be listed below with reasons for deviation.  In addition, evidence shall be provided that the proposed deviation will meet the minimum requirements and at least be more cost effective than that specified by Eskom."]
["The \"Clause #\" shall be the applicable Clause number from the applicable referenced document."]
["\"Clause\" refers to the applicable clause from the applicable reference document."]
["Details of the Deviation shall be provided - Document reference number, title, clause number and clause text shall be provided in cases where the deviation is applicable."]
["Item #","Document Reference #","Document Title","Clause #","Proposed Deviation"]
[1]
[2]
[3]
[4]
[5]
[6]
{"$rows_left_out":49}