{"text_format":"3","workbook":"xlsx","n_sheets":15,"sheets":["Read Me","Tender Cover Sheet","5.1.0 Preamble","5.1.1 Cables","5.1.1 Boots","5.1.1 Tools","5.1.1 Connectors","5.1.1 Adaptors","5.1.1 Flyleads","5.1.1 Clamps","5.1.1 Protectors","5.1.1 Others","5.1.2 CPA Formulae","5.1.3 Summary","5.1.4 Exchange Rates"],"not_rendered":{"images":1,"external_links":3,"defined_names":33},"read":"whole","date_system":"1900"}

{"sheet":"Read Me","index":0,"n_rows":25,"n_cols":3,"rows_kept":25,"merged":[[7,1,7,2],[8,1,8,2],[9,1,9,2],[10,1,10,2],[15,8,15,15],[16,8,16,15],[21,1,21,2],[22,1,22,2]]}
["Enquiry No.",null,"E2438NTCSAMWP"]
["Package Name:",null,"supply and delivery of RF cables and connectors on an as and when required basis for a period of five (5) years"]
["Tenderer's Name:",null,{"$f":"'[1]Tender Cover Sheet'!C16","v":0}]
["Category of Offer ( Main Offer Only):",null,"Main Offer Only"]
[]
["READ ME"]
[]
[1,"Read these notes BEFORE you commence input  to this workbook. Changes may not be made to this workbook. No columns may be removed, edited, added or changed on this workbook."]
[2,"Only The Main Offer shall be accepted. No alternative offers are accepted. There must be a separate Excel and PDF file for the main offer."]
[3,"Main offer is = The pricing schedule may not be changed or altered. Tenderer(s) to populate all required information on the Tender cover sheet and also populate as stipulated in (5.1.1 Pricing, 5.1.2 CPA Formulae, 5.1.3 Summary (VATPortion) and 5.1.4 Exchange Rates. "]
{"$rows_left_out":16}
{"sheet":"Tender Cover Sheet","index":1,"n_rows":44,"n_cols":4,"rows_kept":44}
{"$rows_empty":9}
[null,"PRICING INFORMATION"]
[]
[null,"ENQUIRY No.","E2438NTCSAMWP"]
[]
[null,"NAME OF PACKAGE:","supply and delivery of RF cables and connectors on an as and when required basis for a period of five (5) years"]
[]
[null,"TENDERER’S NAME:  "]
[]
[null,"CATEGORY OF OFFER (MAIN OFFER ONLY):",{"$f":"'[1]Read Me'!C4","v":"Main Offer Only"}]
{"$rows_left_out":27}
{"sheet":"5.1.0 Preamble","index":2,"n_rows":18,"n_cols":3,"rows_kept":18,"merged":[[0,0,0,1],[1,0,1,1],[2,0,2,1],[3,0,3,1],[7,1,7,2],[8,1,8,2],[9,1,9,2],[10,1,10,2],[11,1,11,2],[12,1,12,2],[13,1,13,2],[14,1,14,2],[15,1,15,2],[16,1,16,2],[17,1,17,2]]}
["Enquiry No.",null,"E2438NTCSAMWP"]
["Package Name:",null,"supply and delivery of RF cables and connectors on an as and when required basis for a period of five (5) years"]
["Tenderer's Name:",null,{"$f":"'[1]Tender Cover Sheet'!C16","v":0}]
["Category of Offer:",null,{"$f":"'[1]Read Me'!C4","v":"Main Offer Only"}]
[]
["5.1.0 PREAMBLE TO PRICE SCHEDULE "]
[]
[1,"The Price Schedule provides the basis of valuation, price adjustment (CPA) formulae and information for general contract progress monitoring. This contract is an \"as and when\" required contract.The tender will be awarded to a single supplier for this price list.The units quantities herein are estimates only and are non-committal.  No alternative offers are accepted."]
[2,"This is the main data entry sheet for the Tenderer to complete. The Tenderer takes responsibility for ensuring correct inputs. Tenderers are to populate their pricing information as stipulated in the pricing schedule. The pricing schedule may not be changed or altered. Tenderer(s) to populate all required information on the Tender cover sheet and also populate  as stipulated in  (5.1.1 Pricing )  (5.1.2 CPA Formulae) and (5.1.4 Exchange rates). CPA Formulae should represent cost breakdown of the goods/commodities/components/items being sourced."]
[3,"The Prices are the amounts stated in the price column of the Price Schedule.  Where an estimated quantity is stated for an item in the Price Schedule, the Price is calculated by multiplying the estimated quantity by the rate."]
{"$rows_left_out":9}
{"sheet":"5.1.1 Cables","index":3,"n_rows":20,"n_cols":10,"rows_kept":20,"merged":[[1,8,1,9],[4,0,4,2]]}
["Supply and delivery of RF cables and connectors on an as and when required basis for a period of five (5) years"]
[{"$nulls":8},"CPA"]
["Item No.","Spec Clause","Description 1","Description 2","Unit of measure","Estimated Quantities","Tendered Rates (ZAR)","Total Tendered Value (ZAR)","CPA Formula No.\n(See Sheet 5.1.2)","CPA Description\n(See Sheet 5.1.2)"]
[]
["Cables",{"$nulls":7},"Dropdown "]
["1","3.2.1","Cable: RG58 5 mm 50 Ω","CABLE;K31RR0001A,RG58 5MM 50 OHM","m",1000,null,{"$f":"G6*F6","v":{"v":0,"d":"R0.00"}},null,{"$f":"IF(I6=\"\",\"Fixed\",VLOOKUP(I6,'5.1.2 CPA Formulae'!B9:E19,2,FALSE))","v":"Fixed"}]
["2","3.2.2","Cable: RG223 5.5 mm 50 Ω","CABLE;CNC7L01001A0003,RG223 5.5MM 50 OHM","m",1000,null,{"v":0,"d":"R0.00"},null,{"$f":"IF(I7=\"\",\"Fixed\",VLOOKUP(I7,'5.1.2 CPA Formulae'!B10:E20,2,FALSE))","v":"Fixed"}]
["3","3.2.3","Cable: RG213 10 mm 50 Ω braided","CABLE;CXRG213FA,RG213 10MM 50 OHM FLEXAX","m",1500,null,{"v":0,"d":"R0.00"},null,{"$f":"IF(I8=\"\",\"Fixed\",VLOOKUP(I8,'5.1.2 CPA Formulae'!B11:E21,2,FALSE))","v":"Fixed"}]
["4","3.2.4","Cable: RG214 10.8 mm 50 Ω","CABLE;CXRG214,RG214 10.8MM 50 OHM","m",1800,null,{"v":0,"d":"R0.00"},null,{"$f":"IF(I9=\"\",\"Fixed\",VLOOKUP(I9,'5.1.2 CPA Formulae'!B12:E22,2,FALSE))","v":"Fixed"}]
["5","3.2.5","Cable: RG400 5 mm 50 Ω Teflon","CABLE;CXRG400,RG400 5.5MM 50 OHM TEFLON","m",1000,null,{"v":0,"d":"R0.00"},null,{"$f":"IF(I10=\"\",\"Fixed\",VLOOKUP(I10,'5.1.2 CPA Formulae'!B13:E23,2,FALSE))","v":"Fixed"}]
{"$rows_left_out":11}
{"sheet":"5.1.1 Boots","index":4,"n_rows":10,"n_cols":10,"rows_kept":10,"merged":[[1,8,1,9],[4,0,4,2]]}
["Supply and delivery of RF cables and connectors on an as and when required basis for a period of five (5) years"]
[{"$nulls":8},"CPA"]
["Item No.","Spec Clause","Description 1","Description 2","Unit of measure","Estimated Quantities","Tendered Rates (ZAR)","Total Tendered Value (ZAR)","CPA Formula No.\n(See Sheet 5.1.2)","CPA Description\n(See Sheet 5.1.2)"]
[]
["Boots",{"$nulls":7},"Dropdown "]
["15","3.3.1","Boot: strain relief LMR240 black","BOOT;CNC7B00081B1289,STRAIN REL. LMR240","each",2000,null,{"$f":"G6*F6","v":{"v":0,"d":"R0.00"}},null,{"$f":"IF(I6=\"\",\"Fixed\",VLOOKUP(I6,'5.1.2 CPA Formulae'!B9:E19,2,FALSE))","v":"Fixed"}]
["16","3.3.2","Boot: strain relief LMR240 red","BOOT;CNC7B00081B1289,STRAIN REL. LMR240","each",600,null,{"$f":"G7*F7","v":{"v":0,"d":"R0.00"}},null,{"$f":"IF(I7=\"\",\"Fixed\",VLOOKUP(I7,'5.1.2 CPA Formulae'!B10:E20,2,FALSE))","v":"Fixed"}]
["17","3.3.3","Boot: strain relief for RG58/LMR 195 black","BOOT;CNAC78Z034,STREIN REL.FOR RG58/LMR","each",600,null,{"$f":"G8*F8","v":{"v":0,"d":"R0.00"}},null,{"$f":"IF(I8=\"\",\"Fixed\",VLOOKUP(I8,'5.1.2 CPA Formulae'!B11:E21,2,FALSE))","v":"Fixed"}]
["18","3.3.4","Boot: strain relief for RG214/LMR 400 black","BOOT;CNAC78Z072,STREIN REL.FOR RG214/LMR","each",600,null,{"$f":"G9*F9","v":{"v":0,"d":"R0.00"}},null,{"$f":"IF(I9=\"\",\"Fixed\",VLOOKUP(I9,'5.1.2 CPA Formulae'!B12:E22,2,FALSE))","v":"Fixed"}]
[{"$nulls":7},{"$f":"SUM(H6:H9)","v":{"v":0,"d":"R0.00"}}]
{"$rows_left_out":1}
{"sheet":"5.1.1 Tools","index":5,"n_rows":11,"n_cols":10,"rows_kept":11,"merged":[[1,8,1,9],[4,0,4,2]]}
["Supply and delivery of RF cables and connectors on an as and when required basis for a period of five (5) years"]
[{"$nulls":8},"CPA"]
["Item No.","Spec Clause","Description 1","Description 2","Unit of measure","Estimated Quantities","Tendered Rates (ZAR)","Total Tendered Value (ZAR)","CPA Formula No.\n(See Sheet 5.1.2)","CPA Description\n(See Sheet 5.1.2)"]
[]
["Tools",{"$nulls":7},"Dropdown "]
["19","3.4.1","Tool: cable prep 1/2″","TOOL;CNC7N00091A0015,CABLE PREP 1/2\"","each",150,null,{"$f":"G6*F6","v":{"v":0,"d":"R0.00"}},null,{"$f":"IF(I6=\"\",\"Fixed\",VLOOKUP(I6,'5.1.2 CPA Formulae'!B9:E19,2,FALSE))","v":"Fixed"}]
["20","3.4.2","Tool: cable prep 7/8″","TOOL;CNC7N00091A0014,CABLE PREP 7/8\"","each",150,null,{"$f":"G7*F7","v":{"v":0,"d":"R0.00"}},null,{"$f":"IF(I7=\"\",\"Fixed\",VLOOKUP(I7,'5.1.2 CPA Formulae'!B10:E20,2,FALSE))","v":"Fixed"}]
["21","3.4.3","Tool: cable stripping 10 mm","TOOL:CNACST400;CABLE STRIPPING;10 MM","each",150,null,{"$f":"G8*F8","v":{"v":0,"d":"R0.00"}},null,{"$f":"IF(I8=\"\",\"Fixed\",VLOOKUP(I8,'5.1.2 CPA Formulae'!B11:E21,2,FALSE))","v":"Fixed"}]
["22","3.4.4","Tool kit: cable crimp metal","TOOL KIT:CNACHT330K;CABLE CRIMP;METAL","each",150,null,{"$f":"G9*F9","v":{"v":0,"d":"R0.00"}},null,{"$f":"IF(I9=\"\",\"Fixed\",VLOOKUP(I9,'5.1.2 CPA Formulae'!B12:E22,2,FALSE))","v":"Fixed"}]
["23","3.4.5","Tool: Tensioner tool for stainless steel cable ties.","TOOL:STRAPPING;HAND;WD 75 X LG 150 MM","each",100,null,{"$f":"G10*F10","v":{"v":0,"d":"R0.00"}},null,{"$f":"IF(I10=\"\",\"Fixed\",VLOOKUP(I10,'5.1.2 CPA Formulae'!B13:E23,2,FALSE))","v":"Fixed"}]
{"$rows_left_out":2}
{"sheet":"5.1.1 Connectors","index":6,"n_rows":32,"n_cols":10,"rows_kept":32,"merged":[[1,8,1,9],[4,0,4,2]]}
["Supply and delivery of RF cables and connectors on an as and when required basis for a period of five (5) years"]
[{"$nulls":8},"CPA"]
["Item No.","Spec Clause","Description 1","Description 2","Unit of measure","Estimated Quantities","Tendered Rates (ZAR)","Total Tendered Value (ZAR)","CPA Formula No.\n(See Sheet 5.1.2)","CPA Description\n(See Sheet 5.1.2)"]
[]
["Connectors",{"$nulls":7},"Dropdown "]
["24","3.5.1","Connector: BNC STR male crimp RG58/LMR195","CONNECTOR;CNC7J01000A1255,BNC STR MALE","each",2500,null,{"$f":"G6*F6","v":{"v":0,"d":"R0.00"}},null,{"$f":"IF(I6=\"\",\"Fixed\",VLOOKUP(I6,'5.1.2 CPA Formulae'!B9:E19,2,FALSE))","v":"Fixed"}]
["25","3.5.2","Connector: BNC STR male solder RG223","CONNECTOR;CNC7J01000A0608,BNC STR MALE","each",600,null,{"v":0,"d":"R0.00"},null,{"$f":"IF(I7=\"\",\"Fixed\",VLOOKUP(I7,'5.1.2 CPA Formulae'!B10:E20,2,FALSE))","v":"Fixed"}]
["26","3.5.3","Connector: BNC STR male crimp LMR240","CONNECTOR;CNC7J01000A0049,BNC STR MALE","each",600,null,{"v":0,"d":"R0.00"},null,{"$f":"IF(I8=\"\",\"Fixed\",VLOOKUP(I8,'5.1.2 CPA Formulae'!B11:E21,2,FALSE))","v":"Fixed"}]
["27","3.5.4","Connector: BNC STR male crimp LMR400","CONNECTOR;CNC7J01000A0061,BNC STR MALE","each",1500,null,{"v":0,"d":"R0.00"},null,{"$f":"IF(I9=\"\",\"Fixed\",VLOOKUP(I9,'5.1.2 CPA Formulae'!B12:E22,2,FALSE))","v":"Fixed"}]
["28","3.5.5","Connector: N-male STR crimp RG58/LMR195","CONNECTOR;CNC7J01020C0108,N-MALE STR","each",1500,null,{"v":0,"d":"R0.00"},null,{"$f":"IF(I10=\"\",\"Fixed\",VLOOKUP(I10,'5.1.2 CPA Formulae'!B13:E23,2,FALSE))","v":"Fixed"}]
{"$rows_left_out":23}
{"sheet":"5.1.1 Adaptors","index":7,"n_rows":15,"n_cols":10,"rows_kept":15,"merged":[[1,8,1,9],[4,0,4,2]]}
["Supply and delivery of RF cables and connectors on an as and when required basis for a period of five (5) years"]
[{"$nulls":8},"CPA"]
["Item No.","Spec Clause","Description 1","Description 2","Unit of measure","Estimated Quantities","Tendered Rates (ZAR)","Total Tendered Value (ZAR)","CPA Formula No.\n(See Sheet 5.1.2)","CPA Description\n(See Sheet 5.1.2)"]
[]
["Adaptors",{"$nulls":7},"Dropdown "]
["50","3.6.1","Adaptor: BNC-female to SMA-female","ADAPTOR;CNC7J01008A0019, BNC-FEMALE SMA-","each",600,null,{"$f":"G6*F6","v":{"v":0,"d":"R0.00"}},null,{"$f":"IF(I6=\"\",\"Fixed\",VLOOKUP(I6,'5.1.2 CPA Formulae'!B9:E19,2,FALSE))","v":"Fixed"}]
["51","3.6.2","Adaptor: BNC-male to UHF-female","ADAPTOR;CNC7J01008A0803,BNC-MALE UHF-FEM","each",600,null,{"v":0,"d":"R0.00"},null,{"$f":"IF(I7=\"\",\"Fixed\",VLOOKUP(I7,'5.1.2 CPA Formulae'!B10:E20,2,FALSE))","v":"Fixed"}]
["52","3.6.3","Adaptor: BNC-male to N-female","ADAPTOR;CNC7J01008A0824,BNC-MALE N-FEMAL","each",600,null,{"v":0,"d":"R0.00"},null,{"$f":"IF(I8=\"\",\"Fixed\",VLOOKUP(I8,'5.1.2 CPA Formulae'!B11:E21,2,FALSE))","v":"Fixed"}]
["53","3.6.4","Adaptor: BNC-female to N-male","ADAPTOR;CNC7J01008A0825,BNC-FEMALE N-MAL","each",600,null,{"v":0,"d":"R0.00"},null,{"$f":"IF(I9=\"\",\"Fixed\",VLOOKUP(I9,'5.1.2 CPA Formulae'!B12:E22,2,FALSE))","v":"Fixed"}]
["54","3.6.5","Adaptor: N-female to N-female","ADAPTOR;CNC7J01024A0004,N-FEMALE N-FEMAL","each",600,null,{"v":0,"d":"R0.00"},null,{"$f":"IF(I10=\"\",\"Fixed\",VLOOKUP(I10,'5.1.2 CPA Formulae'!B13:E23,2,FALSE))","v":"Fixed"}]
{"$rows_left_out":6}
{"sheet":"5.1.1 Flyleads","index":8,"n_rows":15,"n_cols":10,"rows_kept":15,"merged":[[1,8,1,9],[4,0,4,2]]}
["Supply and delivery of RF cables and connectors on an as and when required basis for a period of five (5) years"]
[{"$nulls":8},"CPA"]
["Item No.","Spec Clause","Description 1","Description 2","Unit of measure","Estimated Quantities","Tendered Rates (ZAR)","Total Tendered Value (ZAR)","CPA Formula No.\n(See Sheet 5.1.2)","CPA Description\n(See Sheet 5.1.2)"]
[]
["Flyleads",{"$nulls":7},"Dropdown "]
["59","3.7.1","Flylead: BNC male to N male RG58 1m","FLYLEAD;C20AA0001A,RG58 1M BNC M TO N-MA","each",600,null,{"$f":"G6*F6","v":{"v":0,"d":"R0.00"}},null,{"$f":"IF(I6=\"\",\"Fixed\",VLOOKUP(I6,'5.1.2 CPA Formulae'!B9:E19,2,FALSE))","v":"Fixed"}]
["60","3.7.2","Flylead: BNC male - N male LMR195 1m","FLYLEAD;C20AA0004A,LMR195 1M BNC M - N M","each",600,null,{"v":0,"d":"R0.00"},null,{"$f":"IF(I7=\"\",\"Fixed\",VLOOKUP(I7,'5.1.2 CPA Formulae'!B10:E20,2,FALSE))","v":"Fixed"}]
["61","3.7.3","Flylead: N female bulkhead – N male LMR 195 1m","CORD COMM:FLYLEAD;CO-AX;LG 1 M;3 MM","each",300,null,{"v":0,"d":"R0.00"},null,{"$f":"IF(I8=\"\",\"Fixed\",VLOOKUP(I8,'5.1.2 CPA Formulae'!B11:E21,2,FALSE))","v":"Fixed"}]
["62","3.7.4","Flylead: N female bulkhead – SMA male LMR 195 1m","Flylead LMR195 cable 1 m: N female bulkhead – SMA male","each",300,null,{"v":0,"d":"R0.00"},null,{"$f":"IF(I9=\"\",\"Fixed\",VLOOKUP(I9,'5.1.2 CPA Formulae'!B12:E22,2,FALSE))","v":"Fixed"}]
["63","3.7.5","Flylead: N male – TNC male LMR DB 195 1m","Flylead LMR195DB ultra cable 1 m: N male – TNC male","each",300,null,{"v":0,"d":"R0.00"},null,{"$f":"IF(I10=\"\",\"Fixed\",VLOOKUP(I10,'5.1.2 CPA Formulae'!B13:E23,2,FALSE))","v":"Fixed"}]
{"$rows_left_out":6}
{"sheet":"5.1.1 Clamps","index":9,"n_rows":38,"n_cols":10,"rows_kept":38,"merged":[[1,8,1,9],[4,0,4,2]]}
["Supply and delivery of RF cables and connectors on an as and when required basis for a period of five (5) years"]
[{"$nulls":8},"CPA"]
["Item No.","Spec Clause","Description 1","Description 2","Unit of measure","Estimated Quantities","Tendered Rates (ZAR)","Total Tendered Value (ZAR)","CPA Formula No.\n(See Sheet 5.1.2)","CPA Description\n(See Sheet 5.1.2)"]
[]
["Clamps",{"$nulls":7},"Dropdown "]
["68","3.8.1","Clamp: Cumfy dual cable and clip","CLAMP;L10AA0116A,CUMFY TK120-2 & CLIP","each",1500,null,{"$f":"G6*F6","v":{"v":0,"d":"R0.00"}},null,{"$f":"IF(I6=\"\",\"Fixed\",VLOOKUP(I6,'5.1.2 CPA Formulae'!B9:E19,2,FALSE))","v":"Fixed"}]
["69","3.8.2","Clamp: Cumfy single cable and clip","CLAMP;L10AA0129A,CUMFY TK120/13/1 & CLIP","each",1500,null,{"v":0,"d":"R0.00"},null,{"$f":"IF(I7=\"\",\"Fixed\",VLOOKUP(I7,'5.1.2 CPA Formulae'!B10:E20,2,FALSE))","v":"Fixed"}]
["70","3.8.3","Clamp: Cumfy dual RG58 and clip","CLAMP;L10AA0114A,CUMFY DUAL RG8 & CLIP","each",1500,null,{"v":0,"d":"R0.00"},null,{"$f":"IF(I8=\"\",\"Fixed\",VLOOKUP(I8,'5.1.2 CPA Formulae'!B11:E21,2,FALSE))","v":"Fixed"}]
["71","3.8.4","Clamp: Cumfy G-clamp dual assy","CLAMP;L10CC0001A,CUMFY G DUAL ASSY.1/4\"","each",1500,null,{"v":0,"d":"R0.00"},null,{"$f":"IF(I9=\"\",\"Fixed\",VLOOKUP(I9,'5.1.2 CPA Formulae'!B12:E22,2,FALSE))","v":"Fixed"}]
["72","3.8.5","Clamp: Cumfy 3 way + clip","CLAMP;L10AA0057A,CUMFY 7/8\" 3 WAY+CLIP","each",2000,null,{"v":0,"d":"R0.00"},null,{"$f":"IF(I10=\"\",\"Fixed\",VLOOKUP(I10,'5.1.2 CPA Formulae'!B13:E23,2,FALSE))","v":"Fixed"}]
{"$rows_left_out":29}
{"sheet":"5.1.1 Protectors","index":10,"n_rows":18,"n_cols":10,"rows_kept":18,"merged":[[2,8,2,9],[5,0,5,2]]}
["Supply and delivery of RF cables and connectors on an as and when required basis for a period of five (5) years"]
[]
[{"$nulls":8},"CPA"]
["Item No.","Spec Clause","Description 1","Description 2","Unit of measure","Estimated Quantities","Tendered Rates (ZAR)","Total Tendered Value (ZAR)","CPA Formula No.\n(See Sheet 5.1.2)","CPA Description\n(See Sheet 5.1.2)"]
[]
["Protectors",{"$nulls":7},"Dropdown "]
["100","3.9.1","Protector: surge filter 1.7 GHz to 2.3 GHz bulkhead N‑female\\N‑female","PROTECTOR;CNLPSXL,WEBB POLY 1.2-2.8GH","each",200,null,{"$f":"G7*F7","v":{"v":0,"d":"R0.00"}},null,{"$f":"IF(I7=\"\",\"Fixed\",VLOOKUP(I7,'5.1.2 CPA Formulae'!B10:E20,2,FALSE))","v":"Fixed"}]
["101","3.9.2","Protector: surge suppressor DC-2 GHz N-female bulkhead mount 90 V","PROTECTOR;J01028A0044,DC-2GHZ N-FEMAL","each",750,null,{"v":0,"d":"R0.00"},null,{"$f":"IF(I8=\"\",\"Fixed\",VLOOKUP(I8,'5.1.2 CPA Formulae'!B11:E21,2,FALSE))","v":"Fixed"}]
["102","3.9.3","Protector: 125 MHz to 1 000 MHz N-female","PROTECTOR;CNLPPOLYC2,125-1000MHZ N-FEMAL","each",500,null,{"v":0,"d":"R0.00"},null,{"$f":"IF(I9=\"\",\"Fixed\",VLOOKUP(I9,'5.1.2 CPA Formulae'!B12:E22,2,FALSE))","v":"Fixed"}]
["103","3.9.4","Protector: data line surge bulkhead RJ45","PROTECTOR;TR1101-1028,SURGE B/HEAD RJ45","each",150,null,{"v":0,"d":"R0.00"},null,{"$f":"IF(I10=\"\",\"Fixed\",VLOOKUP(I10,'5.1.2 CPA Formulae'!B13:E23,2,FALSE))","v":"Fixed"}]
{"$rows_left_out":9}
{"sheet":"5.1.1 Others","index":11,"n_rows":18,"n_cols":10,"rows_kept":18,"merged":[[1,8,1,9],[4,0,4,2]]}
["Supply and delivery of RF cables and connectors on an as and when required basis for a period of five (5) years"]
[{"$nulls":8},"CPA"]
["Item No.","Spec Clause","Description 1","Description 2","Unit of measure","Estimated Quantities","Tendered Rates (ZAR)","Total Tendered Value (ZAR)","CPA Formula No.\n(See Sheet 5.1.2)","CPA Description\n(See Sheet 5.1.2)"]
[]
["Other",{"$nulls":7},"Dropdown "]
["111","3.10.1","Tape: self-vulcanizing Scotch 23","TAPE;L26AA0001A,SELF VULCANIZING SCOTCH","each",600,null,{"$f":"G6*F6","v":{"v":0,"d":"R0.00"}},null,{"$f":"IF(I6=\"\",\"Fixed\",VLOOKUP(I6,'5.1.2 CPA Formulae'!B9:E19,2,FALSE))","v":"Fixed"}]
["112","3.10.2","Tape: insulation black 3M 14mm","TAPE;L26AA0002A,INSULATION BLACK 3M","each",1400,null,{"v":0,"d":"R0.00"},null,{"$f":"IF(I7=\"\",\"Fixed\",VLOOKUP(I7,'5.1.2 CPA Formulae'!B10:E20,2,FALSE))","v":"Fixed"}]
["113","3.10.3","Tape: insulation black 3M 48mm","TAPE;L25AL0010 : Tape PVC 48mmx10m","each",1400,null,{"v":0,"d":"R0.00"},null,{"$f":"IF(I8=\"\",\"Fixed\",VLOOKUP(I8,'5.1.2 CPA Formulae'!B11:E21,2,FALSE))","v":"Fixed"}]
["114","3.10.4","Tape: Butyl 48mm","TAPE;L25AL0000 : Tape Butyl 48mmx5m","each",1400,null,{"v":0,"d":"R0.00"},null,{"$f":"IF(I9=\"\",\"Fixed\",VLOOKUP(I9,'5.1.2 CPA Formulae'!B12:E22,2,FALSE))","v":"Fixed"}]
["115","3.10.5","Saddle: 5 mm BH500","SADDLE;CNACBH500,5MM BOX OF 100 BH500","each",1300,null,{"v":0,"d":"R0.00"},null,{"$f":"IF(I10=\"\",\"Fixed\",VLOOKUP(I10,'5.1.2 CPA Formulae'!B13:E23,2,FALSE))","v":"Fixed"}]
{"$rows_left_out":9}
{"sheet":"5.1.2 CPA Formulae","index":12,"n_rows":148,"n_cols":67,"rows_kept":148,"merged":[[0,0,0,1],[1,0,1,1],[2,0,2,1],[3,0,3,1],[5,0,5,4],[8,2,8,3],[8,5,8,7],[9,2,9,4],[9,5,18,7],[10,2,10,4],[11,2,11,4],[12,2,12,4],[13,2,13,4],[14,2,14,4],[15,2,15,4],[16,2,16,4],[17,2,17,4],[18,2,18,4],[21,1,21,6],[22,1,22,6],[25,1,25,6],[26,1,26,6],[27,1,27,6],[28,1,28,6],[29,1,29,6],[30,1,30,6],[32,1,32,6],[33,1,33,6],[34,1,34,6],[35,1,35,6],[36,1,36,6],[40,1,40,6],[51,1,51,6],[62,1,62,6],[73,1,73,6],[84,1,84,6],[95,1,95,6],[106,1,106,6],[117,1,117,6],[128,1,128,6],[139,1,139,6]]}
["Enquiry No.",null,"E2438NTCSAMWP"]
["Package Name:",null,"NTCSA System Operator - Telecommunications"]
["Tenderer's Name:",null,"Supply and delivery of RF cables and connectors on an as and when required basis for a period of five (5) years"]
["Category of Offer:",null,{"$f":"'[1]Read Me'!C4","v":"Main Offer Only"}]
[]
["5.1.2 CONTRACT PRICE ADJUSTMENT (CPA) FOR INFLATION"]
[]
["No.","Formula Code","Summary of the description of the Tenderer's Formulae"]
[1,"Fixed","Firm and Fixed ",null,null,"Prices are 100 % fixed and firm. CPA is not applicable. "]
[2,"A",{"$f":"B41","v":"Tenderer's description of Formula A"},null,null,"Type in the description of each formula in the tables below"]
{"$rows_left_out":139}
{"sheet":"5.1.3 Summary","index":13,"n_rows":22,"n_cols":5,"rows_kept":22,"merged":[[0,0,0,1],[1,0,1,1],[2,0,2,1],[3,0,3,1],[19,3,19,5],[21,3,21,5]]}
["Enquiry No.",null,"E2438NTCSAMWP"]
["Package Name:",null,"NTCSA System Operator - Telecommunications"]
["Tenderer's Name:",null,"Supply and delivery of RF cables and connectors on an as and when required basis for a period of five (5) years"]
["Category of Offer:",null,{"$f":"'[3]Read Me'!C4","v":"Main Offer Only"}]
[]
["5.1.3 Summary ",{"$nulls":3},"Manual input required"]
[]
[null,null,"All prices in ZAR"]
["Table No.","Section Description","Total Tendered Value "]
[1,"Cables",{"$f":"'5.1.1 Cables'!H20","v":0}]
{"$rows_left_out":13}
{"sheet":"5.1.4 Exchange Rates","index":14,"n_rows":37,"n_cols":8,"rows_kept":37,"merged":[[0,0,0,1],[0,2,0,4],[1,0,1,1],[1,2,1,4],[2,0,2,1],[2,2,2,4],[3,0,3,1],[3,2,3,4],[8,1,8,6],[9,0,11,0],[9,1,9,6],[9,14,9,19],[10,1,10,6],[11,1,11,6],[12,1,12,6],[13,1,13,6],[14,0,16,0],[14,1,14,6],[15,1,15,6],[16,1,16,6],[21,7,21,12]]}
["Enquiry No.",null,"E2438NTCSAMWP"]
["Package Name:",null,"Supply and delivery of RF cables and connectors on an as and when required basis for a period of five (5) years"]
["Tenderer's Name:",null,{"$f":"'[1]Tender Cover Sheet'!C16","v":0}]
["Category of Offer:",null,{"$f":"'[1]Read Me'!C4","v":"Main Offer Only"}]
[]
["5.1.4 EXCHANGE RATES FOR MULTIPLE CURRENCIES"]
[]
["NOTES:"]
[1,"The table below needs to be completed if the Employer will be exposed to any currency fluctuation as stipulated in Secondary Clause X3.  For conversion of the foreign portions to Rand, please use the South African Reserve Bank's (SARB) exchange rate at 12:00 on the day of advertisement of the bid.  This is in terms of the Preferential Procurement Policy Framework Act (PPPFA) with which the Employer has to comply.\nNB: Tenderers must submit proof of the SARB rate(s) of exchange used  "]
[2,"The following URL (electronic route) is to be followed to access the relevant SARB rates on their web pages:\n"]
{"$rows_left_out":27}