{"text_format":"3","workbook":"xlsx","n_sheets":2,"sheets":["Sheet1","Sheet2"],"not_rendered":{"external_links":1,"defined_names":1},"read":"whole","date_system":"1900"}

{"sheet":"Sheet1","index":0,"n_rows":228,"n_cols":11,"rows_kept":228}
["Asset Number","Description"," Cost centre","Location","Capitalised on","Cost","Book Value ","Last Inv Date"," Rationale for disposal or write off","Recommendation","Comments / Other Reasons for Disposal / Insurance Number"]
[11000017142,"Dell Desktop",{"$f":"_xlfn.XLOOKUP(A2,[1]Sheet1!$A:$A,[1]Sheet1!$C:$C,\"Not found\",0)","v":"10135"},{"$f":"_xlfn.XLOOKUP(A2,[1]Sheet1!$A:$A,[1]Sheet1!$F:$F,\"Not found\",0)","v":"REC-0071"},{"$f":"_xlfn.XLOOKUP(A2,[1]Sheet1!$A:$A,[1]Sheet1!$H:$H,\"not found\",0)","v":"2016-05-19"},{"$f":"_xlfn.XLOOKUP(A2,[1]Sheet1!$A:$A,[1]Sheet1!$D:$D,\"not found\",0)","v":{"v":7239.18,"d":"R7,239.18"}},{"$f":"_xlfn.XLOOKUP(A2,[1]Sheet1!$A:$A,[1]Sheet1!$E:$E,\"not found\",0)","v":{"v":1,"d":"R1.00"}},{"$f":"_xlfn.XLOOKUP(A2,[1]Sheet1!$A:$A,[1]Sheet1!$I:$I,\"not found\",0)","v":"2026-03-31"},"No longer provide economic value to the organisation","Scrap","Asset no longer meets a business requirement"]
[11000017143,"Dell Desktop",{"$f":"_xlfn.XLOOKUP(A3,[1]Sheet1!$A:$A,[1]Sheet1!$C:$C,\"Not found\",0)","v":"10135"},{"$f":"_xlfn.XLOOKUP(A3,[1]Sheet1!$A:$A,[1]Sheet1!$F:$F,\"Not found\",0)","v":"REC-0071"},{"$f":"_xlfn.XLOOKUP(A3,[1]Sheet1!$A:$A,[1]Sheet1!$H:$H,\"not found\",0)","v":"2016-05-19"},{"$f":"_xlfn.XLOOKUP(A3,[1]Sheet1!$A:$A,[1]Sheet1!$D:$D,\"not found\",0)","v":{"v":7239.18,"d":"R7,239.18"}},{"$f":"_xlfn.XLOOKUP(A3,[1]Sheet1!$A:$A,[1]Sheet1!$E:$E,\"not found\",0)","v":{"v":1,"d":"R1.00"}},{"$f":"_xlfn.XLOOKUP(A3,[1]Sheet1!$A:$A,[1]Sheet1!$I:$I,\"not found\",0)","v":"2026-03-31"},"No longer provide economic value to the organisation","Scrap","Asset no longer meets a business requirement"]
[11000017144,"Dell Desktop",{"$f":"_xlfn.XLOOKUP(A4,[1]Sheet1!$A:$A,[1]Sheet1!$C:$C,\"Not found\",0)","v":"10135"},{"$f":"_xlfn.XLOOKUP(A4,[1]Sheet1!$A:$A,[1]Sheet1!$F:$F,\"Not found\",0)","v":"REC-0071"},{"$f":"_xlfn.XLOOKUP(A4,[1]Sheet1!$A:$A,[1]Sheet1!$H:$H,\"not found\",0)","v":"2016-05-19"},{"$f":"_xlfn.XLOOKUP(A4,[1]Sheet1!$A:$A,[1]Sheet1!$D:$D,\"not found\",0)","v":{"v":7239.18,"d":"R7,239.18"}},{"$f":"_xlfn.XLOOKUP(A4,[1]Sheet1!$A:$A,[1]Sheet1!$E:$E,\"not found\",0)","v":{"v":1,"d":"R1.00"}},{"$f":"_xlfn.XLOOKUP(A4,[1]Sheet1!$A:$A,[1]Sheet1!$I:$I,\"not found\",0)","v":"2026-03-31"},"No longer provide economic value to the organisation","Scrap","Asset no longer meets a business requirement"]
[11000017145,"Dell Desktop",{"$f":"_xlfn.XLOOKUP(A5,[1]Sheet1!$A:$A,[1]Sheet1!$C:$C,\"Not found\",0)","v":"10135"},{"$f":"_xlfn.XLOOKUP(A5,[1]Sheet1!$A:$A,[1]Sheet1!$F:$F,\"Not found\",0)","v":"REC-0071"},{"$f":"_xlfn.XLOOKUP(A5,[1]Sheet1!$A:$A,[1]Sheet1!$H:$H,\"not found\",0)","v":"2016-05-19"},{"$f":"_xlfn.XLOOKUP(A5,[1]Sheet1!$A:$A,[1]Sheet1!$D:$D,\"not found\",0)","v":{"v":7239.18,"d":"R7,239.18"}},{"$f":"_xlfn.XLOOKUP(A5,[1]Sheet1!$A:$A,[1]Sheet1!$E:$E,\"not found\",0)","v":{"v":1,"d":"R1.00"}},{"$f":"_xlfn.XLOOKUP(A5,[1]Sheet1!$A:$A,[1]Sheet1!$I:$I,\"not found\",0)","v":"2026-03-31"},"No longer provide economic value to the organisation","Scrap","Asset no longer meets a business requirement"]
[11000017146,"Dell Desktop",{"$f":"_xlfn.XLOOKUP(A6,[1]Sheet1!$A:$A,[1]Sheet1!$C:$C,\"Not found\",0)","v":"10135"},{"$f":"_xlfn.XLOOKUP(A6,[1]Sheet1!$A:$A,[1]Sheet1!$F:$F,\"Not found\",0)","v":"REC-0071"},{"$f":"_xlfn.XLOOKUP(A6,[1]Sheet1!$A:$A,[1]Sheet1!$H:$H,\"not found\",0)","v":"2016-05-19"},{"$f":"_xlfn.XLOOKUP(A6,[1]Sheet1!$A:$A,[1]Sheet1!$D:$D,\"not found\",0)","v":{"v":7239.18,"d":"R7,239.18"}},{"$f":"_xlfn.XLOOKUP(A6,[1]Sheet1!$A:$A,[1]Sheet1!$E:$E,\"not found\",0)","v":{"v":1,"d":"R1.00"}},{"$f":"_xlfn.XLOOKUP(A6,[1]Sheet1!$A:$A,[1]Sheet1!$I:$I,\"not found\",0)","v":"2026-03-31"},"No longer provide economic value to the organisation","Scrap","Asset no longer meets a business requirement"]
[14000000078,"Dell Monitor",{"$f":"_xlfn.XLOOKUP(A7,[1]Sheet1!$A:$A,[1]Sheet1!$C:$C,\"Not found\",0)","v":"10135"},{"$f":"_xlfn.XLOOKUP(A7,[1]Sheet1!$A:$A,[1]Sheet1!$F:$F,\"Not found\",0)","v":"REC-0071"},{"$f":"_xlfn.XLOOKUP(A7,[1]Sheet1!$A:$A,[1]Sheet1!$H:$H,\"not found\",0)","v":"2016-05-19"},{"$f":"_xlfn.XLOOKUP(A7,[1]Sheet1!$A:$A,[1]Sheet1!$D:$D,\"not found\",0)","v":{"v":1617.1,"d":"R1,617.10"}},{"$f":"_xlfn.XLOOKUP(A7,[1]Sheet1!$A:$A,[1]Sheet1!$E:$E,\"not found\",0)","v":{"v":1,"d":"R1.00"}},{"$f":"_xlfn.XLOOKUP(A7,[1]Sheet1!$A:$A,[1]Sheet1!$I:$I,\"not found\",0)","v":"2026-03-31"},"No longer provide economic value to the organisation","Scrap","Asset no longer meets a business requirement"]
[14000000272,"Dell Monitor",{"$f":"_xlfn.XLOOKUP(A8,[1]Sheet1!$A:$A,[1]Sheet1!$C:$C,\"Not found\",0)","v":"10135"},{"$f":"_xlfn.XLOOKUP(A8,[1]Sheet1!$A:$A,[1]Sheet1!$F:$F,\"Not found\",0)","v":"REC-0071"},{"$f":"_xlfn.XLOOKUP(A8,[1]Sheet1!$A:$A,[1]Sheet1!$H:$H,\"not found\",0)","v":"2016-12-12"},{"$f":"_xlfn.XLOOKUP(A8,[1]Sheet1!$A:$A,[1]Sheet1!$D:$D,\"not found\",0)","v":{"v":1138.86,"d":"R1,138.86"}},{"$f":"_xlfn.XLOOKUP(A8,[1]Sheet1!$A:$A,[1]Sheet1!$E:$E,\"not found\",0)","v":{"v":1,"d":"R1.00"}},{"$f":"_xlfn.XLOOKUP(A8,[1]Sheet1!$A:$A,[1]Sheet1!$I:$I,\"not found\",0)","v":"2026-03-31"},"No longer provide economic value to the organisation","Scrap","Asset no longer meets a business requirement"]
[16000000000,"Acer Monitor",{"$f":"_xlfn.XLOOKUP(A9,[1]Sheet1!$A:$A,[1]Sheet1!$C:$C,\"Not found\",0)","v":"10135"},{"$f":"_xlfn.XLOOKUP(A9,[1]Sheet1!$A:$A,[1]Sheet1!$F:$F,\"Not found\",0)","v":"REC-0071"},{"$f":"_xlfn.XLOOKUP(A9,[1]Sheet1!$A:$A,[1]Sheet1!$H:$H,\"not found\",0)","v":"2017-07-11"},{"$f":"_xlfn.XLOOKUP(A9,[1]Sheet1!$A:$A,[1]Sheet1!$D:$D,\"not found\",0)","v":{"v":2061.76,"d":"R2,061.76"}},{"$f":"_xlfn.XLOOKUP(A9,[1]Sheet1!$A:$A,[1]Sheet1!$E:$E,\"not found\",0)","v":{"v":1,"d":"R1.00"}},{"$f":"_xlfn.XLOOKUP(A9,[1]Sheet1!$A:$A,[1]Sheet1!$I:$I,\"not found\",0)","v":"2026-03-31"},"No longer provide economic value to the organisation","Scrap","Asset no longer meets a business requirement"]
[16000000016,"Acer Monitor",{"$f":"_xlfn.XLOOKUP(A10,[1]Sheet1!$A:$A,[1]Sheet1!$C:$C,\"Not found\",0)","v":"10135"},{"$f":"_xlfn.XLOOKUP(A10,[1]Sheet1!$A:$A,[1]Sheet1!$F:$F,\"Not found\",0)","v":"REC-0071"},{"$f":"_xlfn.XLOOKUP(A10,[1]Sheet1!$A:$A,[1]Sheet1!$H:$H,\"not found\",0)","v":"2017-07-11"},{"$f":"_xlfn.XLOOKUP(A10,[1]Sheet1!$A:$A,[1]Sheet1!$D:$D,\"not found\",0)","v":{"v":2061.76,"d":"R2,061.76"}},{"$f":"_xlfn.XLOOKUP(A10,[1]Sheet1!$A:$A,[1]Sheet1!$E:$E,\"not found\",0)","v":{"v":1,"d":"R1.00"}},{"$f":"_xlfn.XLOOKUP(A10,[1]Sheet1!$A:$A,[1]Sheet1!$I:$I,\"not found\",0)","v":"2026-03-31"},"No longer provide economic value to the organisation","Scrap","Asset no longer meets a business requirement"]
[16000000017,"Acer Monitor",{"$f":"_xlfn.XLOOKUP(A11,[1]Sheet1!$A:$A,[1]Sheet1!$C:$C,\"Not found\",0)","v":"10135"},{"$f":"_xlfn.XLOOKUP(A11,[1]Sheet1!$A:$A,[1]Sheet1!$F:$F,\"Not found\",0)","v":"REC-0071"},{"$f":"_xlfn.XLOOKUP(A11,[1]Sheet1!$A:$A,[1]Sheet1!$H:$H,\"not found\",0)","v":"2017-07-11"},{"$f":"_xlfn.XLOOKUP(A11,[1]Sheet1!$A:$A,[1]Sheet1!$D:$D,\"not found\",0)","v":{"v":2061.76,"d":"R2,061.76"}},{"$f":"_xlfn.XLOOKUP(A11,[1]Sheet1!$A:$A,[1]Sheet1!$E:$E,\"not found\",0)","v":{"v":1,"d":"R1.00"}},{"$f":"_xlfn.XLOOKUP(A11,[1]Sheet1!$A:$A,[1]Sheet1!$I:$I,\"not found\",0)","v":"2026-03-31"},"No longer provide economic value to the organisation","Scrap","Asset no longer meets a business requirement"]
[16000000018,"Acer Monitor",{"$f":"_xlfn.XLOOKUP(A12,[1]Sheet1!$A:$A,[1]Sheet1!$C:$C,\"Not found\",0)","v":"10135"},{"$f":"_xlfn.XLOOKUP(A12,[1]Sheet1!$A:$A,[1]Sheet1!$F:$F,\"Not found\",0)","v":"REC-0071"},{"$f":"_xlfn.XLOOKUP(A12,[1]Sheet1!$A:$A,[1]Sheet1!$H:$H,\"not found\",0)","v":"2017-07-11"},{"$f":"_xlfn.XLOOKUP(A12,[1]Sheet1!$A:$A,[1]Sheet1!$D:$D,\"not found\",0)","v":{"v":2061.76,"d":"R2,061.76"}},{"$f":"_xlfn.XLOOKUP(A12,[1]Sheet1!$A:$A,[1]Sheet1!$E:$E,\"not found\",0)","v":{"v":1,"d":"R1.00"}},{"$f":"_xlfn.XLOOKUP(A12,[1]Sheet1!$A:$A,[1]Sheet1!$I:$I,\"not found\",0)","v":"2026-03-31"},"No longer provide economic value to the organisation","Scrap","Asset no longer meets a business requirement"]
[16000000019,"Acer Monitor",{"$f":"_xlfn.XLOOKUP(A13,[1]Sheet1!$A:$A,[1]Sheet1!$C:$C,\"Not found\",0)","v":"10135"},{"$f":"_xlfn.XLOOKUP(A13,[1]Sheet1!$A:$A,[1]Sheet1!$F:$F,\"Not found\",0)","v":"REC-0071"},{"$f":"_xlfn.XLOOKUP(A13,[1]Sheet1!$A:$A,[1]Sheet1!$H:$H,\"not found\",0)","v":"2017-07-11"},{"$f":"_xlfn.XLOOKUP(A13,[1]Sheet1!$A:$A,[1]Sheet1!$D:$D,\"not found\",0)","v":{"v":2061.76,"d":"R2,061.76"}},{"$f":"_xlfn.XLOOKUP(A13,[1]Sheet1!$A:$A,[1]Sheet1!$E:$E,\"not found\",0)","v":{"v":1,"d":"R1.00"}},{"$f":"_xlfn.XLOOKUP(A13,[1]Sheet1!$A:$A,[1]Sheet1!$I:$I,\"not found\",0)","v":"2026-03-31"},"No longer provide economic value to the organisation","Scrap","Asset no longer meets a business requirement"]
[16000000020,"Acer Monitor",{"$f":"_xlfn.XLOOKUP(A14,[1]Sheet1!$A:$A,[1]Sheet1!$C:$C,\"Not found\",0)","v":"10135"},{"$f":"_xlfn.XLOOKUP(A14,[1]Sheet1!$A:$A,[1]Sheet1!$F:$F,\"Not found\",0)","v":"REC-0071"},{"$f":"_xlfn.XLOOKUP(A14,[1]Sheet1!$A:$A,[1]Sheet1!$H:$H,\"not found\",0)","v":"2017-07-11"},{"$f":"_xlfn.XLOOKUP(A14,[1]Sheet1!$A:$A,[1]Sheet1!$D:$D,\"not found\",0)","v":{"v":2061.76,"d":"R2,061.76"}},{"$f":"_xlfn.XLOOKUP(A14,[1]Sheet1!$A:$A,[1]Sheet1!$E:$E,\"not found\",0)","v":{"v":1,"d":"R1.00"}},{"$f":"_xlfn.XLOOKUP(A14,[1]Sheet1!$A:$A,[1]Sheet1!$I:$I,\"not found\",0)","v":"2026-03-31"},"No longer provide economic value to the organisation","Scrap","Asset no longer meets a business requirement"]
[16000000021,"Acer Monitor",{"$f":"_xlfn.XLOOKUP(A15,[1]Sheet1!$A:$A,[1]Sheet1!$C:$C,\"Not found\",0)","v":"10135"},{"$f":"_xlfn.XLOOKUP(A15,[1]Sheet1!$A:$A,[1]Sheet1!$F:$F,\"Not found\",0)","v":"REC-0071"},{"$f":"_xlfn.XLOOKUP(A15,[1]Sheet1!$A:$A,[1]Sheet1!$H:$H,\"not found\",0)","v":"2017-07-11"},{"$f":"_xlfn.XLOOKUP(A15,[1]Sheet1!$A:$A,[1]Sheet1!$D:$D,\"not found\",0)","v":{"v":2061.76,"d":"R2,061.76"}},{"$f":"_xlfn.XLOOKUP(A15,[1]Sheet1!$A:$A,[1]Sheet1!$E:$E,\"not found\",0)","v":{"v":1,"d":"R1.00"}},{"$f":"_xlfn.XLOOKUP(A15,[1]Sheet1!$A:$A,[1]Sheet1!$I:$I,\"not found\",0)","v":"2026-03-31"},"No longer provide economic value to the organisation","Scrap","Asset no longer meets a business requirement"]
[16000000022,"Acer Monitor",{"$f":"_xlfn.XLOOKUP(A16,[1]Sheet1!$A:$A,[1]Sheet1!$C:$C,\"Not found\",0)","v":"10135"},{"$f":"_xlfn.XLOOKUP(A16,[1]Sheet1!$A:$A,[1]Sheet1!$F:$F,\"Not found\",0)","v":"REC-0071"},{"$f":"_xlfn.XLOOKUP(A16,[1]Sheet1!$A:$A,[1]Sheet1!$H:$H,\"not found\",0)","v":"2017-07-11"},{"$f":"_xlfn.XLOOKUP(A16,[1]Sheet1!$A:$A,[1]Sheet1!$D:$D,\"not found\",0)","v":{"v":2061.76,"d":"R2,061.76"}},{"$f":"_xlfn.XLOOKUP(A16,[1]Sheet1!$A:$A,[1]Sheet1!$E:$E,\"not found\",0)","v":{"v":1,"d":"R1.00"}},{"$f":"_xlfn.XLOOKUP(A16,[1]Sheet1!$A:$A,[1]Sheet1!$I:$I,\"not found\",0)","v":"2026-03-31"},"No longer provide economic value to the organisation","Scrap","Asset no longer meets a business requirement"]
[16000000023,"Acer Monitor",{"$f":"_xlfn.XLOOKUP(A17,[1]Sheet1!$A:$A,[1]Sheet1!$C:$C,\"Not found\",0)","v":"10135"},{"$f":"_xlfn.XLOOKUP(A17,[1]Sheet1!$A:$A,[1]Sheet1!$F:$F,\"Not found\",0)","v":"REC-0071"},{"$f":"_xlfn.XLOOKUP(A17,[1]Sheet1!$A:$A,[1]Sheet1!$H:$H,\"not found\",0)","v":"2017-07-11"},{"$f":"_xlfn.XLOOKUP(A17,[1]Sheet1!$A:$A,[1]Sheet1!$D:$D,\"not found\",0)","v":{"v":2061.76,"d":"R2,061.76"}},{"$f":"_xlfn.XLOOKUP(A17,[1]Sheet1!$A:$A,[1]Sheet1!$E:$E,\"not found\",0)","v":{"v":1,"d":"R1.00"}},{"$f":"_xlfn.XLOOKUP(A17,[1]Sheet1!$A:$A,[1]Sheet1!$I:$I,\"not found\",0)","v":"2026-03-31"},"No longer provide economic value to the organisation","Scrap","Asset no longer meets a business requirement"]
[16000000024,"Acer Monitor",{"$f":"_xlfn.XLOOKUP(A18,[1]Sheet1!$A:$A,[1]Sheet1!$C:$C,\"Not found\",0)","v":"10135"},{"$f":"_xlfn.XLOOKUP(A18,[1]Sheet1!$A:$A,[1]Sheet1!$F:$F,\"Not found\",0)","v":"REC-0071"},{"$f":"_xlfn.XLOOKUP(A18,[1]Sheet1!$A:$A,[1]Sheet1!$H:$H,\"not found\",0)","v":"2017-07-11"},{"$f":"_xlfn.XLOOKUP(A18,[1]Sheet1!$A:$A,[1]Sheet1!$D:$D,\"not found\",0)","v":{"v":2061.76,"d":"R2,061.76"}},{"$f":"_xlfn.XLOOKUP(A18,[1]Sheet1!$A:$A,[1]Sheet1!$E:$E,\"not found\",0)","v":{"v":1,"d":"R1.00"}},{"$f":"_xlfn.XLOOKUP(A18,[1]Sheet1!$A:$A,[1]Sheet1!$I:$I,\"not found\",0)","v":"2026-03-31"},"No longer provide economic value to the organisation","Scrap","Asset no longer meets a business requirement"]
[16000000025,"Acer Monitor",{"$f":"_xlfn.XLOOKUP(A19,[1]Sheet1!$A:$A,[1]Sheet1!$C:$C,\"Not found\",0)","v":"10135"},{"$f":"_xlfn.XLOOKUP(A19,[1]Sheet1!$A:$A,[1]Sheet1!$F:$F,\"Not found\",0)","v":"REC-0071"},{"$f":"_xlfn.XLOOKUP(A19,[1]Sheet1!$A:$A,[1]Sheet1!$H:$H,\"not found\",0)","v":"2017-07-11"},{"$f":"_xlfn.XLOOKUP(A19,[1]Sheet1!$A:$A,[1]Sheet1!$D:$D,\"not found\",0)","v":{"v":2061.76,"d":"R2,061.76"}},{"$f":"_xlfn.XLOOKUP(A19,[1]Sheet1!$A:$A,[1]Sheet1!$E:$E,\"not found\",0)","v":{"v":1,"d":"R1.00"}},{"$f":"_xlfn.XLOOKUP(A19,[1]Sheet1!$A:$A,[1]Sheet1!$I:$I,\"not found\",0)","v":"2026-03-31"},"No longer provide economic value to the organisation","Scrap","Asset no longer meets a business requirement"]
[16000000027,"Acer Monitor",{"$f":"_xlfn.XLOOKUP(A20,[1]Sheet1!$A:$A,[1]Sheet1!$C:$C,\"Not found\",0)","v":"10135"},{"$f":"_xlfn.XLOOKUP(A20,[1]Sheet1!$A:$A,[1]Sheet1!$F:$F,\"Not found\",0)","v":"REC-0071"},{"$f":"_xlfn.XLOOKUP(A20,[1]Sheet1!$A:$A,[1]Sheet1!$H:$H,\"not found\",0)","v":"2017-07-11"},{"$f":"_xlfn.XLOOKUP(A20,[1]Sheet1!$A:$A,[1]Sheet1!$D:$D,\"not found\",0)","v":{"v":2061.76,"d":"R2,061.76"}},{"$f":"_xlfn.XLOOKUP(A20,[1]Sheet1!$A:$A,[1]Sheet1!$E:$E,\"not found\",0)","v":{"v":1,"d":"R1.00"}},{"$f":"_xlfn.XLOOKUP(A20,[1]Sheet1!$A:$A,[1]Sheet1!$I:$I,\"not found\",0)","v":"2026-03-31"},"No longer provide economic value to the organisation","Scrap","Asset no longer meets a business requirement"]
[16000000028,"Acer Monitor",{"$f":"_xlfn.XLOOKUP(A21,[1]Sheet1!$A:$A,[1]Sheet1!$C:$C,\"Not found\",0)","v":"10135"},{"$f":"_xlfn.XLOOKUP(A21,[1]Sheet1!$A:$A,[1]Sheet1!$F:$F,\"Not found\",0)","v":"REC-0071"},{"$f":"_xlfn.XLOOKUP(A21,[1]Sheet1!$A:$A,[1]Sheet1!$H:$H,\"not found\",0)","v":"2017-07-11"},{"$f":"_xlfn.XLOOKUP(A21,[1]Sheet1!$A:$A,[1]Sheet1!$D:$D,\"not found\",0)","v":{"v":2061.76,"d":"R2,061.76"}},{"$f":"_xlfn.XLOOKUP(A21,[1]Sheet1!$A:$A,[1]Sheet1!$E:$E,\"not found\",0)","v":{"v":1,"d":"R1.00"}},{"$f":"_xlfn.XLOOKUP(A21,[1]Sheet1!$A:$A,[1]Sheet1!$I:$I,\"not found\",0)","v":"2026-03-31"},"No longer provide economic value to the organisation","Scrap","Asset no longer meets a business requirement"]
[16000000029,"Acer Monitor",{"$f":"_xlfn.XLOOKUP(A22,[1]Sheet1!$A:$A,[1]Sheet1!$C:$C,\"Not found\",0)","v":"10135"},{"$f":"_xlfn.XLOOKUP(A22,[1]Sheet1!$A:$A,[1]Sheet1!$F:$F,\"Not found\",0)","v":"REC-0071"},{"$f":"_xlfn.XLOOKUP(A22,[1]Sheet1!$A:$A,[1]Sheet1!$H:$H,\"not found\",0)","v":"2017-07-11"},{"$f":"_xlfn.XLOOKUP(A22,[1]Sheet1!$A:$A,[1]Sheet1!$D:$D,\"not found\",0)","v":{"v":2061.76,"d":"R2,061.76"}},{"$f":"_xlfn.XLOOKUP(A22,[1]Sheet1!$A:$A,[1]Sheet1!$E:$E,\"not found\",0)","v":{"v":1,"d":"R1.00"}},{"$f":"_xlfn.XLOOKUP(A22,[1]Sheet1!$A:$A,[1]Sheet1!$I:$I,\"not found\",0)","v":"2026-03-31"},"No longer provide economic value to the organisation","Scrap","Asset no longer meets a business requirement"]
[16000000030,"Acer Monitor",{"$f":"_xlfn.XLOOKUP(A23,[1]Sheet1!$A:$A,[1]Sheet1!$C:$C,\"Not found\",0)","v":"10135"},{"$f":"_xlfn.XLOOKUP(A23,[1]Sheet1!$A:$A,[1]Sheet1!$F:$F,\"Not found\",0)","v":"REC-0071"},{"$f":"_xlfn.XLOOKUP(A23,[1]Sheet1!$A:$A,[1]Sheet1!$H:$H,\"not found\",0)","v":"2017-07-11"},{"$f":"_xlfn.XLOOKUP(A23,[1]Sheet1!$A:$A,[1]Sheet1!$D:$D,\"not found\",0)","v":{"v":2061.76,"d":"R2,061.76"}},{"$f":"_xlfn.XLOOKUP(A23,[1]Sheet1!$A:$A,[1]Sheet1!$E:$E,\"not found\",0)","v":{"v":1,"d":"R1.00"}},{"$f":"_xlfn.XLOOKUP(A23,[1]Sheet1!$A:$A,[1]Sheet1!$I:$I,\"not found\",0)","v":"2026-03-31"},"No longer provide economic value to the organisation","Scrap","Asset no longer meets a business requirement"]
[16000000031,"Acer Monitor",{"$f":"_xlfn.XLOOKUP(A24,[1]Sheet1!$A:$A,[1]Sheet1!$C:$C,\"Not found\",0)","v":"10135"},{"$f":"_xlfn.XLOOKUP(A24,[1]Sheet1!$A:$A,[1]Sheet1!$F:$F,\"Not found\",0)","v":"REC-0071"},{"$f":"_xlfn.XLOOKUP(A24,[1]Sheet1!$A:$A,[1]Sheet1!$H:$H,\"not found\",0)","v":"2017-07-11"},{"$f":"_xlfn.XLOOKUP(A24,[1]Sheet1!$A:$A,[1]Sheet1!$D:$D,\"not found\",0)","v":{"v":2061.76,"d":"R2,061.76"}},{"$f":"_xlfn.XLOOKUP(A24,[1]Sheet1!$A:$A,[1]Sheet1!$E:$E,\"not found\",0)","v":{"v":1,"d":"R1.00"}},{"$f":"_xlfn.XLOOKUP(A24,[1]Sheet1!$A:$A,[1]Sheet1!$I:$I,\"not found\",0)","v":"2026-03-31"},"No longer provide economic value to the organisation","Scrap","Asset no longer meets a business requirement"]
[16000000032,"Acer Monitor",{"$f":"_xlfn.XLOOKUP(A25,[1]Sheet1!$A:$A,[1]Sheet1!$C:$C,\"Not found\",0)","v":"10135"},{"$f":"_xlfn.XLOOKUP(A25,[1]Sheet1!$A:$A,[1]Sheet1!$F:$F,\"Not found\",0)","v":"REC-0071"},{"$f":"_xlfn.XLOOKUP(A25,[1]Sheet1!$A:$A,[1]Sheet1!$H:$H,\"not found\",0)","v":"2017-07-11"},{"$f":"_xlfn.XLOOKUP(A25,[1]Sheet1!$A:$A,[1]Sheet1!$D:$D,\"not found\",0)","v":{"v":2061.76,"d":"R2,061.76"}},{"$f":"_xlfn.XLOOKUP(A25,[1]Sheet1!$A:$A,[1]Sheet1!$E:$E,\"not found\",0)","v":{"v":1,"d":"R1.00"}},{"$f":"_xlfn.XLOOKUP(A25,[1]Sheet1!$A:$A,[1]Sheet1!$I:$I,\"not found\",0)","v":"2026-03-31"},"No longer provide economic value to the organisation","Scrap","Asset no longer meets a business requirement"]
[16000000033,"Acer Monitor",{"$f":"_xlfn.XLOOKUP(A26,[1]Sheet1!$A:$A,[1]Sheet1!$C:$C,\"Not found\",0)","v":"10135"},{"$f":"_xlfn.XLOOKUP(A26,[1]Sheet1!$A:$A,[1]Sheet1!$F:$F,\"Not found\",0)","v":"REC-0071"},{"$f":"_xlfn.XLOOKUP(A26,[1]Sheet1!$A:$A,[1]Sheet1!$H:$H,\"not found\",0)","v":"2017-07-11"},{"$f":"_xlfn.XLOOKUP(A26,[1]Sheet1!$A:$A,[1]Sheet1!$D:$D,\"not found\",0)","v":{"v":2061.76,"d":"R2,061.76"}},{"$f":"_xlfn.XLOOKUP(A26,[1]Sheet1!$A:$A,[1]Sheet1!$E:$E,\"not found\",0)","v":{"v":1,"d":"R1.00"}},{"$f":"_xlfn.XLOOKUP(A26,[1]Sheet1!$A:$A,[1]Sheet1!$I:$I,\"not found\",0)","v":"2026-03-31"},"No longer provide economic value to the organisation","Scrap","Asset no longer meets a business requirement"]
[16000000034,"Acer Monitor",{"$f":"_xlfn.XLOOKUP(A27,[1]Sheet1!$A:$A,[1]Sheet1!$C:$C,\"Not found\",0)","v":"10135"},{"$f":"_xlfn.XLOOKUP(A27,[1]Sheet1!$A:$A,[1]Sheet1!$F:$F,\"Not found\",0)","v":"REC-0071"},{"$f":"_xlfn.XLOOKUP(A27,[1]Sheet1!$A:$A,[1]Sheet1!$H:$H,\"not found\",0)","v":"2017-07-11"},{"$f":"_xlfn.XLOOKUP(A27,[1]Sheet1!$A:$A,[1]Sheet1!$D:$D,\"not found\",0)","v":{"v":2061.76,"d":"R2,061.76"}},{"$f":"_xlfn.XLOOKUP(A27,[1]Sheet1!$A:$A,[1]Sheet1!$E:$E,\"not found\",0)","v":{"v":1,"d":"R1.00"}},{"$f":"_xlfn.XLOOKUP(A27,[1]Sheet1!$A:$A,[1]Sheet1!$I:$I,\"not found\",0)","v":"2026-03-31"},"No longer provide economic value to the organisation","Scrap","Asset no longer meets a business requirement"]
[16000000035,"Acer Monitor",{"$f":"_xlfn.XLOOKUP(A28,[1]Sheet1!$A:$A,[1]Sheet1!$C:$C,\"Not found\",0)","v":"10135"},{"$f":"_xlfn.XLOOKUP(A28,[1]Sheet1!$A:$A,[1]Sheet1!$F:$F,\"Not found\",0)","v":"REC-0071"},{"$f":"_xlfn.XLOOKUP(A28,[1]Sheet1!$A:$A,[1]Sheet1!$H:$H,\"not found\",0)","v":"2017-07-11"},{"$f":"_xlfn.XLOOKUP(A28,[1]Sheet1!$A:$A,[1]Sheet1!$D:$D,\"not found\",0)","v":{"v":2061.76,"d":"R2,061.76"}},{"$f":"_xlfn.XLOOKUP(A28,[1]Sheet1!$A:$A,[1]Sheet1!$E:$E,\"not found\",0)","v":{"v":1,"d":"R1.00"}},{"$f":"_xlfn.XLOOKUP(A28,[1]Sheet1!$A:$A,[1]Sheet1!$I:$I,\"not found\",0)","v":"2026-03-31"},"No longer provide economic value to the organisation","Scrap","Asset no longer meets a business requirement"]
[16000000036,"Acer Monitor",{"$f":"_xlfn.XLOOKUP(A29,[1]Sheet1!$A:$A,[1]Sheet1!$C:$C,\"Not found\",0)","v":"10135"},{"$f":"_xlfn.XLOOKUP(A29,[1]Sheet1!$A:$A,[1]Sheet1!$F:$F,\"Not found\",0)","v":"REC-0071"},{"$f":"_xlfn.XLOOKUP(A29,[1]Sheet1!$A:$A,[1]Sheet1!$H:$H,\"not found\",0)","v":"2017-07-11"},{"$f":"_xlfn.XLOOKUP(A29,[1]Sheet1!$A:$A,[1]Sheet1!$D:$D,\"not found\",0)","v":{"v":2061.76,"d":"R2,061.76"}},{"$f":"_xlfn.XLOOKUP(A29,[1]Sheet1!$A:$A,[1]Sheet1!$E:$E,\"not found\",0)","v":{"v":1,"d":"R1.00"}},{"$f":"_xlfn.XLOOKUP(A29,[1]Sheet1!$A:$A,[1]Sheet1!$I:$I,\"not found\",0)","v":"2026-03-31"},"No longer provide economic value to the organisation","Scrap","Asset no longer meets a business requirement"]
[16000000038,"Acer Monitor",{"$f":"_xlfn.XLOOKUP(A30,[1]Sheet1!$A:$A,[1]Sheet1!$C:$C,\"Not found\",0)","v":"10135"},{"$f":"_xlfn.XLOOKUP(A30,[1]Sheet1!$A:$A,[1]Sheet1!$F:$F,\"Not found\",0)","v":"REC-0071"},{"$f":"_xlfn.XLOOKUP(A30,[1]Sheet1!$A:$A,[1]Sheet1!$H:$H,\"not found\",0)","v":"2017-07-11"},{"$f":"_xlfn.XLOOKUP(A30,[1]Sheet1!$A:$A,[1]Sheet1!$D:$D,\"not found\",0)","v":{"v":2061.76,"d":"R2,061.76"}},{"$f":"_xlfn.XLOOKUP(A30,[1]Sheet1!$A:$A,[1]Sheet1!$E:$E,\"not found\",0)","v":{"v":1,"d":"R1.00"}},{"$f":"_xlfn.XLOOKUP(A30,[1]Sheet1!$A:$A,[1]Sheet1!$I:$I,\"not found\",0)","v":"2026-03-31"},"No longer provide economic value to the organisation","Scrap","Asset no longer meets a business requirement"]
{"$rows_left_out":199}
{"sheet":"Sheet2","index":1,"n_rows":0,"n_cols":0,"rows_kept":0}