{"text_format":"3","workbook":"xlsx","n_sheets":5,"sheets":["Summary","Option 1(SaaS - Premise)","Option 2(SaaS - Private Cloud)","Option 3(SaaS - Public Cloud)","Currency"],"not_rendered":{"external_links":7,"defined_names":495},"read":"whole","date_system":"1900"}

{"sheet":"Summary","index":0,"n_rows":36,"n_cols":9,"rows_kept":36,"merged":[[2,1,2,6],[30,1,30,8]]}
[null,"Pricing Schedule : Income Tax tool"]
[]
[null,"VENDOR NAME"]
[]
[]
[]
[null,"IMPORTANT NOTES"]
[null,"All cells highlighted in GREEN must be completed"]
[null,"Quoted prices MUST be in ZAR, EXCLUDING VAT and ESCALATIONS"]
[]
[null,"Contract Management Solution"]
[null,"Prices MUST be quoted based on the SCOPE provided"]
[null,"Select the currency from the CURRENCY drop-down list in COLUMN \"G\""]
[]
[null,"Capture the applicable Currency, ROE and ROE Published Date on the \"Currency sheet\". "]
[null,"The adjustments for prevailing rates and the basis for future price adjustments will be determined at time of contracting. "]
[null,"Exchange rate variations may not be claimed for the local mark-up in the pricing structure"]
[]
[null,"Provide pricing assumptions applicable which has an impact to the overall pricing submission for each of the Options (TABLE 1)"]
[]
{"$rows_left_out":17}
{"sheet":"Option 1(SaaS - Premise)","index":1,"n_rows":38,"n_cols":39,"rows_kept":38,"merged":[[2,1,2,6],[5,7,5,11],[5,12,5,36],[6,4,6,6],[6,7,6,11],[6,12,6,16],[6,17,6,21],[6,22,6,26],[6,27,6,31],[6,32,6,36],[7,4,7,6],[8,0,11,0],[8,1,11,1],[8,2,9,2],[8,3,9,3],[8,7,9,7],[8,12,11,36],[10,2,11,2],[10,3,11,3],[10,7,11,7],[12,0,13,0],[12,1,13,1],[12,2,13,2],[12,3,13,3],[12,7,13,11],[12,12,13,12],[12,17,13,17],[12,22,13,22],[12,27,13,27],[12,32,13,32],[12,38,13,38],[14,0,25,0],[14,1,25,1],[14,2,15,2],[14,3,15,3],[14,7,15,7],[14,12,25,36],[16,2,17,2],[16,3,17,3],[16,7,17,7],[18,2,19,2],[18,3,19,3],[18,7,19,7],[20,2,21,2],[20,3,21,3],[20,7,21,7],[22,2,23,2],[22,3,23,3],[22,7,23,7],[24,2,25,2],[24,3,25,3],[24,7,25,7],[26,0,27,0],[26,1,27,1],[26,2,27,2],[26,3,27,3],[26,7,27,11],[26,12,27,12],[26,17,27,17],[26,22,27,22],[26,27,27,27],[26,32,27,32],[26,38,27,38],[28,0,31,0],[28,1,31,1],[28,2,29,2],[28,3,29,3],[28,7,29,7],[28,12,31,36],[30,2,31,2],[30,3,31,3],[30,7,31,7],[36,1,36,12],[37,1,60,12]]}
[null,"Pricing Schedule : Income Tax tool"]
[]
[null,"VENDOR NAME"]
[]
[]
[{"$nulls":7},"SOLUTION IMPLEMENTATION PHASE",{"$nulls":4},"OPERATIONAL PHASE"]
[null," ",{"$nulls":5},"YEAR 1 ",{"$nulls":4},"YEAR 2",{"$nulls":4},"YEAR 3",{"$nulls":4},"YEAR 4",{"$nulls":4},"YEAR 5",{"$nulls":4},"YEAR 6"]
["Item Number","Category","Description","Unit charge","CURRENCY",null,null,"Total Estimated Quantity","Unit Price in Nominated Currency","Unit Price in ZAR","Total [Nominated Currency]","Total in ZAR","Total Estimated Quantity","Unit Price in Nominated Currency","Unit Price in ZAR","Total [Nominated Currency]","Total in ZAR","Total Estimated Quantity","Unit Price in Nominated Currency","Unit Price in ZAR","Total [Nominated Currency]","Total in ZAR","Total Estimated Quantity","Unit Price in Nominated Currency","Unit Price in ZAR","Total [Nominated Currency]","Total in ZAR","Total Estimated Quantity","Unit Price in Nominated Currency","Unit Price in ZAR","Total [Nominated Currency]","Total in ZAR","Total Estimated Quantity","Unit Price in Nominated Currency","Unit Price in ZAR","Total [Nominated Currency]","Total in ZAR",null,"CONTRACT PRICE ADJUSTMENT"]
[1,"Hardware Infrastructure including Support",null,"sum",{"$f":"IF(F9=\"\",\"\",IF(F9=\"ZAR\",\"Local\",\"Foreign\"))","v":"Local"},"ZAR",{"$f":"IF(E9=\"\",\"\",IF(E9=\"Foreign\",VLOOKUP(F9,Currency!$E$20:$F$33,2,FALSE),1))","v":{"v":1,"d":"1.00"}},1,0,{"$f":"I9*$G9","v":0},{"$f":"I9*$H9","v":0},{"$f":"J9*$H9","v":0}]
[{"$nulls":4},"Local","ZAR",{"$f":"IF(E10=\"\",\"\",IF(E10=\"Foreign\",VLOOKUP(F10,Currency!$E$20:$F$33,2,FALSE),1))","v":{"v":1,"d":"1.00"}},null,0,0,{"$f":"I10*$H9","v":0},{"$f":"J10*$H9","v":0}]
[{"$nulls":3},"sum","Local","ZAR",{"$f":"IF(E11=\"\",\"\",IF(E11=\"Foreign\",VLOOKUP(F11,Currency!$E$20:$F$33,2,FALSE),1))","v":{"v":1,"d":"1.00"}},1,0,0,{"$f":"I11*$H11","v":0},{"$f":"J11*$H11","v":0}]
[{"$nulls":4},"Local","ZAR",{"$f":"IF(E12=\"\",\"\",IF(E12=\"Foreign\",VLOOKUP(F12,Currency!$E$20:$F$33,2,FALSE),1))","v":{"v":1,"d":"1.00"}},null,0,0,{"$f":"I12*$H11","v":0},{"$f":"J12*$H11","v":0}]
[2,"Software","Subscription Services","sum","Local","ZAR",{"$f":"IF(E13=\"\",\"\",IF(E13=\"Foreign\",VLOOKUP(F13,Currency!$E$20:$F$33,2,FALSE),1))","v":{"v":1,"d":"1.00"}},{"$nulls":5},1,0,{"$f":"N13*$G13","v":0},{"$f":"N13*$M13","v":0},{"$f":"O13*$M13","v":0},1,0,{"$f":"S13*$G13","v":0},{"$f":"S13*R13","v":0},{"$f":"T13*$R13","v":0},1,0,{"$f":"X13*$G13","v":0},{"$f":"X13*W13","v":0},{"$f":"Y13*$R13","v":0},1,0,{"$f":"AC13*$G13","v":0},{"$f":"AC13*AB13","v":0},{"$f":"AD13*$R13","v":0},1,0,{"$f":"AH13*$G13","v":0},{"$f":"AH13*AG13","v":0},{"$f":"AI13*$R13","v":0}]
[{"$nulls":4},"Local","ZAR",{"$f":"IF(E14=\"\",\"\",IF(E14=\"Foreign\",VLOOKUP(F14,Currency!$E$20:$F$33,2,FALSE),1))","v":{"v":1,"d":"1.00"}},{"$nulls":6},0,0,{"$f":"N14*$M13","v":0},{"$f":"O14*$M13","v":0},null,0,0,{"$f":"S14*$R13","v":0},{"$f":"T14*$R13","v":0},null,0,0,{"$f":"X14*$R13","v":0},{"$f":"Y14*$R13","v":0},null,0,0,{"$f":"AC14*$R13","v":0},{"$f":"AD14*$R13","v":0},null,0,0,{"$f":"AH14*$R13","v":0},{"$f":"AI14*$R13","v":0}]
[3,"Solution Implementation","Design","sum","Local","ZAR",{"$f":"IF(E15=\"\",\"\",IF(E15=\"Foreign\",VLOOKUP(F15,Currency!$E$20:$F$33,2,FALSE),1))","v":{"v":1,"d":"1.00"}},1,0,{"$f":"I15*$G15","v":0},{"$f":"I15*$H15","v":0},{"$f":"J15*$H15","v":0},1]
[{"$nulls":4},"Local","ZAR",{"$f":"IF(E16=\"\",\"\",IF(E16=\"Foreign\",VLOOKUP(F16,Currency!$E$20:$F$33,2,FALSE),1))","v":{"v":1,"d":"1.00"}},null,0,0,{"$f":"I16*$H15","v":0},{"$f":"J16*$H15","v":0}]
[null,null,"Build, Configure","sum","Local","ZAR",{"$f":"IF(E17=\"\",\"\",IF(E17=\"Foreign\",VLOOKUP(F17,Currency!$E$20:$F$33,2,FALSE),1))","v":{"v":1,"d":"1.00"}},1,0,0,{"$f":"I17*$H17","v":0},{"$f":"J17*$H17","v":0}]
[{"$nulls":4},"Local","ZAR",{"$f":"IF(E18=\"\",\"\",IF(E18=\"Foreign\",VLOOKUP(F18,Currency!$E$20:$F$33,2,FALSE),1))","v":{"v":1,"d":"1.00"}},null,0,0,{"$f":"I18*$H17","v":0},{"$f":"J18*$H17","v":0}]
[null,null,"Testing","sum","Local","ZAR",{"$f":"IF(E19=\"\",\"\",IF(E19=\"Foreign\",VLOOKUP(F19,Currency!$E$20:$F$33,2,FALSE),1))","v":{"v":1,"d":"1.00"}},1,0,0,{"$f":"I19*$H19","v":0},{"$f":"J19*$H19","v":0}]
[{"$nulls":4},"Local","ZAR",{"$f":"IF(E20=\"\",\"\",IF(E20=\"Foreign\",VLOOKUP(F20,Currency!$E$20:$F$33,2,FALSE),1))","v":{"v":1,"d":"1.00"}},null,0,0,{"$f":"I20*$H19","v":0},{"$f":"J20*$H19","v":0}]
{"$rows_left_out":19}
{"sheet":"Option 2(SaaS - Private Cloud)","index":2,"n_rows":32,"n_cols":39,"rows_kept":32,"merged":[[2,1,2,6],[5,7,5,11],[5,12,5,36],[6,4,6,6],[6,7,6,11],[6,12,6,16],[6,17,6,21],[6,22,6,26],[6,27,6,31],[6,32,6,36],[7,4,7,6],[8,0,9,0],[8,1,9,1],[8,2,9,2],[8,3,9,3],[8,7,9,11],[8,12,9,12],[8,17,9,17],[8,22,9,22],[8,27,9,27],[8,32,9,32],[8,38,9,38],[10,0,21,0],[10,1,21,1],[10,2,11,2],[10,3,11,3],[10,7,11,7],[10,12,21,36],[12,2,13,2],[12,3,13,3],[12,7,13,7],[14,2,15,2],[14,3,15,3],[14,7,15,7],[16,2,17,2],[16,3,17,3],[16,7,17,7],[18,2,19,2],[18,3,19,3],[18,7,19,7],[20,2,21,2],[20,3,21,3],[20,7,21,7],[22,0,25,0],[22,1,25,1],[22,2,23,2],[22,3,23,3],[22,7,23,7],[22,12,25,36],[24,2,25,2],[24,3,25,3],[24,7,25,7],[30,1,30,13],[31,1,54,13]]}
[null,"Pricing Schedule : Income Tax Tool"]
[]
[null,"VENDOR NAME"]
[]
[]
[{"$nulls":7},"SOLUTION IMPLEMENTATION PHASE",{"$nulls":4},"OPERATIONAL PHASE"]
[null," ",{"$nulls":5},"YEAR 1",{"$nulls":4},"YEAR 2",{"$nulls":4},"YEAR 3",{"$nulls":4},"YEAR 4",{"$nulls":4},"YEAR 5",{"$nulls":4},"YEAR 6"]
["Item Number","Category","Description","Unit charge","CURRENCY",null,null,"Total Estimated Quantity","Unit Price in Nominated Currency","Unit Price in ZAR","Total [Nominated Currency]","Total in ZAR","Total Estimated Quantity","Unit Price in Nominated Currency","Unit Price in ZAR","Total [Nominated Currency]","Total in ZAR","Total Estimated Quantity","Unit Price in Nominated Currency","Unit Price in ZAR","Total [Nominated Currency]","Total in ZAR","Total Estimated Quantity","Unit Price in Nominated Currency","Unit Price in ZAR","Total [Nominated Currency]","Total in ZAR","Total Estimated Quantity","Unit Price in Nominated Currency","Unit Price in ZAR","Total [Nominated Currency]","Total in ZAR","Total Estimated Quantity","Unit Price in Nominated Currency","Unit Price in ZAR","Total [Nominated Currency]","Total in ZAR",null,"CONTRACT PRICE ADJUSTMENT"]
[1,"Software","Subscription Services","sum",{"$f":"IF(F9=\"\",\"\",IF(F9=\"ZAR\",\"Local\",\"Foreign\"))","v":"Local"},"ZAR",{"$f":"IF(E9=\"\",\"\",IF(E9=\"Foreign\",VLOOKUP(F9,Currency!$E$20:$F$33,2,FALSE),1))","v":{"v":1,"d":"1.00"}},{"$nulls":5},1,0,{"$f":"N9*$G9","v":0},{"$f":"N9*$M9","v":0},{"$f":"O9*$M9","v":0},1,0,{"$f":"S9*$G9","v":0},{"$f":"S9*$R9","v":0},{"$f":"T9*$R9","v":0},1,0,{"$f":"X9*$G9","v":0},{"$f":"X9*$W9","v":0},{"$f":"Y9*$W9","v":0},1,0,{"$f":"AC9*$G9","v":0},{"$f":"AC9*$AB9","v":0},{"$f":"AD9*$AB9","v":0},1,0,{"$f":"AH9*$G9","v":0},{"$f":"AH9*$AG9","v":0},{"$f":"AI9*$AG9","v":0}]
[{"$nulls":4},"Local","ZAR",{"$f":"IF(E10=\"\",\"\",IF(E10=\"Foreign\",VLOOKUP(F10,Currency!$E$20:$F$33,2,FALSE),1))","v":{"v":1,"d":"1.00"}},{"$nulls":6},0,0,{"$f":"N10*$M9","v":0},{"$f":"O10*$M9","v":0},null,0,0,{"$f":"S10*$R9","v":0},{"$f":"T10*$R9","v":0},null,0,0,{"$f":"X10*$W9","v":0},{"$f":"Y10*$W9","v":0},null,0,0,{"$f":"AC10*$AB9","v":0},{"$f":"AD10*$AB9","v":0},null,0,0,{"$f":"AH10*$AG9","v":0},{"$f":"AI10*$AG9","v":0}]
[2,"Solution Implementation","Design","sum","Local","ZAR",{"$f":"IF(E11=\"\",\"\",IF(E11=\"Foreign\",VLOOKUP(F11,Currency!$E$20:$F$33,2,FALSE),1))","v":{"v":1,"d":"1.00"}},1,0,{"$f":"I11*$G11","v":0},{"$f":"I11*$H11","v":0},{"$f":"J11*$H11","v":0}]
[{"$nulls":4},"Local","ZAR",{"$f":"IF(E12=\"\",\"\",IF(E12=\"Foreign\",VLOOKUP(F12,Currency!$E$20:$F$33,2,FALSE),1))","v":{"v":1,"d":"1.00"}},null,0,{"$f":"I12*$G12","v":0},{"$f":"I12*$H11","v":0},{"$f":"J12*$H11","v":0}]
[null,null,"Build, Configure","sum","Local","ZAR",{"$f":"IF(E13=\"\",\"\",IF(E13=\"Foreign\",VLOOKUP(F13,Currency!$E$20:$F$33,2,FALSE),1))","v":{"v":1,"d":"1.00"}},1,0,{"$f":"I13*$G13","v":0},{"$f":"I13*$H13","v":0},{"$f":"J13*$H13","v":0}]
[{"$nulls":4},"Local","ZAR",{"$f":"IF(E14=\"\",\"\",IF(E14=\"Foreign\",VLOOKUP(F14,Currency!$E$20:$F$33,2,FALSE),1))","v":{"v":1,"d":"1.00"}},null,0,{"$f":"I14*$G14","v":0},{"$f":"I14*$H13","v":0},{"$f":"J14*$H13","v":0}]
[null,null,"Testing","sum","Local","ZAR",{"$f":"IF(E15=\"\",\"\",IF(E15=\"Foreign\",VLOOKUP(F15,Currency!$E$20:$F$33,2,FALSE),1))","v":{"v":1,"d":"1.00"}},1,0,{"$f":"I15*$G15","v":0},{"$f":"I15*$H15","v":0},{"$f":"J15*$H15","v":0}]
[{"$nulls":4},"Local","ZAR",{"$f":"IF(E16=\"\",\"\",IF(E16=\"Foreign\",VLOOKUP(F16,Currency!$E$20:$F$33,2,FALSE),1))","v":{"v":1,"d":"1.00"}},null,0,0,{"$f":"I16*$H15","v":0},{"$f":"J16*$H15","v":0}]
[null,null,"Integration (if applicable)","sum","Local","ZAR",{"$f":"IF(E17=\"\",\"\",IF(E17=\"Foreign\",VLOOKUP(F17,Currency!$E$20:$F$33,2,FALSE),1))","v":{"v":1,"d":"1.00"}},1,0,0,{"$f":"I17*$H17","v":0},{"$f":"J17*$H17","v":0}]
[{"$nulls":4},"Local","ZAR",{"$f":"IF(E18=\"\",\"\",IF(E18=\"Foreign\",VLOOKUP(F18,Currency!$E$20:$F$33,2,FALSE),1))","v":{"v":1,"d":"1.00"}},null,0,0,{"$f":"I18*$H17","v":0},{"$f":"J18*$H17","v":0}]
[null,null,"Deployment and Stabilisation","sum","Local","ZAR",{"$f":"IF(E19=\"\",\"\",IF(E19=\"Foreign\",VLOOKUP(F19,Currency!$E$20:$F$33,2,FALSE),1))","v":{"v":1,"d":"1.00"}},1,0,0,{"$f":"I19*$H19","v":0},{"$f":"J19*$H19","v":0}]
[{"$nulls":4},"Local","ZAR",{"$f":"IF(E20=\"\",\"\",IF(E20=\"Foreign\",VLOOKUP(F20,Currency!$E$20:$F$33,2,FALSE),1))","v":{"v":1,"d":"1.00"}},null,0,0,{"$f":"I20*$H19","v":0},{"$f":"J20*$H19","v":0}]
{"$rows_left_out":13}
{"sheet":"Option 3(SaaS - Public Cloud)","index":3,"n_rows":32,"n_cols":46,"rows_kept":32,"merged":[[2,1,2,6],[5,8,5,12],[5,13,5,37],[6,5,6,7],[6,8,6,12],[6,13,6,17],[6,18,6,22],[6,23,6,27],[6,28,6,32],[6,33,6,37],[7,5,7,7],[8,0,9,0],[8,1,9,1],[8,2,9,2],[8,3,9,3],[8,4,9,4],[8,8,9,12],[8,13,9,13],[8,18,9,18],[8,23,9,23],[8,28,9,28],[8,33,9,33],[8,39,9,39],[10,0,21,0],[10,1,21,1],[10,2,11,2],[10,3,11,3],[10,4,11,4],[10,8,11,8],[10,13,21,17],[10,18,21,22],[10,23,21,27],[10,28,21,32],[10,33,21,37],[12,2,13,2],[12,3,13,3],[12,4,13,4],[12,8,13,8],[14,2,15,2],[14,3,15,3],[14,4,15,4],[14,8,15,8],[16,2,17,2],[16,3,17,3],[16,4,17,4],[16,8,17,8],[18,2,19,2],[18,3,19,3],[18,4,19,4],[18,8,19,8],[20,2,21,2],[20,3,21,3],[20,4,21,4],[20,8,21,8],[22,0,25,0],[22,1,25,1],[22,2,23,2],[22,3,23,3],[22,4,23,4],[22,8,23,8],[22,13,25,17],[22,18,25,22],[22,23,25,27],[22,28,25,32],[22,33,25,37],[24,2,25,2],[24,3,25,3],[24,4,25,4],[24,8,25,8],[30,1,30,12],[31,1,54,12]]}
[null,"Pricing Schedule : Income Tax Tool"]
[]
[null,"VENDOR NAME"]
[]
[]
[{"$nulls":8},"SOLUTION IMPLEMENTATION PHASE",{"$nulls":4},"OPERATIONAL PHASE"]
[null," ",{"$nulls":6},"YEAR 1",{"$nulls":4},"YEAR 2",{"$nulls":4},"YEAR 3",{"$nulls":4},"YEAR 4",{"$nulls":4},"YEAR 5",{"$nulls":4},"YEAR 6"]
["Item Number","Category","Description","Total Estimated Quantity","Unit charge","CURRENCY",null,null,"Total Estimated Quantity","Unit Price in Nominated Currency","Unit Price in ZAR","Total [Nominated Currency]","Total in ZAR","Total Estimated Quantity","Unit Price in Nominated Currency","Unit Price in ZAR","Total [Nominated Currency]","Total in ZAR","Total Estimated Quantity","Unit Price in Nominated Currency","Unit Price in ZAR","Total [Nominated Currency]","Total in ZAR","Total Estimated Quantity","Unit Price in Nominated Currency","Unit Price in ZAR","Total [Nominated Currency]","Total in ZAR","Total Estimated Quantity","Unit Price in Nominated Currency","Unit Price in ZAR","Total [Nominated Currency]","Total in ZAR","Total Estimated Quantity","Unit Price in Nominated Currency","Unit Price in ZAR","Total [Nominated Currency]","Total in ZAR",null,"CONTRACT PRICE ADJUSTMENT"]
[1,"Software","Subscription Services",1,"sum",{"$f":"IF(G9=\"\",\"\",IF(G9=\"ZAR\",\"Local\",\"Foreign\"))","v":"Local"},"ZAR",{"$f":"IF(F9=\"\",\"\",IF(F9=\"Foreign\",VLOOKUP(G9,Currency!$E$20:$F$33,2,FALSE),1))","v":{"v":1,"d":"1.00"}},{"$nulls":5},1,0,{"$f":"O9*$H9","v":0},{"$f":"O9*$AH9","v":0},{"$f":"P9*$AH9","v":0},1,0,{"$f":"T9*$H9","v":0},{"$f":"T9*$AH9","v":0},{"$f":"U9*$AH9","v":0},1,0,{"$f":"Y9*$H9","v":0},{"$f":"Y9*$AH9","v":0},{"$f":"Z9*$AH9","v":0},1,0,{"$f":"AD9*$H9","v":0},{"$f":"AD9*$AH9","v":0},{"$f":"AE9*$AH9","v":0},1,0,{"$f":"AI9*$H9","v":0},{"$f":"AI9*$AH9","v":0},{"$f":"AJ9*$AH9","v":0},{"$nulls":7},"DKK"]
[{"$nulls":5},"Local","ZAR",{"$f":"IF(F10=\"\",\"\",IF(F10=\"Foreign\",VLOOKUP(G10,Currency!$E$20:$F$33,2,FALSE),1))","v":{"v":1,"d":"1.00"}},{"$nulls":6},0,0,{"$f":"O10*$AH9","v":0},{"$f":"P10*$AH9","v":0},null,0,0,{"$f":"T10*$AH9","v":0},{"$f":"U10*$AH9","v":0},null,0,0,{"$f":"Y10*$AH9","v":0},{"$f":"Z10*$AH9","v":0},null,0,0,{"$f":"AD10*$AH9","v":0},{"$f":"AE10*$AH9","v":0},null,0,0,{"$f":"AI10*$AH9","v":0},{"$f":"AJ10*$AH9","v":0}]
[2,"Solution Implementation","Design",1,"sum","Local","ZAR",{"$f":"IF(F11=\"\",\"\",IF(F11=\"Foreign\",VLOOKUP(G11,Currency!$E$20:$F$33,2,FALSE),1))","v":{"v":1,"d":"1.00"}},1,0,{"$f":"J11*$H11","v":0},{"$f":"J11*$D11","v":0},0,{"$nulls":32},"HKD"]
[{"$nulls":5},"Local","ZAR",{"$f":"IF(F12=\"\",\"\",IF(F12=\"Foreign\",VLOOKUP(G12,Currency!$E$20:$F$33,2,FALSE),1))","v":{"v":1,"d":"1.00"}},null,0,0,{"$f":"J12*$D11","v":0},{"$f":"K12*$D11","v":0}]
[null,null,"Build, Configure",1,"sum","Local","ZAR",{"$f":"IF(F13=\"\",\"\",IF(F13=\"Foreign\",VLOOKUP(G13,Currency!$E$20:$F$33,2,FALSE),1))","v":{"v":1,"d":"1.00"}},1,0,0,{"$f":"J13*$D12","v":0},0]
[{"$nulls":5},"Local","ZAR",{"$f":"IF(F14=\"\",\"\",IF(F14=\"Foreign\",VLOOKUP(G14,Currency!$E$20:$F$33,2,FALSE),1))","v":{"v":1,"d":"1.00"}},null,0,0,0,0]
[null,null,"Testing",1,"sum","Local","ZAR",{"$f":"IF(F15=\"\",\"\",IF(F15=\"Foreign\",VLOOKUP(G15,Currency!$E$20:$F$33,2,FALSE),1))","v":{"v":1,"d":"1.00"}},1,0,0,0,0]
[{"$nulls":5},"Local","ZAR",{"$f":"IF(F16=\"\",\"\",IF(F16=\"Foreign\",VLOOKUP(G16,Currency!$E$20:$F$33,2,FALSE),1))","v":{"v":1,"d":"1.00"}},null,0,0,0,0]
[null,null,"Integration (if applicable)",1,"sum","Local","ZAR",{"$f":"IF(F17=\"\",\"\",IF(F17=\"Foreign\",VLOOKUP(G17,Currency!$E$20:$F$33,2,FALSE),1))","v":{"v":1,"d":"1.00"}},1,0,0,{"$f":"J17*$D14","v":0},{"$f":"K17*$D14","v":0}]
[{"$nulls":5},"Local","ZAR",{"$f":"IF(F18=\"\",\"\",IF(F18=\"Foreign\",VLOOKUP(G18,Currency!$E$20:$F$33,2,FALSE),1))","v":{"v":1,"d":"1.00"}},null,0,0,{"$f":"J18*$D17","v":0},0]
[null,null,"Deployment and Stabilisation",1,"sum","Local","ZAR",{"$f":"IF(F19=\"\",\"\",IF(F19=\"Foreign\",VLOOKUP(G19,Currency!$E$20:$F$33,2,FALSE),1))","v":{"v":1,"d":"1.00"}},1,0,0,{"$f":"J19*$D16","v":0},{"$f":"K19*$D16","v":0}]
[{"$nulls":5},"Local","ZAR",{"$f":"IF(F20=\"\",\"\",IF(F20=\"Foreign\",VLOOKUP(G20,Currency!$E$20:$F$33,2,FALSE),1))","v":{"v":1,"d":"1.00"}},null,0,0,{"$f":"J20*$D19","v":0},0]
{"$rows_left_out":13}
{"sheet":"Currency","index":4,"n_rows":33,"n_cols":8,"rows_kept":33,"merged":[[1,1,1,5],[6,2,6,7],[7,1,9,1],[7,2,7,7],[7,15,7,20],[8,2,8,7],[9,2,9,7],[10,2,10,7],[11,2,11,7],[12,1,14,1],[12,2,12,7],[13,2,13,7],[14,2,14,7],[17,2,17,7]]}
[]
[null,{"$f":"'Option 1(SaaS - Premise)'!B3","v":"VENDOR NAME"}]
[]
[null,"EXCHANGE RATES FOR MULTIPLE CURRENCIES"]
[]
[null,"NOTES:"]
[null,1,"The table below needs to be completed if the Employer will be exposed to any currency fluctuation as stipulated in Secondary Clause X3.  For conversion of the foreign portions to Rand, please use the South African Reserve Bank's (SARB) exchange rate at 12:00 on the day of advertisement of the bid.  This is in terms of the Preferential Procurement Policy Framework Act (PPPFA) with which the Employer has to comply.\nNB: Tenderers must submit proof of the SARB rate(s) of exchange used  "]
[null,2,"The following URL (electronic route) is to be followed to access the relevant SARB rates on their web pages:\n"]
[null,null,"www.resbank.co.za"]
[null,null,"-  Select Research\n-  Then select Rates\n-  Click on \"Select historical exchange rates and other interest rates\"\n-  Clicking on the exchange rate in the following page opens the daily rates per currency and SA Rand"]
[null,3,"The Employer deals only in the currencies listed below unless other currencies are specifically approved for this tender.  Kindly notify the Employer of any currency that the tenderer intends to use, but is not stipulated in the table, to consider sanctioning such currency.  Sufficient time must be allowed for the assessment and to respond to such request.  The onus is on the tenderer to submit a bid with approved currencies"]
[null,4,"The format in which the exchange rate must be inserted in the table is:  1 (One) Foreign Currency = R Amount  (i.e. the Rand amount for one of each foreign currency applicable).  Exchange rates must be rounded to 4 decimals\n\nNB :  Only the USD/ZAR, GBP/ZAR and EUR/ZAR are published in this way on the SARB web pages above.  The Rand rate with the other currencies must be inverted (1/Foreign Currency Rate) in order to list it in the required format in the table below\n"]
[null,5,"All information in the table below must conform with all other equivalent information in the offer. "]
[null,null,"Payment in terms of Payment Method 2  is considered as a \"foreign payment\" although it will be effected in South African Rand. However, amounts for  \"F.O.R. Price-Goods supplied from Imported Items\", are NOT considered as \"foreign payments\""]
[null,null,"If more than one payment method apply for a currency, the Tenderer must request an additional row be inserted in the table in order to split the values and identify the relevant method.   "]
[]
[]
[null,null,"MULTIPLE CURRENCIES"]
[null,null,"No","Currency Description","Code","Exchange Rate Currency 1,00 =","Date Published","Source"]
[null,null,1,"Australian Dollar","AUD"]
{"$rows_left_out":13}