{"text_format":"3","workbook":"xlsx","n_sheets":5,"sheets":["COVER  ","PREAMBLE","Typical Activity Schedule","Exchange rates","CPA Formula"],"not_rendered":{"images":1,"external_links":16,"defined_names":3829},"read":"whole","date_system":"1900"}

{"sheet":"COVER  ","index":0,"n_rows":37,"n_cols":3,"rows_kept":37,"merged":[[1,1,1,2],[11,1,11,2],[13,1,13,2],[26,8,26,9],[28,8,28,9]]}
{"$rows_empty":11}
[null,"PRICING INFORMATION"]
[]
[null,"REQUEST FOR BIDS"]
[]
[null,"RFB NO."]
[]
[null,"SITENAME","Tutuka Power Plant - Solar Photovoltaic  (Output:28.93MW)"]
[]
[null,"Design, Engineering, Supply, Construction, Installation, Testing, Commissioning, Operation and Maintenance (O&M) 28.93 MW Solar PV Facility at Tutuka Power Station, Mpumalanga"]
[]
[null,"BIDDER’S NAME:  "]
[]
[]
[null,"Design, Engineering,  Supply, Construction, Installation, Testing, Commissioning Cost (excluding VAT)",{"$f":"'Typical Activity Schedule'!M240","v":{"v":0,"d":"R 0.00"}}]
[null,"Operating and Maintenance Cost (O&M) (excluding VAT)",{"v":0,"d":"R 0.00"}]
[null,"THE PRICE:  IN RAND (excluding VAT)\n Grand  TOTALS"]
[null,"Value Added Tax  (VAT) Currently 15%",{"$f":"C25+C27","v":{"v":0,"d":"R 0.00"}}]
[null,"TOTAL RAND VALUE:  IN RAND (Including VAT)"]
[null,"TOTAL RAND VALUE IN WORDS (Including VAT)"]
[]
[]
[null,"DATE :"]
[]
[null,"SIGNATURE :"]
[]
[null,"DESIGNATION :"]

{"sheet":"PREAMBLE","index":1,"n_rows":43,"n_cols":5,"rows_kept":43,"merged":[[0,1,0,2],[5,2,5,3],[6,2,6,3],[7,2,7,3],[8,2,8,3],[9,2,9,3],[10,2,10,3],[11,2,11,3],[12,2,12,3],[13,2,13,3],[14,2,14,3],[15,2,15,3],[16,2,16,3],[17,2,17,3],[18,2,18,3],[19,2,19,3],[20,2,20,3],[21,2,21,3],[22,2,22,3],[23,2,23,3],[24,2,24,3],[25,2,25,3],[26,2,26,3],[27,2,27,3],[28,2,28,3],[29,2,29,3],[30,2,30,3],[31,2,31,3],[32,2,32,3],[33,2,33,3],[34,2,34,3],[35,2,35,3],[36,2,36,3],[37,2,37,3],[38,2,38,3],[39,2,39,3],[40,2,40,3],[41,2,41,3],[42,2,42,3]]}
[null,{"$f":"'COVER  '!C18","v":"Tutuka Power Plant - Solar Photovoltaic  (Output:28.93MW)"}]
[null,"RFB No.",null,{"$f":"IF('COVER  '!C16=\"\",\"\",'COVER  '!C16)","v":""},{"$f":"IF('COVER  '!B17=\"\",\"\",'COVER  '!B17)","v":""}]
[null,"BIDDER'S NAME:",null,{"$f":"IF('COVER  '!C22=\"\",\"\",'COVER  '!C22)","v":""}]
[]
[null,"PREAMBLE TO PRICE SCHEDULE "]
[null,1,"SCOPE GENERALLY"]
[null,1.1,"The price activity schedule is for the Engineering, Procurement and Construction (EPC) , on a lump-sum basis under an EPC, It should include all studies, permitting, design, engineering, procurement, manufacturing, deliveries to Site, execution, erection, commissioning, testing, completion, operation and maintenance (O&M) until the end of the Defects Liability Period, making good defects and warranty cover during the Defects Liability Period, and other works necessary to construct a solar photovoltaic (PV) power Plant , the access road, the Site facilities and any additional infrastructure as per EMPLOYER’S REQUIREMENTS "]
[null,1.2,"The contract price shall be based upon the Bid that offers required capacity .\nThe provided activity schedule shall be deemed as a general guide only/ typical example. The Bidder's may  provide their own preferred breakdown as per Employer's requirements.  The Contractor shall use other documents provided as reference.  The prices provided shall include the cost of all required equipment, tools, material, labour, and supervision for the EPC of a complete commissioned component or system.  Any expected wastage of materials and components shall be included in the pricing provided."]
[null,2,"UNIT OF MEASUREMENT"]
[null,2.1,"Units of measurement  or quantity i.e., Number (no),  Lump Sum (Sum) or Item, are associated as applicable with the items as listed in the Activity Schedules."]
[null,3,"DOCUMENTS SHALL BE MUTUALLY SELF EXPLANATORY"]
[null,3.1,"The Conditions of Contract, together with the Employer's Requirements, etc. shall be read in conjunction with the Bidder's  Activity  Schedules and in so far as they are relevant."]
[null,4,"ACTIVITY SCHEDULES AND BID PRICES"]
[null,4.2,"The Bidder's Activity Schedules shall contains, as far as can be determined, full details of the work that is to be executed by the Contractor and the materials that are to be supplied.  It should, however, not be presumed that the Schedule includes and describes every detail of the Contract Works.  Where any work or activities to be executed are described or implied without corresponding items appearing in the Price Schedules, the Contractor shall add such items in the price activity schedule. "]
[null,4.3,"No claims arising from errors, omissions or misunderstandings, shall be accepted after the closing date of the BID."]
[null,5,"PRICES SHALL BE COMPREHENSIVE"]
[null,5.1,"The rates and prices inserted in the Activity Schedules shall be fully inclusive of the works as per Employer's requirements. Such prices shall cover all costs and expenses that may be required in and for the completion of the work described and shall cover the cost of all general risks, liabilities and obligations set forth or implied in the Contract Documents."]
[null,5.2," The Bidder can cost for supply , design etc. in local currency or combination of foreign and local currency."]
[null,5.3," Operation  & Maintenance (O&M)  shall be priced for Years 1 - 2 to determine the O&M Contract value.\n"]
[null,5.4,"A price or rate is to be entered against each item in the Activity Schedules.  Items against which no price or rate is entered by the Contractor will not be paid for when executed but will be considered as covered by prices and rates elsewhere in the Activity Schedules."]
[null,5.5,"The Activity Schedules shall be divided into various sections for the convenience of pricing and measurement of the work. "]
[null,5.6,"The Activity Schedule shall include but not limited to Description, Unit, Currency, RoE, Unit of measurements, Quantities,  Rates and Total  Amounts. As shown on typical Activity Schedule herein. "]
[null,6,"ALTERATIONS TO THE ACTIVITY SCHEDULES"]
[null,6.1,"Bidders may alter the Typical Activity schedule provided herein, and or the Bidder's may  provide their own preferred breakdown as per Employer's requirements."]
[null,7,"ERRORS"]
[null,7.1,"In the event of any arithmetical errors occurring in the totals from Submitted Activity Schedules such totals will be corrected on the assumption that the rates quoted are correct."]
[null,8,"VALUE ADDED TAX"]
[null,8.1,"The work under this Contract is classified as a taxable service under VAT and therefore the Contractor will collect VAT from the Employer and will pay the VAT over to the Receiver of Revenue for the work executed under this Contract. "]
[null,9,"ACTIVITY SCHEDULES "]
[null,9.1," The Bids shall be quoted in the currencies of the bidder's choice (limited to a total of 3 different currencies of which one shall be ZAR) and these currencies and quoted price have to be included in the Letter of Bid accordingly.  The different currencies will be stated in the \"Exchange Rates\" worksheets and indicated in the Price Schedules where applicable."]
[null,9.2,"The total of the prices shall include for all direct and indirect costs, overheads, profits, on costs, risks, liabilities, obligations, etc. relative to the contract and all taxes including customs duties on imported Plant to authorities and Excluding VAT on all items. \n \n"]
[null,9.3,"The Contractor shall allow for all necessary costs to complete the Works as required in terms of the Employer's requirements whether expressly stated or not in the Bidder's Activity schedule. "]
[null,9.4,"Contractor to check and take responsibility for all descriptions, formulae, and structure of their Activity Schedule."]
[null,9.5,"Where reference is made to the \"Contractor\" in these documents it will mean \"Bidder\" or \"Vice versa\" during the bidding process."]
[null,9.6,"The Bidder's Activity Schedule provides the basis of all valuations of the work, payments in multiple currencies, price adjustment (CPA) and general progress monitoring."]
[null,10,"INSURANCE"]
[null,10.1,"Insurances shall be as per NEC ECC contract"]
[null,11,"CONTRACT PRICE ADJUSTMENTS"]
[null,11.1,"For detailed instructions - refer to NEC ECC Contract  (X1) Clause"]
[null,11.2,"The Contractor shall propose CPA formula on the attached CPA template provided. "]
{"$rows_left_out":4}
{"sheet":"Typical Activity Schedule","index":2,"n_rows":252,"n_cols":21,"rows_kept":252,"merged":[[0,1,0,14],[1,1,1,14],[2,1,2,14],[3,1,3,14],[4,1,4,14],[5,1,5,14],[6,1,7,1],[6,2,7,2],[6,3,7,3],[6,4,7,4],[6,5,7,6],[6,7,6,12],[6,13,7,13],[6,14,7,14],[8,1,8,14],[22,1,22,4],[28,1,28,4],[35,1,35,14],[36,1,36,4],[36,8,36,11],[40,1,40,4],[40,8,40,11],[45,1,45,4],[45,8,45,11],[50,1,50,4],[50,8,50,11],[57,1,57,14],[58,1,58,4],[58,8,58,11],[65,1,65,4],[65,8,65,11],[72,1,72,4],[72,8,72,11],[79,1,79,4],[79,8,79,11],[86,1,86,14],[87,1,87,4],[87,8,87,11],[95,1,95,4],[95,8,95,11],[102,1,102,4],[102,8,102,11],[109,1,109,4],[109,8,109,11],[116,1,116,4],[116,8,116,11],[123,1,123,4],[123,8,123,11],[130,1,130,4],[130,8,130,11],[137,1,137,4],[137,8,137,11],[144,1,144,14],[145,1,145,4],[145,8,145,11],[152,1,152,4],[152,8,152,11],[159,1,159,4],[159,8,159,11],[166,1,166,4],[166,8,166,11],[173,1,173,4],[173,8,173,11],[180,1,180,14],[181,1,181,4],[181,8,181,11],[186,1,186,4],[186,8,186,11],[191,1,191,4],[191,8,191,11],[196,1,196,14],[197,1,197,4],[197,8,197,11],[204,1,204,4],[204,8,204,11],[211,1,211,14],[212,1,212,4],[212,8,212,11],[219,1,219,14],[220,1,220,4],[220,8,220,11],[227,1,227,14],[228,1,228,4],[230,1,230,4],[232,1,232,4],[234,1,234,14],[235,1,235,4],[239,1,239,11],[241,3,241,9],[242,1,242,4],[243,1,243,4],[243,8,243,11],[248,2,248,3],[248,4,248,5],[248,6,248,7],[248,8,248,9],[250,3,250,9],[251,3,251,9],[252,3,252,9]]}
[]
[null,"Tutuka Power Station "]
[null,{"$f":"PREAMBLE!B1","v":"Tutuka Power Plant - Solar Photovoltaic  (Output:28.93MW)"}]
[null,"Activity Schedule (Rev- 00) "]
[]
[{"$nulls":16},"Local "]
[null,"Item No.","Section Number","Description","Activity","Currency",{"$nulls":7},"CPA","CPA Description",null,"Foreign"]
[{"$nulls":7},"RoE Currency\n1,00 = ZAR","Unit","QTY","Local Currency Rate","Foreign Currency Rate","Total Amount converted to ZAR"]
[{"$nulls":15},"Month-01","Month-02","Month-03","Month-04","Month-05","Month-06"]
[]
[null,"Fixed Charges",{"$nulls":12},{"$f":"IF(D11<>\"\",VLOOKUP(D11,'[13]5.1.4 Price adjustment formulae'!$A$8:$B$19,2,FALSE),\"\")","v":""}]
[null,128,"KPV35","Establishment of facilities on site","Preliminaries","Local ","ZAR",{"v":1,"d":"1.00"},"Item",1,null,0,{"$f":"J12*L12*H12","v":0},"-","Fixed"]
[null,129,{"$f":"C12","v":"KPV35"},"Other contractual requirements","Preliminaries","Local ","ZAR",{"v":1,"d":"1.00"},"Item",1,null,0,{"$f":"J13*L13*H13","v":0},"-","Fixed"]
[null,130,{"$f":"C13","v":"KPV35"},"Environmental related costs","Preliminaries","Local ","ZAR",{"v":1,"d":"1.00"},"Item",1,null,0,0,"-","Fixed"]
[null,{"$f":"B14+1","v":131},"KPV35","Health & Safety related costs","Preliminaries","Local ","ZAR",{"v":1,"d":"1.00"},"Item",1,null,0,0,"-","Fixed"]
[null,{"$f":"B15+1","v":132},"KPV35","Quality related costs","Preliminaries","Local ","ZAR",{"v":1,"d":"1.00"},"Item",1,null,0,0,"-","Fixed"]
[null,133,"KPV35","Training related costs","Preliminaries","Local ","ZAR",{"v":1,"d":"1.00"},"Item",1,null,0,0,"-","Fixed"]
[null,134,"KPV35","Medical tests / Induction training","Preliminaries","Local ","ZAR",{"v":1,"d":"1.00"},"Item",1,null,0,0,"-","Fixed"]
[null,135,"KPV35","Staff transportation","Preliminaries","Local ","ZAR",{"v":1,"d":"1.00"},"Item",1,null,0,0,"-","Fixed"]
[null,136,"KPV35","Staff accommodation","Preliminaries","Local ","ZAR",{"v":1,"d":"1.00"},"Item",1,null,0,{"$f":"J20*L20*H20","v":0},"-","Fixed"]
[null,137,"KPV35","Access & permits","Preliminaries","Local ","ZAR",{"v":1,"d":"1.00"},"Item",1,null,0,0,"-","Fixed"]
[null,138,"KPV35","Site de-establishment","Preliminaries","Local ","ZAR",{"v":1,"d":"1.00"},"Item",1,null,0,0,"-","Fixed"]
[null,"Time Related Charges"]
[null,{"$f":"B22+1","v":139},{"$f":"C22","v":"KPV35"},"Management","Preliminaries","Local ","ZAR",{"v":1,"d":"1.00"},"Item",1,null,0,{"$f":"J24*L24*H24","v":0},"-","Fixed"]
[null,{"$f":"B24+1","v":140},{"$f":"C24","v":"KPV35"},"Project Management during construction period","Preliminaries","Local ","ZAR",{"v":1,"d":"1.00"},"Item",1,null,0,{"$f":"J25*L25*H25","v":0},"-","Fixed"]
[null,141,{"$f":"C25","v":"KPV35"},"Supervision during construction period","Preliminaries","Local ","ZAR",{"v":1,"d":"1.00"},"Item",1,null,0,{"$f":"J26*L26*H26","v":0},"-","Fixed"]
[null,142,{"$f":"C26","v":"KPV35"},"Specialist during construction period","Preliminaries","Local ","ZAR",{"v":1,"d":"1.00"},"Item",1,null,0,{"$f":"J27*L27*H27","v":0},"-","Fixed"]
[null,143,"KPV35","Site related cost","Preliminaries","Local ","ZAR",{"v":1,"d":"1.00"},"Item",1,null,0,{"$f":"J28*L28*H28","v":0},"-","Fixed"]
[null,"Value Related Charges",{"$nulls":7},1,null,0,{"$f":"J30*L30*H30","v":0}]
[null,{"$f":"B28+1","v":144},{"$f":"C28","v":"KPV35"},"Performance Bonds","Preliminaries","Local ","ZAR",{"v":1,"d":"1.00"},"Item",1,null,0,null,"-","Fixed"]
[null,{"$f":"B30+1","v":145},{"$f":"C30","v":"KPV35"},"Retention Bonds","Preliminaries","Local ","ZAR",{"v":1,"d":"1.00"},"Item",1,null,0,{"$f":"J31*L31*H31","v":0},"-","Fixed"]
[null,{"$f":"B31+1","v":146},{"$f":"C31","v":"KPV35"},"Cost of SDL & I Performance Security","Preliminaries","Local ","ZAR",{"v":1,"d":"1.00"},"Item",1,null,0,0,"-","Fixed"]
[null,{"$f":"B32+1","v":147},"KPV35","Workers Insurance","Preliminaries","Local ","ZAR",{"v":1,"d":"1.00"},"Item",1,null,0,0,"-","Fixed"]
[null,{"$f":"B33+1","v":148},"KPV35","Works Insurance","Preliminaries","Local ","ZAR",{"v":1,"d":"1.00"},"Item",1,null,0,0,"-","Fixed"]
[null,{"$f":"B34+1","v":149},"KPV35","Security for the Works","Preliminaries","Local ","ZAR",{"v":1,"d":"1.00"},"Item",1,null,0,0,"-","Fixed"]
[null,"Civil Works"]
[null,"Site clearance"]
[null,{"$f":"1","v":1},"KPV02","Diggings including removal of trees, tree stumps and clearing of site ","Design","Local","ZAR",{"v":1,"d":"1.00"},"Item",1,null,0,{"$f":"H38*J38*L38","v":0},"-","Fixed"]
[null,{"$f":"B38+1","v":2},{"$f":"C38","v":"KPV02"},"Diggings including removal of trees, tree stumps and clearing of site ","Construction, Erection, Installation","Local","ZAR",{"v":1,"d":"1.00"},"Item",1,null,0,{"$f":"H39*J39*L39","v":0},"-","Fixed"]
[null,{"$f":"B39+1","v":3},{"$f":"C39","v":"KPV02"},"Diggings including removal of trees, tree stumps and clearing of site ","Site Acceptance Test","Local","ZAR",{"v":1,"d":"1.00"},"Item",1,null,0,0,"-","Fixed"]
{"$rows_left_out":213}
{"sheet":"Exchange rates","index":3,"n_rows":33,"n_cols":8,"rows_kept":33,"merged":[[0,0,0,1],[0,2,0,4],[1,0,1,1],[1,2,1,4],[2,0,2,1],[2,2,2,4],[3,0,3,1],[3,2,3,4],[8,1,8,6],[9,0,11,0],[9,1,9,6],[9,14,9,19],[10,1,10,6],[11,1,11,6],[12,1,12,6],[13,1,13,6],[17,7,17,12]]}
["Enquiry No.",null,{"$f":"'[14]Tender Cover Sheet'!C12","v":0}]
["Package Name:",null,"Tutuka Power Plant - Solar Photovoltaic  (Output:28.93MW)"]
["Tenderer's Name:",null,{"$f":"'[15]Tender Cover Sheet'!C16","v":0}]
["Category of Offer:",null,{"$f":"'[15]Read Me'!C4","v":0}]
[]
["5.1.4 EXCHANGE RATES FOR MULTIPLE CURRENCIES"]
[]
["NOTES:"]
[1,"The table below needs to be completed if the Employer will be exposed to any currency fluctuation as stipulated in Secondary Clause X3.  For conversion of the foreign portions to Rand, please use the South African Reserve Bank's (SARB) exchange rate at 12:00 on the day of advertisement of the bid.  This is in terms of the Preferential Procurement Policy Framework Act (PPPFA) with which the Employer has to comply.\nNB: Tenderers must submit proof of the SARB rate(s) of exchange used  "]
[2,"The following URL (electronic route) is to be followed to access the relevant SARB rates on their web pages:\n"]
[null,"www.resbank.co.za"]
[null,"-  Select Research\n-  Then select Rates\n-  Click on \"Select historical exchange rates and other interest rates\"\n-  Clicking on the exchange rate in the following page opens the daily rates per currency and SA Rand"]
[3,"The Employer deals only in the currencies listed below unless other currencies are specifically approved for this tender.  Kindly notify the Employer of any currency that the tenderer intends to use, but is not stipulated in the table, to consider sanctioning such currency.  Sufficient time must be allowed for the assessment and to respond to such request.  The onus is on the tenderer to submit a bid with approved currencies"]
[4,"The format in which the exchange rate must be inserted in the table is:  1 (One) Foreign Currency = R Amount  (i.e. the Rand amount for one of each foreign currency applicable).  Exchange rates must be rounded to 4 decimals\n\nNB :  Only the USD/ZAR, GBP/ZAR and EUR/ZAR are published in this way on the SARB web pages above.  The Rand rate with the other currencies must be inverted (1/Foreign Currency Rate) in order to list it in the required format in the table below\n"]
[" "]
["EXCHANGE RATES PUBLISHED BY SARB"]
["NB: Tenderers must submit proof of the SARB rate (s) of exchange used."]
[{"$nulls":4},"Date for which the rates are published :",null,null,"Date to be inserted in the following format: Day, Month and Year.\n\nMust be the SARB rate at 12:00 on day of advertisement of bid"]
["No","Currency Description","Code","Exchange Rate\nCurrency 1,00 = R Amount","Payment Method 1a, 1b or 2","Source"]
[1,"South African Rand","ZAR",{"v":1,"d":"R 1.00"}]
[2,"Australian Dollar","AUD",{"v":0,"d":"R 0.00"}]
[3,"Canadian Dollar","CAN",{"v":0,"d":"R 0.00"}]
[4,"Swiss Franc","CHF",{"v":0,"d":"R 0.00"}]
[5,"Danish Krone","DKK",{"v":0,"d":"R 0.00"}]
[6,"European Currency","EUR",{"v":0,"d":"R 0.00"}]
[7,"British Pound","GBP",{"v":0,"d":"R 0.00"}]
[8,"Hong Kong Dollar","HKD",{"v":0,"d":"R 0.00"}]
[9,"Japanese Yen","JPY",{"v":0,"d":"R 0.00"}]
[10,"Norwegian Krone","NOK",{"v":0,"d":"R 0.00"}]
[11,"New Zealand Dollar","NZD",{"v":0,"d":"R 0.00"}]
[12,"Swedish Krone","SEK",{"v":0,"d":"R 0.00"}]
[13,"Singapore Dollar","SGD",{"v":0,"d":"R 0.00"}]
[14,"United States Dollar","USD",{"v":0,"d":"R 0.00"}]

{"sheet":"CPA Formula","index":4,"n_rows":148,"n_cols":14,"rows_kept":148,"merged":[[0,0,0,1],[1,0,1,1],[2,0,2,1],[3,0,3,1],[5,0,5,4],[8,2,8,3],[8,5,8,7],[9,2,9,4],[9,5,18,7],[10,2,10,4],[11,2,11,4],[12,2,12,4],[13,2,13,4],[14,2,14,4],[15,2,15,4],[16,2,16,4],[17,2,17,4],[18,2,18,4],[21,1,21,6],[22,1,22,6],[25,1,25,6],[26,1,26,6],[27,1,27,6],[28,1,28,6],[29,1,29,6],[30,1,30,6],[32,1,32,6],[33,1,33,6],[34,1,34,6],[35,1,35,6],[36,1,36,6],[40,1,40,6],[51,1,51,6],[62,1,62,6],[73,1,73,6],[84,1,84,6],[95,1,95,6],[106,1,106,6],[117,1,117,6],[128,1,128,6],[139,1,139,6]]}
["Enquiry No."]
["Project Name:",null,"Tutuka Power Plant - Solar Photovoltaic  (Output:28.93MW)"]
["Tenderer's Name:"]
["Category of Offer:",null,{"$f":"'[16]Read Me'!C4","v":"Main Offer Only"}]
[]
["5.1.2 CONTRACT PRICE ADJUSTMENT (CPA) FOR INFLATION"]
[]
["No.","Formula Code","Summary of the description of the Tenderer's Formulae"]
[1,"Fixed","Firm and Fixed ",null,null,"Prices are 100 % fixed and firm. CPA is not applicable. "]
[2,"A","Tenderer's description of Formula A",null,null,"Type in the description of each formula in the tables below"]
[3,"B","Tenderer's description of Formula B"]
[4,"C","Tenderer's description of Formula C"]
[5,"D","Tenderer's description of Formula A"]
[6,"E",{"$f":"B85","v":"Tenderer's description of Formula E"}]
[7,"F",{"$f":"B96","v":"Tenderer's description of Formula F"}]
[8,"G",{"$f":"B107","v":"Tenderer's description of Formula G"}]
[9,"H",{"$f":"B118","v":"Tenderer's description of Formula H"}]
[10,"I",{"$f":"B129","v":"Tenderer's description of Formula I"}]
[11,"J",{"$f":"B140","v":"Tenderer's description of Formula J"}]
[]
["SPECIFIC REQUIREMENTS"]
[{"v":1,"d":"1."},"Only Main Offer is to be submitted. Main offer tenderers are to fully comply with the requirements in the General Notes and CPA Formulae Notes below."]
[{"v":2,"d":"2."},"No ALTERNATIVE offers are accepted."]
[]
["GENERAL NOTES :"]
[1,"References to \"indices\" below mean \"cost indices or reference prices\"."]
[2,"Where 5 year historical information must be provided as instructed below, internet address references which are accessible to the general public may be submitted by the Tenderer instead, with the specific electronic route and web page reflecting the applicable data."]
[3,"The worksheet  CPA Formula in 5.1.2. has to be populated by the tenderer (columns B - J), unless the tenderer’s prices are fixed and firm for the duration of the contract. Each CPA formula must add up to a total of 100%.  All columns are to be populated. No inhouse CPA indices may be used. Tenderers are to provide all requested information.CPA Formulae should represent cost breakdown of the goods/commodities/components/items being sourced.\n"]
[4,"CPA Formulae Codes Column N 5.1.1 Pricing is to be populated by the tenderer by selecting the respective drop down codes CPA formula as  developed by Tenderer in 5.1.2 CPA formulae worksheet   (e.g. Formula A-J ) then  the tenderer must populate their respective CPA formula in  5.1.2 CPA Formulae Worksheet. Codes and descriptions must be selected by the tenderer and inserted into each row of activity. "]
[5,"Prices will be fixed and firm for the first twelve (12) months after contract signing date and escalated on an annual basis based on the CPA formula agreed on with tenderer."]
[6,"The CPA escalation will be calculated as follows: latest index which is the latest available index at the end of each contractual year vs. the base index which is one month prior to tender closing date. "]
["CPA FORMULA NOTES :"]
[1,"Proportions/weightings in CPA Formulae: The fixed portion of each formula, not subject to CPA, must be at least 15% but Tenderers may submit higher fixed portion percentages.  The other constituent indices and their proportions in each formula must be realistic and relative to the applicable work. The fixed portion and other proportions must add up to 100%.   "]
[2,"Formulae must be linked to independent cost indices or other benchmarks (\"reference prices\") and must be clearly and completely defined. The source must be a recognised and independent statistical publishing organisation.  The Tenderers' in-house indices may not be used."]
[3,"Local Price CPA: Where local indices other than those published by SEIFSA or Statistics SA are specified, the Tenderer must submit 5 years' of month by month historical data for such indices.  The Tenderer must ensure that indices are published and recommended by the source thereof as applicable to the work involved and that they are still in force/use and applicable at the date of submission of the tender. "]
[4,"CPA Base Date: The CPA base date for calculating price movements will be the Base Date, Month before Tender closes. For indices or reference prices published as at certain dates, and where such a date is not the Base Date, the latest date for which it is published before the Base Date will be considered as the Base Date index or reference price.  In instances where the figure or value is not as at the Base Date or considered as the Base Date Index or reference price as explained herein, the date, figure or value as well as the reason for the deviation must be clearly separately stated and must be realistic for purposes of CPA.  "]
[5,"Base Date Index :   The base index or reference price must be inserted in the appropriate column."]
[" "," "]
[]
[]
{"$rows_left_out":108}