{"text_format":"3","workbook":"xlsx","n_sheets":7,"sheets":["RFI Cover Sheet","5.1.0 Preamble","5.1.1 Price Table 1-17","5.1.2 CPA Formulae","5.1.3 Summary","5.1.4 PS5","5.1.4 Exchange Rates"],"not_rendered":{"images":1,"defined_names":12},"read":"whole","date_system":"1900"}

{"sheet":"RFI Cover Sheet","index":0,"n_rows":44,"n_cols":4,"rows_kept":44}
{"$rows_empty":9}
[null,"PRICING INFORMATION"]
[]
[null,"RFI No.","E2396NTCSAMWP"]
[]
[null,"NAME OF PACKAGE:","Supply, Delivery, Design, Installation, Commissioning, Support and Training on Environmental Racks with Built-in Air Conditioning, Noise Reduction Solutions, Heat Management Systems and Security Access Control for Substation Environments, on an as and when required basis"]
[]
[null,"SUPPLIER’S NAME:  "]
[]
[null,"CATEGORY OF OFFER (MAIN OFFER ONLY):","RFI"]
[]
[null," PRICE:  IN ZAR",{"$f":"'5.1.3 Summary'!F28","v":{"v":0,"d":"  0  RAND"}}]
[null,"(excluding VAT)"]
[]
[null,"RAND VALUE IN WORDS","[Price in Words]"]
[]
[]
[]
[]
[null," PRICE:  IN ZAR",{"$f":"'5.1.3 Summary'!F30","v":{"v":0,"d":"  0  RAND"}}]
[null,"(including VAT)"]
[]
[null,"DATE :"]
[]
[]
[]
[null,"FULL NAMES OF SIGNATORY:"]
[]
[]
[]
{"$rows_left_out":7}
{"sheet":"5.1.0 Preamble","index":1,"n_rows":18,"n_cols":3,"rows_kept":18,"merged":[[0,0,0,1],[1,0,1,1],[2,0,2,1],[3,0,3,1],[7,1,7,2],[8,1,8,2],[9,1,9,2],[10,1,10,2],[11,1,11,2],[12,1,12,2],[13,1,13,2],[14,1,14,2],[15,1,15,2],[16,1,16,2],[17,1,17,2]]}
["RFI No.",null,{"$f":"'RFI Cover Sheet'!C12","v":"E2396NTCSAMWP"}]
["Package Name:",null,{"$f":"'RFI Cover Sheet'!C14","v":"Supply, Delivery, Design, Installation, Commissioning, Support and Training on Environmental Racks with Built-in Air Conditioning, Noise Reduction Solutions, Heat Management Systems and Security Access Control for Substation Environments, on an as and when required basis"}]
["Supplier's Name:",null,{"$f":"'RFI Cover Sheet'!C16","v":0}]
["Category of Offer:",null,"RFI"]
[]
["5.1.0 PREAMBLE TO PRICE SCHEDULE "]
[]
[1,"The Price Schedule provides the basis of valuation, price adjustment (CPA) formulae and information for general contract progress monitoring.The units herein are estimates only and are non-committal.  No alternative offers are accepted."]
[2,"This is the main data entry sheet to be completed. The Supplier  takes responsibility for ensuring correct inputs. Supplier(s) to populate their pricing information as stipulated in the pricing schedule. The pricing schedule may not be changed or altered. Supplier(s) to populate all required information on the RFI cover sheet and also populate  as stipulated in  (5.1.1 Pricing )  (5.1.2 CPA Formulae) and (5.1.4 Exchange rates). CPA Formulae should represent cost breakdown of the goods/commodities/components/items being sourced."]
[3,"The Prices are the amounts stated in the price column of the Price Schedule.  Where an estimated quantity is stated for an item in the Price Schedule, the Price is calculated by multiplying the estimated quantity by the rate."]
[4,"If the Supplier has decided not to identify a particular item in the price schedule at the time of RFI the cost to the Supplier of doing the work is assumed to be included in, or spread across, the other Prices and rates in the price schedule in order to fulfil the obligation to Provide the Goods and Services for the tendered total of the Prices.  "]
[5,"The total of the prices must include for all direct and indirect costs, overheads, profit on costs, risks, liabilities, obligations, etc. relative to the contract."]
[6,"The Supplier must allow for all necessary costs to complete the pricing shedule as required in terms of the specifications, technical scope and conditions of contract whether expressly stated or not in the Price Schedules. The Supplier must provide any breakdown of prices as may be required for specific items not detailed in the Price Schedule."]
[7,"The Prices should be exclusive and inclusive of VAT."]
[8," Please note, that the Supplier is to input the VAT amount as no formulae has been provided for the VAT portion."]
[9,"All worksheets in this Pricing Schedule are to be submitted. Supplier(s) are not allowed to ommit a worksheet. If specifically worksheets, 5.1.1 or 5.1.2 are ommited, it will be deemed that CPA  are not applicable. Rate of exchange (ROE) cannot be accepted by NTCSA to form part of any CPA formulae."]
[10,"Only Light Green highlighted cells are to be inputted by the Supplier."]
[11,"There will be no inputting in Grey highlighted cells."]

{"sheet":"5.1.1 Price Table 1-17","index":2,"n_rows":303,"n_cols":27,"rows_kept":303,"merged":[[8,1,8,3],[9,1,9,3],[11,5,11,6],[11,7,11,11],[11,12,11,14],[11,15,11,26],[12,0,13,0],[12,1,13,1],[12,2,13,2],[12,3,13,3],[12,4,13,4],[12,5,13,5],[12,6,13,6],[12,7,13,7],[12,8,13,8],[12,9,13,9],[12,10,13,10],[12,11,13,11],[12,12,13,12],[12,13,13,13],[12,14,13,14],[12,15,13,15],[12,16,13,25],[12,26,13,26],[301,7,301,9]]}
["Enquiry No.",{"$f":"'RFI Cover Sheet'!C12","v":"E2396NTCSAMWP"}]
["Package Name:",{"$f":"'RFI Cover Sheet'!C14","v":"Supply, Delivery, Design, Installation, Commissioning, Support and Training on Environmental Racks with Built-in Air Conditioning, Noise Reduction Solutions, Heat Management Systems and Security Access Control for Substation Environments, on an as and when required basis"}]
["Supplier's Name:"]
["Category of Offer:","RFI"]
[]
["5.1.1. Pricing"]
[]
["NOTES:"]
[1,"NB - Column F & Column N in 5.1.1 Pricing is a  drop down cell for supplier to select the Currency and CPA formula chosen that they would have populated in 5.1.2 CPA Formulae and 5.1.4 Exchange Rates. It is the Supplier's responsibility to ensure that Column H correctly reflects the intention of the Supplier."]
[2,"CPA Formulae Codes Column I 5.1.1 Pricing is to be populated by the supplier by selecting the respective drop down codes CPA formula as  developed by Supplier in 5.1.2 CPA formulae worksheet   (e.g. Formula A - J ) then  the tenderer must populate their respective CPA formula in  5.1.2 CPA Formulae Worksheet. Codes and descriptions must be selected by the supplier and inserted into each row of activity. "]
[]
[{"$nulls":5},"Local Currency",null,"Foreign Currency",{"$nulls":4},"Local + Foreign",null,null,"CPA"]
["Line No.","Activity description","Notes","Unit of measure"," Quantities","Tendered Rates (ZAR)","Total Tendered Value (ZAR)","Currency Code (See Sheet 5.1.4 Rate of Exchange)","RoE Currency 1,00 = ZAR","Unit Price in Foreign Currency","Total Foreign Price in Foreign Currency","Total Foreign Price in Local Currency (ZAR)","Tendered Price Excld. Vat (ZAR)","Vat ","Tendered Price Including Vat (ZAR)","CPA Formula No.\n(See Sheet 5.1.2)","CPA Formula No.\n(See Sheet 5.1.2)",{"$nulls":9},"CPA Description\n(See Sheet 5.1.2)"]
[]
[null,"List of required items and services"]
[]
["Table 1","CONFIGURATION 1: STANDARD CABINET (BASIC)"]
["1.1","47U Standard 19\" Cabinet (600x600mm)","Drawing 0.53-1833 Standard equipment cabinet, 240-60725641","Each",1,null,0,"ZAR",{"v":1,"d":"1.0000"},null,0,0,0,0,0,{"$nulls":11},{"$f":"IF(P18=\"\",\"Fixed\",VLOOKUP(P18,'5.1.2 CPA Formulae'!$B$9:$E$20,2,FALSE))","v":"Fixed"}]
["1.2","Fixed and sliding rack shelves",null,"Each",1,null,0,"ZAR",{"v":1,"d":"1.0000"},null,0,0,0,0,0,{"$nulls":11},{"$f":"IF(P19=\"\",\"Fixed\",VLOOKUP(P19,'5.1.2 CPA Formulae'!$B$9:$E$20,2,FALSE))","v":"Fixed"}]
["1.3","Vertical and horizontal cable management","Horizontal and vertical managers","Each",1,null,0,"ZAR",{"v":1,"d":"1.0000"},null,0,0,0,0,0,{"$nulls":11},{"$f":"IF(P20=\"\",\"Fixed\",VLOOKUP(P20,'5.1.2 CPA Formulae'!$B$9:$E$20,2,FALSE))","v":"Fixed"}]
["1.4","Cable entry gland plate / brush strip",null,"Each",1,null,0,"ZAR",{"v":1,"d":"1.0000"},null,0,0,0,0,0,{"$nulls":11},{"$f":"IF(P21=\"\",\"Fixed\",VLOOKUP(P21,'5.1.2 CPA Formulae'!$B$9:$E$20,2,FALSE))","v":"Fixed"}]
["1.5","Lockable front & rear doors (or lock set)",null,"Each",1,null,0,"ZAR",{"v":1,"d":"1.0000"},null,0,0,0,0,0,{"$nulls":11},{"$f":"IF(P22=\"\",\"Fixed\",VLOOKUP(P22,'5.1.2 CPA Formulae'!$B$9:$E$20,2,FALSE))","v":"Fixed"}]
["1.6","Earthing/grounding kit","Earthing ","Each",1,null,0,"ZAR",{"v":1,"d":"1.0000"},null,0,0,0,0,0,{"$nulls":11},{"$f":"IF(P23=\"\",\"Fixed\",VLOOKUP(P23,'5.1.2 CPA Formulae'!$B$9:$E$20,2,FALSE))","v":"Fixed"}]
["1.7","Basic PDU (Power Distribution Unit)","PDU","Each",1,null,0,"ZAR",{"v":1,"d":"1.0000"},null,0,0,0,0,0,{"$nulls":11},{"$f":"IF(P24=\"\",\"Fixed\",VLOOKUP(P24,'5.1.2 CPA Formulae'!$B$9:$E$20,2,FALSE))","v":"Fixed"}]
["1.8","Blanking panels & mounting hardware",null,"Each",1,null,0,"ZAR",{"v":1,"d":"1.0000"},null,0,0,0,0,0,{"$nulls":11},{"$f":"IF(P25=\"\",\"Fixed\",VLOOKUP(P25,'5.1.2 CPA Formulae'!$B$9:$E$20,2,FALSE))","v":"Fixed"}]
["1.9","Labelling kit and rack ID plates","Top and bottom vented panels","Each",1,null,0,"ZAR",{"v":1,"d":"1.0000"},null,0,0,0,0,0,{"$nulls":11},{"$f":"IF(P26=\"\",\"Fixed\",VLOOKUP(P26,'5.1.2 CPA Formulae'!$B$9:$E$20,2,FALSE))","v":"Fixed"}]
["1.10","Delivery","Price per km","Each",1,null,0,"ZAR",{"v":1,"d":"1.0000"},null,0,0,0,0,0,{"$nulls":11},{"$f":"IF(P27=\"\",\"Fixed\",VLOOKUP(P27,'5.1.2 CPA Formulae'!$B$9:$E$20,2,FALSE))","v":"Fixed"}]
["1.11","Design",null,"Each",1,null,0,"ZAR",{"v":1,"d":"1.0000"},null,0,0,0,0,0,{"$nulls":11},{"$f":"IF(P28=\"\",\"Fixed\",VLOOKUP(P28,'5.1.2 CPA Formulae'!$B$9:$E$20,2,FALSE))","v":"Fixed"}]
["1.12","Installation& Commissioning",null,"Each",1,null,0,"ZAR",{"v":1,"d":"1.0000"},null,0,0,0,0,0,{"$nulls":11},{"$f":"IF(P29=\"\",\"Fixed\",VLOOKUP(P29,'5.1.2 CPA Formulae'!$B$9:$E$20,2,FALSE))","v":"Fixed"}]
["1.13","Support  ",null,"Each",1,null,0,"ZAR",{"v":1,"d":"1.0000"},null,0,0,0,0,0,{"$nulls":11},{"$f":"IF(P30=\"\",\"Fixed\",VLOOKUP(P30,'5.1.2 CPA Formulae'!$B$9:$E$20,2,FALSE))","v":"Fixed"}]
{"$rows_left_out":274}
{"sheet":"5.1.2 CPA Formulae","index":3,"n_rows":149,"n_cols":67,"rows_kept":149,"merged":[[0,0,0,1],[1,0,1,1],[2,0,2,1],[3,0,3,1],[5,0,5,4],[8,2,8,3],[8,5,8,7],[9,2,9,4],[9,5,19,7],[10,2,10,4],[11,2,11,4],[12,2,12,4],[13,2,13,4],[14,2,14,4],[15,2,15,4],[16,2,16,4],[17,2,17,4],[18,2,18,4],[19,2,19,4],[22,1,22,6],[23,1,23,6],[26,1,26,6],[27,1,27,6],[28,1,28,6],[29,1,29,6],[30,1,30,6],[31,1,31,6],[33,1,33,6],[34,1,34,6],[35,1,35,6],[36,1,36,6],[37,1,37,6],[41,1,41,6],[52,1,52,6],[63,1,63,6],[74,1,74,6],[85,1,85,6],[96,1,96,6],[107,1,107,6],[118,1,118,6],[129,1,129,6],[140,1,140,6]]}
["Enquiry No.",null,{"$f":"'RFI Cover Sheet'!C12","v":"E2396NTCSAMWP"}]
["Package Name:",null,{"$f":"'RFI Cover Sheet'!C14","v":"Supply, Delivery, Design, Installation, Commissioning, Support and Training on Environmental Racks with Built-in Air Conditioning, Noise Reduction Solutions, Heat Management Systems and Security Access Control for Substation Environments, on an as and when required basis"}]
["Supplier's Name:",null,{"$f":"'RFI Cover Sheet'!C16","v":0}]
["Category of Offer:",null,"RFI"]
[]
["5.1.2 CONTRACT PRICE ADJUSTMENT (CPA) FOR INFLATION"]
[]
["No.","Formula Code","Summary of the description of the Tenderer's Formulae"]
[1,"Fixed","Firm and Fixed ",null,null,"Prices are 100 % fixed and firm. CPA is not applicable. "]
[2,"A1","Tenderer's description of Multiple Formula ",null,null,"Type in the description of each formula in the tables below"]
[3,"A",{"$f":"B42","v":"Tenderer's description of Formula A"}]
[4,"B",{"$f":"B53","v":"Tenderer's description of Formula B"}]
[5,"C",{"$f":"B64","v":"Tenderer's description of Formula C"}]
[6,"D",{"$f":"B75","v":"Tenderer's description of Formula D"}]
[7,"E",{"$f":"B86","v":"Tenderer's description of Formula E"}]
[8,"F",{"$f":"B97","v":"Tenderer's description of Formula F"}]
[9,"G",{"$f":"B108","v":"Tenderer's description of Formula G"}]
[10,"H",{"$f":"B119","v":"Tenderer's description of Formula H"}]
[11,"I",{"$f":"B130","v":"Tenderer's description of Formula I"}]
[12,"J",{"$f":"B141","v":"Tenderer's description of Formula J"}]
[]
["SPECIFIC REQUIREMENTS"]
[{"v":1,"d":"1."},"Only Main Offer is to be submitted. Main offer tenderers are to fully comply with the requirements in the General Notes and CPA Formulae Notes below."]
[{"v":2,"d":"2."},"No ALTERNATIVE offers are accepted."]
[]
["GENERAL NOTES :"]
[1,"References to \"indices\" below mean \"cost indices or reference prices\"."]
[2,"Where 5 year historical information must be provided as instructed below, internet address references which are accessible to the general public may be submitted by the Tenderer instead, with the specific electronic route and web page reflecting the applicable data."]
[3,"The worksheet  CPA Formula in 5.1.2. has to be populated by the tenderer (columns B - J), unless the tenderer’s prices are fixed and firm for the duration of the contract. Each CPA formula must add up to a total of 100%.  All columns are to be populated. No inhouse CPA indices may be used. Tenderers are to provide all requested information.CPA Formulae should represent cost breakdown of the goods/commodities/components/items being sourced.\n"]
[4,"CPA Formulae Codes Column N 5.1.1 Pricing is to be populated by the tenderer by selecting the respective drop down codes CPA formula as  developed by Tenderer in 5.1.2 CPA formulae worksheet   (e.g. Formula A-J ) then  the tenderer must populate their respective CPA formula in  5.1.2 CPA Formulae Worksheet. Codes and descriptions must be selected by the tenderer and inserted into each row of activity. "]
{"$rows_left_out":120}
{"sheet":"5.1.3 Summary","index":4,"n_rows":30,"n_cols":8,"rows_kept":30,"merged":[[0,0,0,1],[1,0,1,1],[2,0,2,1],[3,0,3,1],[7,3,7,5],[27,6,27,8],[29,6,29,8]]}
["Enquiry No.",null,{"$f":"'RFI Cover Sheet'!C12","v":"E2396NTCSAMWP"}]
["Package Name:",null,{"$f":"'RFI Cover Sheet'!C14","v":"Supply, Delivery, Design, Installation, Commissioning, Support and Training on Environmental Racks with Built-in Air Conditioning, Noise Reduction Solutions, Heat Management Systems and Security Access Control for Substation Environments, on an as and when required basis"}]
["Supplier's Name:",null,{"$f":"'RFI Cover Sheet'!C16","v":0}]
["Category of Offer:",null,"RFI"]
[]
["5.1.3 Summary ",{"$nulls":6},"Manual input required"]
[]
[{"$nulls":3},"All prices in ZAR"]
["Table No.","Section Description","Total Foreign Currency","Total Foreign Currency (ZAR)","Local","Total  Value "]
[1,{"$f":"'5.1.1 Price Table 1-17'!A17","v":"Table 1"},{"$f":"'5.1.1 Price Table 1-17'!K32","v":0},{"$f":"'5.1.1 Price Table 1-17'!L32","v":0},{"$f":"'5.1.1 Price Table 1-17'!G32","v":0},{"$f":"'5.1.1 Price Table 1-17'!M32","v":0}]
[null,{"$f":"'5.1.1 Price Table 1-17'!A34","v":"Table 2"},{"$f":"'5.1.1 Price Table 1-17'!K50","v":0},{"$f":"'5.1.1 Price Table 1-17'!L50","v":0},{"$f":"'5.1.1 Price Table 1-17'!G50","v":0},{"$f":"'5.1.1 Price Table 1-17'!M50","v":0}]
[null,{"$f":"'5.1.1 Price Table 1-17'!A52","v":"Table 3"},{"$f":"'5.1.1 Price Table 1-17'!K67","v":0},{"$f":"'5.1.1 Price Table 1-17'!L67","v":0},{"$f":"'5.1.1 Price Table 1-17'!G67","v":0},{"$f":"'5.1.1 Price Table 1-17'!M67","v":0}]
[null,{"$f":"'5.1.1 Price Table 1-17'!A69","v":"Table 4"},{"$f":"'5.1.1 Price Table 1-17'!K81","v":0},{"$f":"'5.1.1 Price Table 1-17'!L81","v":0},{"$f":"'5.1.1 Price Table 1-17'!G81","v":0},{"$f":"'5.1.1 Price Table 1-17'!M81","v":0}]
[null,{"$f":"'5.1.1 Price Table 1-17'!A83","v":"Table 5"},{"$f":"'5.1.1 Price Table 1-17'!K96","v":0},{"$f":"'5.1.1 Price Table 1-17'!L96","v":0},{"$f":"'5.1.1 Price Table 1-17'!G96","v":0},{"$f":"'5.1.1 Price Table 1-17'!M96","v":0}]
[null,{"$f":"'5.1.1 Price Table 1-17'!A98","v":"Table 6"},{"$f":"'5.1.1 Price Table 1-17'!K114","v":0},{"$f":"'5.1.1 Price Table 1-17'!L114","v":0},{"$f":"'5.1.1 Price Table 1-17'!G114","v":0},{"$f":"'5.1.1 Price Table 1-17'!M114","v":0}]
[null,{"$f":"'5.1.1 Price Table 1-17'!A116","v":"Table 7"},{"$f":"'5.1.1 Price Table 1-17'!K132","v":0},{"$f":"'5.1.1 Price Table 1-17'!L132","v":0},{"$f":"'5.1.1 Price Table 1-17'!G132","v":0},{"$f":"'5.1.1 Price Table 1-17'!M132","v":0}]
[null,{"$f":"'5.1.1 Price Table 1-17'!A134","v":"Table 8"},{"$f":"'5.1.1 Price Table 1-17'!K150","v":0},{"$f":"'5.1.1 Price Table 1-17'!L150","v":0},{"$f":"'5.1.1 Price Table 1-17'!G150","v":0},{"$f":"'5.1.1 Price Table 1-17'!M150","v":0}]
[null,{"$f":"'5.1.1 Price Table 1-17'!A152","v":"Table 9"},{"$f":"'5.1.1 Price Table 1-17'!K174","v":0},{"$f":"'5.1.1 Price Table 1-17'!L174","v":0},{"$f":"'5.1.1 Price Table 1-17'!G174","v":0},{"$f":"'5.1.1 Price Table 1-17'!M174","v":0}]
[null,{"$f":"'5.1.1 Price Table 1-17'!A176","v":"Table 10"},{"$f":"'5.1.1 Price Table 1-17'!K192","v":0},{"$f":"'5.1.1 Price Table 1-17'!L192","v":0},{"$f":"'5.1.1 Price Table 1-17'!G192","v":0},{"$f":"'5.1.1 Price Table 1-17'!M192","v":0}]
[null,{"$f":"'5.1.1 Price Table 1-17'!A194","v":"Table 11"},{"$f":"'5.1.1 Price Table 1-17'!K206","v":0},{"$f":"'5.1.1 Price Table 1-17'!L206","v":0},{"$f":"'5.1.1 Price Table 1-17'!G206","v":0},{"$f":"'5.1.1 Price Table 1-17'!M206","v":0}]
[null,{"$f":"'5.1.1 Price Table 1-17'!A208","v":"Table 12"},{"$f":"'5.1.1 Price Table 1-17'!K227","v":0},{"$f":"'5.1.1 Price Table 1-17'!L227","v":0},{"$f":"'5.1.1 Price Table 1-17'!G227","v":0},{"$f":"'5.1.1 Price Table 1-17'!M227","v":0}]
[null,{"$f":"'5.1.1 Price Table 1-17'!A229","v":"Table 13"},{"$f":"'5.1.1 Price Table 1-17'!K243","v":0},{"$f":"'5.1.1 Price Table 1-17'!L243","v":0},{"$f":"'5.1.1 Price Table 1-17'!G243","v":0},{"$f":"'5.1.1 Price Table 1-17'!M243","v":0}]
[2,{"$f":"'5.1.1 Price Table 1-17'!A245","v":"Table 14"},{"$f":"'5.1.1 Price Table 1-17'!K259","v":0},{"$f":"'5.1.1 Price Table 1-17'!L259","v":0},{"$f":"'5.1.1 Price Table 1-17'!G259","v":0},{"$f":"'5.1.1 Price Table 1-17'!M259","v":0}]
[null,{"$f":"'5.1.1 Price Table 1-17'!A261","v":"Table 15"},{"$f":"'5.1.1 Price Table 1-17'!K274","v":0},{"$f":"'5.1.1 Price Table 1-17'!L274","v":0},{"$f":"'5.1.1 Price Table 1-17'!G274","v":0},{"$f":"'5.1.1 Price Table 1-17'!M274","v":0}]
[null,{"$f":"'5.1.1 Price Table 1-17'!A276","v":"Table 16"},{"$f":"'5.1.1 Price Table 1-17'!K289","v":0},{"$f":"'5.1.1 Price Table 1-17'!L289","v":0},{"$f":"'5.1.1 Price Table 1-17'!G289","v":0},{"$f":"'5.1.1 Price Table 1-17'!M289","v":0}]
[null,{"$f":"'5.1.1 Price Table 1-17'!A291","v":"Table 17"},{"$f":"'5.1.1 Price Table 1-17'!K300","v":0},{"$f":"'5.1.1 Price Table 1-17'!L300","v":0},{"$f":"'5.1.1 Price Table 1-17'!G300","v":0},{"$f":"'5.1.1 Price Table 1-17'!M300","v":0}]
[]
[null,"TOTAL PRICE EXCLUDING VAT",{"$f":"SUM(C10:C23)","v":0},{"$f":"SUM(D10:D23)","v":0},{"$f":"SUM(E10:E23)","v":0},{"$f":"SUM(F10:F23)","v":0},"Must agree with Price (Excl. VAT) on RFI Cover Page"]
[null,"SOUTH AFRICAN VAT - ON IMPORTED GOODS",{"$f":"C28*15%","v":0},{"$f":"D28*15%","v":0},{"$f":"E28*15%","v":0},{"$f":"F28*15%","v":0}," "]
[null,"TOTAL PRICES INCLUDING VAT",{"$f":"C28+C29","v":0},{"$f":"D28+D29","v":0},{"$f":"E28+E29","v":0},{"$f":"F28+F29","v":0},"Must agree with Price (Incl. VAT) on RFI Cover Page"]
{"$rows_left_out":1}
{"sheet":"5.1.4 PS5","index":5,"n_rows":83,"n_cols":19,"rows_kept":83,"hidden":true,"merged":[[8,1,8,7],[11,1,11,7],[12,1,12,7],[54,1,54,7]]}
["Enquiry No.",null,{"$f":"'RFI Cover Sheet'!C12","v":"E2396NTCSAMWP"}]
["Package Name:",null,{"$f":"'RFI Cover Sheet'!C14","v":"Supply, Delivery, Design, Installation, Commissioning, Support and Training on Environmental Racks with Built-in Air Conditioning, Noise Reduction Solutions, Heat Management Systems and Security Access Control for Substation Environments, on an as and when required basis"}]
["Tenderer's Name:",null,{"$f":"'RFI Cover Sheet'!C16","v":0}]
["Category of Offer:",null,{"$f":"'RFI Cover Sheet'!C18","v":"RFI"}]
[]
["5.1.4. PS 5 "]
[]
["NOTES:"]
[1,"The exchange rates inputted below must be the same as per Worksheet 5.1.6   Exchange Rates."]
[]
[{"$nulls":10},1,2,3,4,5,6,7,8]
["No.","Description",{"$nulls":6}," ",null,{"$f":"#REF!","v":{"$error":"#REF!"}},{"$f":"#REF!","v":{"$error":"#REF!"}},{"$f":"#REF!","v":{"$error":"#REF!"}},{"$f":"#REF!","v":{"$error":"#REF!"}},{"$f":"#REF!","v":{"$error":"#REF!"}},{"$f":"#REF!","v":{"$error":"#REF!"}},{"$f":"#REF!","v":{"$error":"#REF!"}},{"$f":"#REF!","v":{"$error":"#REF!"}}]
[null," *Eskom may effect this insurance which includes war",{"$nulls":6}," "]
[null,"   risk insurance"]
[null,"**Please specify"]
[null,"SUPPLIED FROM OUTSIDE R.S.A.:",{"$nulls":7},"(In ZAR)"]
[1,"1: F.O.B. PRICE",{"$nulls":7},"(In ZAR)",{"v":1000,"d":"1,000.00"}]
[2,"2: COST OF SEA  FREIGHT",{"$nulls":7},"(In ZAR)"]
[3,"3: COST OF AIR  FREIGHT",{"$nulls":7},"(In ZAR)"]
[4,"4: COST OF MARINE INSURANCES *",{"$nulls":7},"(In ZAR)"]
[5,"5: TOTAL PRICE DELIVERED PORT R.S.A. ...",{"$nulls":5},"(1+2+3+4)",null,"(In ZAR)",{"$f":"SUM(K17:K20)","v":{"v":1000,"d":"1,000.00"}},{"$f":"SUM(L17:L20)","v":0},0,0,0,0,0,0]
[6,"6: WHARFAGE",{"$nulls":7},"(In ZAR)"]
[7,"7: LANDING CHARGES",{"$nulls":7},"(In ZAR)"]
[8,"8: CUSTOMS DUTIES",{"$nulls":7},"(In ZAR)"]
[9,"9: IMPORT SURCHARGE",{"$nulls":7},"(In ZAR)"]
[10,"10: OTHER**",{"$nulls":7},"(In ZAR)"]
[11,"11: COST OF IMPORTATION ...",{"$nulls":5},"(6+7+8+9+10)",null,"(In ZAR)",{"$f":"SUM(K22:K26)","v":0},0,0,0,0,0,0,0]
[12,"12: COST OF RAIL TRANSPORT IN R.S.A.",{"$nulls":7},"(In ZAR)"]
[13,"13: COST OF ROAD TRANSPORT IN R.S.A.",{"$nulls":7},"(In ZAR)"]
[14,"14: TOTAL COST OF TRANSPORT S.A. PORT TO WORK/SITE ...",{"$nulls":5},"(12+13)",null,"(In ZAR)",{"$f":"SUM(K28:K29)","v":0},0,0,0,0,0,{"$f":"SUM(Q28:Q29)","v":0},{"$f":"SUM(R28:R29)","v":0}]
{"$rows_left_out":54}
{"sheet":"5.1.4 Exchange Rates","index":6,"n_rows":37,"n_cols":8,"rows_kept":37,"merged":[[0,0,0,1],[0,2,0,4],[1,0,1,1],[1,2,1,4],[2,0,2,1],[2,2,2,4],[3,0,3,1],[3,2,3,4],[8,1,8,6],[9,0,11,0],[9,1,9,6],[9,14,9,19],[10,1,10,6],[11,1,11,6],[12,1,12,6],[13,1,13,6],[14,0,16,0],[14,1,14,6],[15,1,15,6],[16,1,16,6],[21,7,21,12]]}
["Enquiry No.",null,{"$f":"'RFI Cover Sheet'!C12","v":"E2396NTCSAMWP"}]
["Package Name:",null,{"$f":"'RFI Cover Sheet'!C14","v":"Supply, Delivery, Design, Installation, Commissioning, Support and Training on Environmental Racks with Built-in Air Conditioning, Noise Reduction Solutions, Heat Management Systems and Security Access Control for Substation Environments, on an as and when required basis"}]
["Supplier's Name:",null,{"$f":"'RFI Cover Sheet'!C16","v":0}]
["Category of Offer:",null,"RFI"]
[]
["5.1.4 EXCHANGE RATES FOR MULTIPLE CURRENCIES"]
[]
["NOTES:"]
[1,"The table below needs to be completed if the Employer will be exposed to any currency fluctuation as stipulated in Secondary Clause X3.  For conversion of the foreign portions to Rand, please use the South African Reserve Bank's (SARB) exchange rate at 12:00 on the day of advertisement of the bid.  This is in terms of the Preferential Procurement Policy Framework Act (PPPFA) with which the Employer has to comply.\nNB: Tenderers must submit proof of the SARB rate(s) of exchange used  "]
[2,"The following URL (electronic route) is to be followed to access the relevant SARB rates on their web pages:\n"]
[null,"www.resbank.co.za"]
[null,"-  Select Research\n-  Then select Rates\n-  Click on \"Select historical exchange rates and other interest rates\"\n-  Clicking on the exchange rate in the following page opens the daily rates per currency and SA Rand"]
[3,"The Employer deals only in the currencies listed below unless other currencies are specifically approved for this tender.  Kindly notify the Employer of any currency that the tenderer intends to use, but is not stipulated in the table, to consider sanctioning such currency.  Sufficient time must be allowed for the assessment and to respond to such request.  The onus is on the tenderer to submit a bid with approved currencies"]
[4,"The format in which the exchange rate must be inserted in the table is:  1 (One) Foreign Currency = R Amount  (i.e. the Rand amount for one of each foreign currency applicable).  Exchange rates must be rounded to 4 decimals\n\nNB :  Only the USD/ZAR, GBP/ZAR and EUR/ZAR are published in this way on the SARB web pages above.  The Rand rate with the other currencies must be inverted (1/Foreign Currency Rate) in order to list it in the required format in the table below\n"]
[5,"All information in the table below must conform with all other equivalent information in the offer. "]
[null,"Payment in terms of Payment Method 2  is considered as a \"foreign payment\" although it will be effected in South African Rand. However, amounts for  \"F.O.R. Price-Goods supplied from Imported Items\", are NOT considered as \"foreign payments\""]
[null,"If more than one payment method apply for a currency, the Tenderer must request an additional row be inserted in the table in order to split the values and identify the relevant method.   "]
[" "]
[" "]
["EXCHANGE RATES PUBLISHED BY SARB"]
["NB: Tenderers must submit proof of the SARB rate (s) of exchange used."]
[{"$nulls":4},"Date for which the rates are published :",null,null,"Date to be inserted in the following format: Day, Month and Year.\n\nMust be the SARB rate at 12:00 on day of advertisement of bid"]
["No","Currency Description","Code","Exchange Rate\nCurrency 1,00 = R Amount","Payment Method 1a, 1b or 2","Source"]
[1,"South African Rand","ZAR",{"v":1,"d":"R 1.00"}]
[2,"Australian Dollar","AUD",{"v":0,"d":"R 0.00"}]
[3,"Canadian Dollar","CAN",{"v":0,"d":"R 0.00"}]
[4,"Swiss Franc","CHF",{"v":0,"d":"R 0.00"}]
[5,"Danish Krone","DKK",{"v":0,"d":"R 0.00"}]
[6,"European Currency","EUR",{"v":0,"d":"R 0.00"}]
[7,"British Pound","GBP",{"v":0,"d":"R 0.00"}]
{"$rows_left_out":7}