{"text_format":"3","workbook":"xlsx","n_sheets":2,"sheets":["Public Key Infrastructure","Currency"],"not_rendered":{"external_links":7,"defined_names":301},"read":"whole","date_system":"1900"}

{"sheet":"Public Key Infrastructure","index":0,"n_rows":69,"n_cols":36,"rows_kept":69,"merged":[[2,1,2,6],[25,8,25,11],[25,12,25,27],[26,5,26,7],[26,8,26,11],[26,12,26,15],[26,16,26,19],[26,20,26,23],[26,24,26,27],[27,5,27,7],[28,0,37,0],[28,1,37,1],[28,2,29,2],[28,3,29,3],[28,4,29,4],[28,12,37,15],[28,16,37,19],[28,20,37,23],[28,24,37,27],[30,2,31,2],[30,3,31,3],[30,4,31,4],[32,2,33,2],[32,3,33,3],[32,4,33,4],[34,2,35,2],[34,3,35,3],[34,4,35,4],[36,2,37,2],[36,3,37,3],[36,4,37,4],[38,0,39,0],[38,1,39,1],[38,2,39,2],[38,3,39,3],[38,4,39,4],[38,29,39,29],[40,0,41,0],[40,1,41,1],[40,2,41,2],[40,3,41,3],[40,4,41,4],[42,0,51,0],[42,1,51,1],[42,2,43,2],[42,3,43,3],[42,4,43,4],[44,2,45,2],[44,3,45,3],[44,4,45,4],[46,2,47,2],[46,3,47,3],[46,4,47,4],[48,2,49,2],[48,3,49,3],[48,4,49,4],[50,2,51,2],[50,3,51,3],[50,4,51,4],[52,0,53,0],[52,1,53,1],[52,2,53,2],[52,3,53,3],[52,4,53,4],[52,29,53,29],[54,0,55,0],[54,1,55,1],[54,2,55,2],[54,3,55,3],[54,4,55,4],[56,0,59,0],[56,1,59,1],[56,2,57,2],[56,3,57,3],[56,4,57,4],[58,2,59,2],[58,3,59,3],[58,4,59,4],[60,0,62,0],[60,1,62,1],[60,4,62,4],[60,8,62,11],[60,29,62,29],[67,1,67,11],[68,1,91,11]]}
[null,"Pricing Schedule : Public Key Infrastructure"]
[]
[null,"VENDOR NAME"]
[]
[]
[]
[null,"IMPORTANT NOTES"]
[null,"All cells highlighted in GREEN must be completed"]
[null,"Quoted prices MUST be in ZAR, EXCLUDING VAT and ESCALATIONS"]
[]
[null,"Public Key Infrastructure"]
[null,"Prices MUST be quoted based on the SCOPE provided"]
[null,"Select the currency from the CURRENCY drop-down list in COLUMN \"G\""]
[]
[null,"Capture the applicable Currency, ROE and ROE Published Date on the \"Currency sheet\". "]
[null,"The adjustments for prevailing rates and the basis for future price adjustments will be determined at time of contracting. "]
[null,"Exchange rate variations may not be claimed for the local mark-up in the pricing structure"]
[]
[null,"NB: Provide details of the required HARDWARE (and the associated Support), quantities for each, and the applicable prices in rows 29 to 38. "]
[]
[null,"Provide pricing assumptions applicable which has an impact to the overall pricing submission (TABLE 1)"]
[]
[null,"All Prices must be exclusive of VAT"]
[]
[]
[{"$nulls":8},"(SOLUTION IMPLEMENTATION PHASE \n(Based on Milestones)",{"$nulls":3},"OPERATIONAL PHASE"]
[null," ",{"$nulls":6},"YEAR 1 ",{"$nulls":3},"YEAR 2",{"$nulls":3},"YEAR 3",{"$nulls":3},"YEAR 4",{"$nulls":3},"YEAR 5"]
["Item Number","Category","Description","Total Estimated Quantity","Unit charge","CURRENCY",null,null,"Unit Price in Nominated Currency","Unit Price in ZAR","Total [Nominated Currency]","Total in ZAR","Unit Price in Nominated Currency","Unit Price in ZAR","Total [Nominated Currency]","Total in ZAR","Unit Price in Nominated Currency","Unit Price in ZAR","Total [Nominated Currency]","Total in ZAR","Unit Price in Nominated Currency","Unit Price in ZAR","Total [Nominated Currency]","Total in ZAR","Unit Price in Nominated Currency","Unit Price in ZAR","Total [Nominated Currency]","Total in ZAR",null,"CONTRACT PRICE ADJUSTMENT"]
[1,"Hardware Infrastructure including Support",null,1,"sum",{"$f":"IF(G29=\"\",\"\",IF(G29=\"ZAR\",\"Local\",\"Foreign\"))","v":"Local"},"ZAR",{"$f":"IF(F29=\"\",\"\",IF(F29=\"Foreign\",VLOOKUP(G29,Currency!$E$20:$F$33,2,FALSE),1))","v":{"v":1,"d":"1.00"}},0,{"$f":"I29*$H29","v":0},{"$f":"I29*$D29","v":0},{"$f":"J29*$D29","v":0},{"$nulls":23},"DKK"]
[{"$nulls":5},"Local","ZAR",{"$f":"IF(F30=\"\",\"\",IF(F30=\"Foreign\",VLOOKUP(G30,Currency!$E$20:$F$33,2,FALSE),1))","v":{"v":1,"d":"1.00"}},0,0,{"$f":"I30*$D29","v":0},{"$f":"J30*$D29","v":0}]
[{"$nulls":3},1,"sum","Local","ZAR",{"$f":"IF(F31=\"\",\"\",IF(F31=\"Foreign\",VLOOKUP(G31,Currency!$E$20:$F$33,2,FALSE),1))","v":{"v":1,"d":"1.00"}},0,0,{"$f":"I31*$D31","v":0},{"$f":"J31*$D31","v":0}]
[{"$nulls":5},"Local","ZAR",{"$f":"IF(F32=\"\",\"\",IF(F32=\"Foreign\",VLOOKUP(G32,Currency!$E$20:$F$33,2,FALSE),1))","v":{"v":1,"d":"1.00"}},0,0,{"$f":"I32*$D31","v":0},{"$f":"J32*$D31","v":0}]
[{"$nulls":3},1,"sum","Local","ZAR",{"$f":"IF(F33=\"\",\"\",IF(F33=\"Foreign\",VLOOKUP(G33,Currency!$E$20:$F$33,2,FALSE),1))","v":{"v":1,"d":"1.00"}},0,0,{"$f":"I33*$D32","v":0},{"$f":"J33*$D32","v":0}]
[{"$nulls":5},"Local","ZAR",{"$f":"IF(F34=\"\",\"\",IF(F34=\"Foreign\",VLOOKUP(G34,Currency!$E$20:$F$33,2,FALSE),1))","v":{"v":1,"d":"1.00"}},0,0,0,0]
[{"$nulls":3},1,"sum","Local","ZAR",{"$f":"IF(F35=\"\",\"\",IF(F35=\"Foreign\",VLOOKUP(G35,Currency!$E$20:$F$33,2,FALSE),1))","v":{"v":1,"d":"1.00"}},0,0,0,0]
[{"$nulls":5},"Local","ZAR",{"$f":"IF(F36=\"\",\"\",IF(F36=\"Foreign\",VLOOKUP(G36,Currency!$E$20:$F$33,2,FALSE),1))","v":{"v":1,"d":"1.00"}},0,0,0,0]
[{"$nulls":3},1,"sum","Local","ZAR",{"$f":"IF(F37=\"\",\"\",IF(F37=\"Foreign\",VLOOKUP(G37,Currency!$E$20:$F$33,2,FALSE),1))","v":{"v":1,"d":"1.00"}},0,0,{"$f":"I37*$D37","v":0},{"$f":"J37*$D37","v":0}]
[{"$nulls":5},"Local","ZAR",{"$f":"IF(F38=\"\",\"\",IF(F38=\"Foreign\",VLOOKUP(G38,Currency!$E$20:$F$33,2,FALSE),1))","v":{"v":1,"d":"1.00"}},0,0,{"$f":"I38*$D37","v":0},{"$f":"J38*$D37","v":0}]
[2,"Software","Subscription Services",1,"sum",{"$f":"IF(G39=\"\",\"\",IF(G39=\"ZAR\",\"Local\",\"Foreign\"))","v":"Local"},"ZAR",{"$f":"IF(F39=\"\",\"\",IF(F39=\"Foreign\",VLOOKUP(G39,Currency!$E$20:$F$33,2,FALSE),1))","v":{"v":1,"d":"1.00"}},{"$nulls":4},0,{"$f":"M39*$H39","v":0},{"$f":"M39*$D39","v":0},{"$f":"N39*$D39","v":0},0,{"$f":"Q39*$H39","v":0},{"$f":"Q39*$D39","v":0},{"$f":"R39*$D39","v":0},0,{"$f":"U39*$H39","v":0},{"$f":"U39*$D39","v":0},{"$f":"V39*$D39","v":0},0,{"$f":"Y39*$H39","v":0},{"$f":"Y39*$D39","v":0},{"$f":"Z39*$D39","v":0},{"$nulls":7},"DKK"]
[{"$nulls":5},"Local","ZAR",{"$f":"IF(F40=\"\",\"\",IF(F40=\"Foreign\",VLOOKUP(G40,Currency!$E$20:$F$33,2,FALSE),1))","v":{"v":1,"d":"1.00"}},{"$nulls":4},0,0,{"$f":"M40*$D39","v":0},{"$f":"N40*$D39","v":0},0,0,{"$f":"Q40*$D39","v":0},{"$f":"R40*$D39","v":0},0,0,{"$f":"U40*$D39","v":0},{"$f":"V40*$D39","v":0},0,0,{"$f":"Y40*$D39","v":0},{"$f":"Z40*$D39","v":0}]
[3,"Assessment (Current PKI Deployment)","Readiness Assessment & Recommendation Service",1,"sum",{"$f":"IF(G41=\"\",\"\",IF(G41=\"ZAR\",\"Local\",\"Foreign\"))","v":"Local"},"ZAR",{"$f":"IF(F41=\"\",\"\",IF(F41=\"Foreign\",VLOOKUP(G41,Currency!$E$20:$F$33,2,FALSE),1))","v":{"v":1,"d":"1.00"}},0,{"$f":"I41*$H41","v":0},{"$f":"I41*$D41","v":0},{"$f":"J41*$D41","v":0},{"$nulls":23},"DKK"]
[{"$nulls":5},"Local","ZAR",{"$f":"IF(F42=\"\",\"\",IF(F42=\"Foreign\",VLOOKUP(G42,Currency!$E$20:$F$33,2,FALSE),1))","v":{"v":1,"d":"1.00"}},0,0,{"$f":"I42*$D41","v":0},{"$f":"J42*$D41","v":0}]
[4,"Solution Implementation","Design",1,"sum",{"$f":"IF(G43=\"\",\"\",IF(G43=\"ZAR\",\"Local\",\"Foreign\"))","v":"Local"},"ZAR",{"$f":"IF(F43=\"\",\"\",IF(F43=\"Foreign\",VLOOKUP(G43,Currency!$E$20:$F$33,2,FALSE),1))","v":{"v":1,"d":"1.00"}},0,{"$f":"I43*$H43","v":0},{"$f":"I43*$D43","v":0},{"$f":"J43*$D43","v":0},{"$nulls":23},"HKD"]
[{"$nulls":5},"Local","ZAR",{"$f":"IF(F44=\"\",\"\",IF(F44=\"Foreign\",VLOOKUP(G44,Currency!$E$20:$F$33,2,FALSE),1))","v":{"v":1,"d":"1.00"}},0,0,{"$f":"I44*$D43","v":0},{"$f":"J44*$D43","v":0}]
[null,null,"Build, Configure",1,"sum",{"$f":"IF(G45=\"\",\"\",IF(G45=\"ZAR\",\"Local\",\"Foreign\"))","v":"Local"},"ZAR",{"$f":"IF(F45=\"\",\"\",IF(F45=\"Foreign\",VLOOKUP(G45,Currency!$E$20:$F$33,2,FALSE),1))","v":{"v":1,"d":"1.00"}},0,{"$f":"I45*$H45","v":0},{"$f":"I45*$D44","v":0},{"$f":"J45*$D44","v":0}]
[{"$nulls":5},"Local","ZAR",{"$f":"IF(F46=\"\",\"\",IF(F46=\"Foreign\",VLOOKUP(G46,Currency!$E$20:$F$33,2,FALSE),1))","v":{"v":1,"d":"1.00"}},0,0,0,0]
[null,null,"Testing",1,"sum","Local","ZAR",{"$f":"IF(F47=\"\",\"\",IF(F47=\"Foreign\",VLOOKUP(G47,Currency!$E$20:$F$33,2,FALSE),1))","v":{"v":1,"d":"1.00"}},0,0,0,0]
[{"$nulls":5},"Local","ZAR",{"$f":"IF(F48=\"\",\"\",IF(F48=\"Foreign\",VLOOKUP(G48,Currency!$E$20:$F$33,2,FALSE),1))","v":{"v":1,"d":"1.00"}},0,0,0,0]
[null,null,"Integration (if applicable)",1,"sum",{"$f":"IF(G49=\"\",\"\",IF(G49=\"ZAR\",\"Local\",\"Foreign\"))","v":"Local"},"ZAR",{"$f":"IF(F49=\"\",\"\",IF(F49=\"Foreign\",VLOOKUP(G49,Currency!$E$20:$F$33,2,FALSE),1))","v":{"v":1,"d":"1.00"}},0,{"$f":"I49*$H49","v":0},{"$f":"I49*$D48","v":0},{"$f":"J49*$D48","v":0}]
[{"$nulls":5},"Local","ZAR",{"$f":"IF(F50=\"\",\"\",IF(F50=\"Foreign\",VLOOKUP(G50,Currency!$E$20:$F$33,2,FALSE),1))","v":{"v":1,"d":"1.00"}},0,0,0,0]
[null,null,"Deployment and Stabilisation",1,"sum","Local","ZAR",{"$f":"IF(F51=\"\",\"\",IF(F51=\"Foreign\",VLOOKUP(G51,Currency!$E$20:$F$33,2,FALSE),1))","v":{"v":1,"d":"1.00"}},0,0,{"$f":"I51*$D51","v":0},{"$f":"J51*$D51","v":0},{"$nulls":23},"USD"]
[{"$nulls":5},"Local","ZAR",{"$f":"IF(F52=\"\",\"\",IF(F52=\"Foreign\",VLOOKUP(G52,Currency!$E$20:$F$33,2,FALSE),1))","v":{"v":1,"d":"1.00"}},0,0,{"$f":"I52*$D51","v":0},{"$f":"J52*$D51","v":0}]
[5,"Solution Support","Premium support",1,"sum",{"$f":"IF(G53=\"\",\"\",IF(G53=\"ZAR\",\"Local\",\"Foreign\"))","v":"Local"},"ZAR",{"$f":"IF(F53=\"\",\"\",IF(F53=\"Foreign\",VLOOKUP(G53,Currency!$E$20:$F$33,2,FALSE),1))","v":{"v":1,"d":"1.00"}},{"$nulls":4},0,{"$f":"M53*$H53","v":0},{"$f":"M53*$D53","v":0},{"$f":"N53*$D53","v":0},0,{"$f":"Q53*$H53","v":0},{"$f":"Q53*$D53","v":0},{"$f":"R53*$D53","v":0},0,{"$f":"U53*$H53","v":0},{"$f":"U53*$D53","v":0},{"$f":"V53*$D53","v":0},0,{"$f":"Y53*$H53","v":0},{"$f":"Y53*$D53","v":0},{"$f":"Z53*$D53","v":0}]
[{"$nulls":5},"Local","ZAR",{"$f":"IF(F54=\"\",\"\",IF(F54=\"Foreign\",VLOOKUP(G54,Currency!$E$20:$F$33,2,FALSE),1))","v":{"v":1,"d":"1.00"}},{"$nulls":4},0,0,{"$f":"M54*$D53","v":0},{"$f":"N54*$D53","v":0},0,0,{"$f":"Q54*$D53","v":0},{"$f":"R54*$D53","v":0},0,0,{"$f":"U54*$D53","v":0},{"$f":"V54*$D53","v":0},0,0,{"$f":"Y54*$D53","v":0},{"$f":"Z54*$D53","v":0}]
[6,"Change Management","Change Management",1,"sum","Local","ZAR",{"$f":"IF(F55=\"\",\"\",IF(F55=\"Foreign\",VLOOKUP(G55,Currency!$E$20:$F$33,2,FALSE),1))","v":{"v":1,"d":"1.00"}},0,{"$f":"I55*$H55","v":0},{"$f":"I55*$D55","v":0},{"$f":"J55*$D55","v":0},{"$nulls":23},"DKK"]
[{"$nulls":5},"Local","ZAR",{"$f":"IF(F56=\"\",\"\",IF(F56=\"Foreign\",VLOOKUP(G56,Currency!$E$20:$F$33,2,FALSE),1))","v":{"v":1,"d":"1.00"}},0,0,{"$f":"I56*$D55","v":0},{"$f":"J56*$D55","v":0}]
[7,"Training","(Onsite and Classroom)\nSystem Administrator",20,"per Attendee",{"$f":"IF(G57=\"\",\"\",IF(G57=\"ZAR\",\"Local\",\"Foreign\"))","v":"Local"},"ZAR",{"$f":"IF(F57=\"\",\"\",IF(F57=\"Foreign\",VLOOKUP(G57,Currency!$E$20:$F$33,2,FALSE),1))","v":{"v":1,"d":"1.00"}},0,{"$f":"I57*$H57","v":0},{"$f":"I57*$D57","v":0},{"$f":"J57*$D57","v":0},{"$nulls":23},"DKK"]
[{"$nulls":5},"Local","ZAR",{"$f":"IF(F58=\"\",\"\",IF(F58=\"Foreign\",VLOOKUP(G58,Currency!$E$20:$F$33,2,FALSE),1))","v":{"v":1,"d":"1.00"}},0,0,{"$f":"I58*$D57","v":0},{"$f":"J58*$D57","v":0}]
[null,null,"(Web-based) \nSystem Administrator",20,"per Attendee","Local","ZAR",{"$f":"IF(F59=\"\",\"\",IF(F59=\"Foreign\",VLOOKUP(G59,Currency!$E$20:$F$33,2,FALSE),1))","v":{"v":1,"d":"1.00"}},0,0,{"$f":"I59*$D59","v":0},{"$f":"J59*$D59","v":0},{"$nulls":23},"DKK"]
[{"$nulls":5},"Local","ZAR",{"$f":"IF(F60=\"\",\"\",IF(F60=\"Foreign\",VLOOKUP(G60,Currency!$E$20:$F$33,2,FALSE),1))","v":{"v":1,"d":"1.00"}},0,0,{"$f":"I60*$D59","v":0},{"$f":"J60*$D59","v":0}]
[8,"Professional Services\n(As and When required)","Solution Architect",1500,"Hourly","Local","ZAR",{"$f":"IF(F61=\"\",\"\",IF(F61=\"Foreign\",VLOOKUP(G61,Currency!$E$20:$F$33,2,FALSE),1))","v":{"v":1,"d":"1.00"}},{"$nulls":4},0,{"$f":"M61*$H61","v":0},{"$f":"M61*$D61","v":0},{"$f":"N61*$D61","v":0},0,{"$f":"Q61*$H61","v":0},{"$f":"Q61*$D61","v":0},{"$f":"R61*$D61","v":0},0,{"$f":"U61*$H61","v":0},{"$f":"U61*$D61","v":0},{"$f":"V61*$D61","v":0},0,{"$f":"Y61*$H61","v":0},{"$f":"Y61*$D61","v":0},{"$f":"Z61*$D61","v":0},{"$nulls":7},"DKK"]
[null,null,"Solution Engineer",1900,null,"Local","ZAR",{"$f":"IF(F62=\"\",\"\",IF(F62=\"Foreign\",VLOOKUP(G62,Currency!$E$20:$F$33,2,FALSE),1))","v":{"v":1,"d":"1.00"}},{"$nulls":4},0,0,{"$f":"M62*$D62","v":0},{"$f":"N62*$D62","v":0},0,0,{"$f":"Q62*$D62","v":0},{"$f":"R62*$D62","v":0},0,0,{"$f":"U62*$D62","v":0},{"$f":"V62*$D62","v":0},0,0,{"$f":"Y62*$D62","v":0},{"$f":"Z62*$D62","v":0}]
[null,null,"Project Manager",1700,null,{"$f":"IF(G63=\"\",\"\",IF(G63=\"ZAR\",\"Local\",\"Foreign\"))","v":"Local"},"ZAR",{"$f":"IF(F63=\"\",\"\",IF(F63=\"Foreign\",VLOOKUP(G63,Currency!$E$20:$F$33,2,FALSE),1))","v":{"v":1,"d":"1.00"}},{"$nulls":4},0,{"$f":"M63*$H63","v":0},{"$f":"M63*$D63","v":0},{"$f":"N63*$D63","v":0},0,0,{"$f":"Q63*$D63","v":0},{"$f":"R63*$D63","v":0},0,0,{"$f":"U63*$D63","v":0},{"$f":"V63*$D63","v":0},0,0,{"$f":"Y63*$D63","v":0},{"$f":"Z63*$D63","v":0}]
[null,"Total ",{"$nulls":9},{"$f":"SUM(L55:L60,L41:L52,L29:L38)","v":0},{"$nulls":3},{"$f":"SUM(P39:P40,P53:P54,P61:P63)","v":0},{"$nulls":3},{"$f":"SUM(T39:T40,T53:T54,T61:T63)","v":0},{"$nulls":3},{"$f":"SUM(X39:X40,X53:X54,X61:X63)","v":0},{"$nulls":3},{"$f":"SUM(AB39:AB40,AB53:AB54,AB61:AB63)","v":0}]
[]
[null,"GRAND TOTAL",{"$nulls":9},{"$f":"SUM(L64,P64,T64,X64,AB64)","v":0}]
[]
[null,"TABLE 1: PRICING ASSUMPTIONS (INCLUDE ANY PRICING ASSUMPTIONS USED TO DETERMINE THE PRICES, ESPECIALLY FOR ITEMS THAT REQUIRE SUMS; CLEARLY REFERENCE THE ITEMS APPLICABLE)."]
[null," "]

{"sheet":"Currency","index":1,"n_rows":33,"n_cols":8,"rows_kept":33,"merged":[[1,1,1,5],[6,2,6,7],[7,1,9,1],[7,2,7,7],[7,15,7,20],[8,2,8,7],[9,2,9,7],[10,2,10,7],[11,2,11,7],[12,1,14,1],[12,2,12,7],[13,2,13,7],[14,2,14,7],[17,2,17,7]]}
[]
[null,{"$f":"'Public Key Infrastructure'!B3","v":"VENDOR NAME"}]
[]
[null,"EXCHANGE RATES FOR MULTIPLE CURRENCIES"]
[]
[null,"NOTES:"]
[null,1,"The table below needs to be completed if the Employer will be exposed to any currency fluctuation as stipulated in Secondary Clause X3.  For conversion of the foreign portions to Rand, please use the South African Reserve Bank's (SARB) exchange rate at 12:00 on the day of advertisement of the bid.  This is in terms of the Preferential Procurement Policy Framework Act (PPPFA) with which the Employer has to comply.\nNB: Tenderers must submit proof of the SARB rate(s) of exchange used  "]
[null,2,"The following URL (electronic route) is to be followed to access the relevant SARB rates on their web pages:\n"]
[null,null,"www.resbank.co.za"]
[null,null,"-  Select Research\n-  Then select Rates\n-  Click on \"Select historical exchange rates and other interest rates\"\n-  Clicking on the exchange rate in the following page opens the daily rates per currency and SA Rand"]
[null,3,"The Employer deals only in the currencies listed below unless other currencies are specifically approved for this tender.  Kindly notify the Employer of any currency that the tenderer intends to use, but is not stipulated in the table, to consider sanctioning such currency.  Sufficient time must be allowed for the assessment and to respond to such request.  The onus is on the tenderer to submit a bid with approved currencies"]
[null,4,"The format in which the exchange rate must be inserted in the table is:  1 (One) Foreign Currency = R Amount  (i.e. the Rand amount for one of each foreign currency applicable).  Exchange rates must be rounded to 4 decimals\n\nNB :  Only the USD/ZAR, GBP/ZAR and EUR/ZAR are published in this way on the SARB web pages above.  The Rand rate with the other currencies must be inverted (1/Foreign Currency Rate) in order to list it in the required format in the table below\n"]
[null,5,"All information in the table below must conform with all other equivalent information in the offer. "]
[null,null,"Payment in terms of Payment Method 2  is considered as a \"foreign payment\" although it will be effected in South African Rand. However, amounts for  \"F.O.R. Price-Goods supplied from Imported Items\", are NOT considered as \"foreign payments\""]
[null,null,"If more than one payment method apply for a currency, the Tenderer must request an additional row be inserted in the table in order to split the values and identify the relevant method.   "]
[]
[]
[null,null,"MULTIPLE CURRENCIES"]
[null,null,"No","Currency Description","Code","Exchange Rate Currency 1,00 =","Date Published","Source"]
[null,null,1,"Australian Dollar","AUD"]
[null,null,2,"Canadian Dollar","CAN"]
[null,null,3,"Swiss Franc","CHF"]
[null,null,4,"Danish Krone","DKK"]
[null,null,5,"European Currency","EUR"]
[null,null,6,"British Pound","GBP"]
[null,null,7,"Hong Kong Dollar","HKD"]
[null,null,8,"Japanese Yen","JPY"]
[null,null,9,"Norwegian Krone","NOK"]
[null,null,10,"New Zealand Dollar","NZD"]
[null,null,11,"Swedish Krone","SEK"]
[null,null,12,"Singapore Dollar","SGD"]
[null,null,13,"United States Dollar","USD"]
[null,null,14,"South African Rand","ZAR",{"v":1,"d":"R 1.000000"}]