{"text_format":"3","workbook":"xlsx","n_sheets":5,"sheets":["COVER PAGE","SCHOOL INFORMATION","CONTRACTOR NOTES (1)","CONTRACTOR NOTES (2)","SPECIFICATION UNPRICED"],"not_rendered":{"images":1,"external_links":2,"defined_names":6},"read":"whole","date_system":"1900"}

{"sheet":"COVER PAGE","index":0,"n_rows":19,"n_cols":13,"rows_kept":19,"merged":[[4,1,4,7],[6,1,6,2],[6,3,6,7],[7,1,7,2],[7,3,7,7],[8,1,8,2],[8,3,8,7],[9,1,11,2],[9,3,11,7],[12,1,12,2],[12,3,12,4],[18,1,18,7],[19,1,19,7],[20,1,20,7]]}
[]
[]
[]
[]
[null,"SPECIFICATION FOR THE FOLLOWING PROJECT"]
[]
[null,"SCHOOL NAME:",null,{"$f":"'SCHOOL INFORMATION'!C5","v":"FRANCES BAARD DISTRICT OFFICE - PEME"}]
[null,"DISTRICT MUNICIPALITY:",null,{"$f":"'SCHOOL INFORMATION'!C10","v":"FRANCES BAARD"}]
[null,"PROGRAMME",null,{"$f":"'SCHOOL INFORMATION'!C20","v":"MAINTENANCE-CORRECTIVE"}]
[null,"PROJECT DESCRIPTION:",null,{"$f":"'SCHOOL INFORMATION'!C21","v":"REPAIRS AND RENOVATIONS"}]
[]
[]
[null,"CONTRACT DRAWINGS INCUDED?",null,"NO"]
[]
[]
[{"$nulls":12}," "]
[]
[]
[null,"NOTES:  "]

{"sheet":"SCHOOL INFORMATION","index":1,"n_rows":33,"n_cols":3,"rows_kept":33,"merged":[[1,1,1,2]]}
[]
[null,"PROJECT INFORMATION"]
[]
[]
[null,"SCHOOL NAME:","FRANCES BAARD DISTRICT OFFICE - PEME"]
[null,"EMIS NUMBER:",{"$f":"IF('[1]SCHOOL INFORMATION'!$C5=\"\",\"\",VLOOKUP('[1]SCHOOL INFORMATION'!$C5,'[1]MASTER LIST'!$A$1:$IU$1000,4,FALSE))","v":300100377}]
[null,"OTHER SCHOOLS AFFECTED"]
[]
[]
[null,"DISTRICT MUNICIPALITY:",{"$f":"IF($C$5=\"\",\"\",VLOOKUP($C$5,'[1]MASTER LIST'!$A$1:$IU$1000,6,FALSE))","v":"FRANCES BAARD"}]
[null,"LOCAL MUNICIPALITY:",{"$f":"IF($C$5=\"\",\"\",VLOOKUP($C$5,'[1]MASTER LIST'!$A$1:$IU$1000,7,FALSE))","v":"SOL PLAATJE"}]
[null,"TOWN/VILLAGE:",{"$f":"IF($C$5=\"\",\"\",VLOOKUP($C$5,'[1]MASTER LIST'!$A$1:$IU$1000,8,FALSE))","v":"KIMBERLEY"}]
[null,"LONGITUDE",{"$f":"IF($C$5=\"\",\"\",VLOOKUP($C$5,'[1]MASTER LIST'!$A$1:$IU$1000,11,FALSE))","v":"-28,711558"}]
[null,"LATITUDE",{"$f":"IF($C$5=\"\",\"\",VLOOKUP($C$5,'[1]MASTER LIST'!$A$1:$IU$1000,12,FALSE))","v":"24,732737"}]
[null,"SCHOOL PRINICPAL",{"$f":"IF($C$5=\"\",\"\",VLOOKUP($C$5,'[1]MASTER LIST'!$A$1:$IU$1000,16,FALSE))","v":" ; Cellphone: "}]
[null,"CONTACT NUMBER",{"$f":"IF($C$5=\"\",\"\",VLOOKUP($C$5,'[1]MASTER LIST'!$A$1:$IU$1000,17,FALSE))","v":"() "}]
[null,"ALTERNATIVE CONTACT NUMBER",{"$f":"IF($C$5=\"\",\"\",VLOOKUP($C$5,'[1]MASTER LIST'!$A$1:$IU$1000,17,FALSE))","v":"() "}]
[]
[null,"INSPECTOR:","MR. D.R. VAN WYK"]
[null,"PROGRAMME:","MAINTENANCE-CORRECTIVE"]
[null,"DETAILED DESCRIPTION OF PROJECT:","REPAIRS AND RENOVATIONS"]
[null,"TYPE OF CONTRACT:"]
[null,"UNIQUE PROJECT NUMBER:"]
[null,"ORDER NO / TENDER NO:"]
[null,"SPECIFICATIONS COMPILED BY:",{"$f":"C19","v":"MR. D.R. VAN WYK"}]
[null,"SPECIFICATIONS RECOMMENDED BY:","MR. L. HUMPHREYS"]
[null,"SPECIFICATIONS APPROVED BY:","MR G.B. OLIPHANT"]
[null,"QUOTATION/TENDER CLOSING DATE:"]
[null,"ORDER DATE:"]
[null,"APPOINTMENT DATE:"]
[null,"CONTRACT AMOUNT:"]
[null,"CIDB GRADING","3GB OR ABOVE"]
[null,"RECOMMENDED CONTRACT PERIOD:","4 MONTHS"]

{"sheet":"CONTRACTOR NOTES (1)","index":2,"n_rows":36,"n_cols":4,"rows_kept":36,"merged":[[0,0,0,4],[2,0,2,4],[3,0,3,1],[3,2,3,4],[5,0,5,4],[6,0,6,1],[6,2,6,4],[8,0,8,4],[9,0,9,1],[9,3,9,4],[11,0,11,4],[12,0,12,4],[14,0,14,4],[15,0,15,4],[17,0,17,4],[18,0,18,4],[19,0,19,4],[21,0,21,4],[22,0,22,4],[23,0,23,4],[24,0,24,4],[26,0,26,4],[27,0,27,4],[29,0,29,4],[30,0,30,4],[31,0,31,4],[32,0,32,4],[33,0,33,4],[34,0,34,4],[35,0,35,4],[36,0,36,4]]}
["NOTICE TO TENDERERS"]
[]
["1.            SITE DESCRIPTION"]
["The site is situated in the Nothern Cape Province, in the town:",null,"KIMBERLEY"]
[" "]
["2.           WORKS DESCRIPTION"]
["The work includes the:",null,{"$f":"'COVER PAGE'!D10","v":"REPAIRS AND RENOVATIONS"}]
[]
["3.           TENDER ADJUDICATION"]
["All tenderers with minimum CIDB grading of",null,"3GB OR ABOVE","will be evaluated in line with relevent Procurement"]
["           "]
["4.          VALUE - ADDED TAX (TAX)"]
["The total tendered price must include for Value - Added Tax (VAT)"]
[]
["5.        SITE INSPECTION"]
["The Project Manager will meet prospective Tenderers as stipulated in the tender advertisement to take them on a tour of inspection of the site and to explain the nature and extent of the work in broad outline. During these compulsary site inspection meeting, all prospective tenderers shall sign onto a proof of attendance register for adjudication processes.\nFailure to attend the site meeting will lead to disqualification."]
["            "]
["6.          APPOINTMENTS"]
["The Contractor shall obtain all necessary particulars of work timeously so to ensure a proper management of site ,i.e Appointment Letter, Specifications, work programme, EPWP schedule and all other project documents.  "]
["Safety Management - It is the responsibility of the Contractor to ensure that SHEQ is enforced."]
[]
["7.          SUBMISSION OF COMPLETE PRICED BILLS OF QUANTITIES WITH THE TENDER"]
["Tenderes shall submit their priced bills of quantities in one original cast in black ink, with their tenders.\nCompleted tender documents sealed in an envelope marked with the \"PROJECT NAME\", must reach Specified Offices with all requested documents"]
["8.          IMPORTANT"]
["Please take note that before the tender documents are submitted for consideration they must be comprehensively completed. If the tenderer neglects to complete the necessary documents as requested above this could result in the disqualification of the tenderer."]
["9.           DOCUMENTS"]
["The Drawings, Articles of Agreements, Conditions of Contracts and Form of guarantee available for and must be examined by the Tenderers during normal office hours at the   office of the Chief Director or His Representative / Agent before a \ntender is submitted.\n"]
["10.           SPECIFICATION"]
[]
["Should any page/s be found to be missing or in duplicate or if any reproduction is indistinct, or if any ambiguity arises as to the meaning of any item or description, or if this Specification contains any obvious errors in respect of measurements and \n quantities etc., then the Tenderer must immediately inform the Chief Director or His Representative / Agent and have same rectified or explained as the case may be. No claims will be considered afterwards where the Tenderer has failed with these instructions. No alterations, erasure, amendment or note is to be made in the text of this Specification and should any such alteration, erasure, amendment or note be made by the Tenderer it will not be recognised, but this Specification as required by the Chief Director or His Representative / Agent will be adhered to. \n"]
["11.          DRAWINGS"]
["This Specification has been prepared in conjunction with the following drawing/s.   Drawing number:                                     Description:                                                                                                                                                                                                                                                                                                                  The site for this service is:- KIMBERLEY: DISTRICT OFFICE - PEME"]
["12.        SCOPE OF WORK"]
["The Works covered by this Specification consists of the following: - REPAIRS TO RENOVATIONS"]
["13.          CONTRACT PERIOD"]
["The time to be allowed for the completion of the Work in terms of Clause 20 of the Conditions of Contract shall be FOUR (4) MONTHS calculated from the acceptance of the tender.\n"]

{"sheet":"CONTRACTOR NOTES (2)","index":3,"n_rows":48,"n_cols":1,"rows_kept":48,"merged":[[0,0,0,4],[4,0,4,4],[10,0,10,4],[16,0,16,4],[20,0,20,4],[21,0,21,4],[22,0,22,4],[24,0,24,4],[25,0,25,4],[26,0,26,4],[27,0,27,4],[28,0,28,4],[29,0,29,4],[30,0,30,4],[31,0,31,4],[32,0,32,4],[33,0,33,4],[34,0,34,4],[35,0,35,4],[36,0,36,4],[37,0,37,4],[38,0,38,4],[39,0,39,4],[40,0,40,4],[41,0,41,4],[42,0,42,4],[43,0,43,4],[44,0,44,4],[45,0,45,4],[46,0,46,4],[47,0,47,4],[48,0,48,4]]}
["NOTICE TO TENDERERS"]
[]
[]
[]
[" "]
[]
[]
[]
[]
[]
["           "]
[]
[]
[]
[]
[]
["            "]
[]
[]
[]
["14.          PENALTY FOR DELAY"]
["Tenderers are advised that the penalty to be deducted in terms of Clause 24.2 (a) or Clause 24.3 (a) of the Conditions of Contract will be R 800-00 (ONE HUNDRED RAND) per day for each day by which the completion of the Works may be in arrears."]
[]
["15.          TRADE NAMES"]
["Prices for articles described by trade names or catalogue references must be based on the type and manufacture specified in this Specification. Where articles other than of the manufacture specified are used, the written approval of the Chief Director or his Representative / Agent must be obtained before confirming orders for any such materials, as no claim for extras in this respect will be considered.Where materials other than of the manufacture specified are used with written approval, an adjustment of the price of such material will be made and an Order in Writing issued to confirm such adjustment.\n"]
["16.          QUALITY OF MATERIALS"]
["Wherever the South African Bureau of Standards has prepared specifications for materials or products, such materials or products, whether so specified or not, are to be made and supplied to the Bureau’s specification, and further where materials or products are manufactured by Permit Holders of the S.A.B.S., such materials or products must be supplied stamped with the S.A.B.S. mark. Should the Contractor wish to use the materials or products of a person or firm who is not a Permit Holder, when there are permit holders for the particular materials or products, he must obtain the written approval of the Chief Director or his Representative / Agent before confirming orders for any such materials, as no claim for extras in this respect will be considered. All references to Specifications and Codes of Practice of the Council of the Bureau of Standards shall be deemed to be references to the latest issue of such Specifications and Codes of Practice.\n"]
["17.          OVERALLS"]
["All workman employed on site must be provided with and be dressed in protective overalls clearly marked with the name of the Contractor.\n\n"]
["18.          ALTERNATIVE TENDERS"]
["Tenderers are advised that, notwithstanding the provisions of Clause 6 on page 1 of the Tender Form, no alternative tenders for the work specified herein will be considered.\n"]
["19.          SECURITY OFFERED"]
["The contractor shall provide security to the satisfaction of the Chief Director for .0% of the tender price.\n"]
[]
["                                                  SPECIAL NOTES TO CONTRACTORS"]
["(1). It is first and foremost the responsibility of the contractor to employ only qualified persons to ensure that the quality of workmanship delivered is at all times of a high and acceptable standard when handed over to the Department of Education. The contractor is to ensure proper supervision in order to achieve this as it is not the responsibility of the Works Inspector to act as a foreman on behalf of the contractor.\n"]
["(2). It is the responsibility of the contractor / tenderer to visit the site to fimiliarise himself with the conditions on site prior to the pricing of this document.\n\n"]
["(3). It is the responsibility of the contractor to consult with the Works Inspector responsible for the contract prior to the pricing of this document to clarify any discrepensies.  Any deviation from this document without the consent of the Works Inspector will be deemed nullen void.\n"]
["(4). Any damages or repairs to surrounding works, the replacement of  equipment or any other losses suffered as a result of negligence or any other action, which is to the detriment of the Department shall be made good at the expense of the contractor.\n"]
["(5). The premises will be occupied during the contract period and care should be taken to isolate works in this regard.\n"]
["(6). It is the sole responsibility of the contractor to verify dimensions on site and to determine the correct quantities and measurements before pricing commences. Failure to do so will be to the account  of the contractor.  \n"]
["(7). The working hours shall be confined to between 7:00 to 17:00. should the need arise to work for extended hours and over weekends the contractor shall make prior arrangements for such with the Department and institution in question. \n"]
["(8).The contractor will be responsible for the water and electricity supply including any other related costs necessary to conduct the said service for the duration of this project / contract. When making use  of existing water and electricity supplies, financial arrangements must be made with the institution in question. \n"]
["9).  All works must be completed to Departmental standards and to the approval of the Chief Director of the Department of Education.  Any sub-standard work  will be corrected by the contractor at his own expense carried out to the complete satisfaction of the Chief Director. Failure to do so will result in non- payment and the Department will obtain alternate quotations in order to realise the desired quality of workmanship.\n"]
["(10). All materials shall bear the SABS stamp of approval. The contractor must ensure that only material specified are priced for and that samples in this regard is presented for approval before use. any deviation from materials specified must be approved by the Chief Director of Education. Non-SABS approved materials shall not be accepted.\n"]
["(11).  The contractor is to allow for the submitting of actual paint samples and the application thereof in order for colour schemes to be finalised.\n\n"]
["(12).  The contractor shall utilise local labour to the maximum."]
["(13).  After completion of the work leave perfect in all trades, remove all the rubble as a result of construction and leave the working area neat and tidy. \n\n\n"]

{"sheet":"SPECIFICATION UNPRICED","index":4,"n_rows":288,"n_cols":5,"rows_kept":288,"merged":[[0,0,0,4],[1,0,1,4],[2,0,2,4],[3,0,3,4],[4,0,4,4],[6,0,6,4],[7,0,7,4],[8,0,8,4],[12,0,12,4],[13,0,13,4],[14,0,14,4],[15,0,15,4],[16,0,16,4],[20,0,20,4],[23,0,23,4],[25,0,25,4],[31,0,31,4],[32,0,32,4],[33,0,33,4],[37,0,37,4],[38,0,38,4],[39,0,39,4],[40,0,40,4],[48,0,48,4],[50,0,50,4],[51,0,51,4],[53,0,53,4],[56,0,56,4],[61,0,61,4],[62,0,62,4],[63,0,63,4],[64,0,64,4],[68,0,68,4],[70,0,70,4],[72,0,72,4],[74,0,74,4],[76,0,76,4],[79,0,79,4],[80,0,80,4],[81,0,81,4],[83,0,83,4],[85,0,85,4],[91,0,91,4],[92,0,92,4],[95,0,95,4],[98,0,98,4],[99,0,99,4],[100,0,100,4],[101,0,101,4],[115,0,115,4],[116,0,116,4],[117,0,117,4],[121,0,121,4],[122,0,122,4],[123,0,123,4],[126,0,126,4],[127,0,127,4],[129,0,129,4],[130,0,130,4],[136,0,136,4],[137,0,137,4],[139,0,139,4],[141,0,141,4],[142,0,142,4],[147,0,147,4],[148,0,148,4],[149,0,149,4],[156,0,156,4],[161,0,161,4],[166,0,166,4],[172,0,172,4],[176,0,176,4],[179,0,179,4],[189,0,189,4],[191,0,191,4],[194,0,194,4],[198,0,198,4],[209,0,209,4],[210,0,210,4],[213,0,213,4],[215,0,215,4],[220,0,220,3],[221,0,221,4],[222,0,222,4],[223,0,223,4],[224,0,224,4],[226,0,226,4],[228,0,228,4],[230,0,230,4],[233,0,233,4],[235,0,235,4],[236,0,236,4],[238,0,238,4],[240,0,240,4],[243,0,243,4],[247,0,247,4],[248,0,248,4],[254,0,254,4],[255,0,255,4],[258,0,258,4],[259,0,259,4],[260,0,260,4],[261,0,261,4],[262,0,262,4],[263,0,263,4],[264,0,264,3],[265,0,265,3],[266,0,266,3],[267,0,267,3],[268,0,268,3],[269,0,269,3],[270,0,270,3],[271,0,271,3],[272,0,272,3],[273,0,273,3],[274,0,274,3],[275,0,275,3],[276,0,276,3],[277,0,277,3],[278,0,278,3],[279,0,279,3],[280,0,280,3],[281,0,281,4],[282,0,282,4],[283,0,284,4],[285,0,285,4],[286,0,286,4],[287,1,287,4]]}
["SPECIFICATION - UNPRICED"]
[{"$f":"'COVER PAGE'!D7","v":"FRANCES BAARD DISTRICT OFFICE - PEME"}]
[{"$f":"'COVER PAGE'!D9","v":"MAINTENANCE-CORRECTIVE"}]
[{"$f":"'COVER PAGE'!D10","v":"REPAIRS AND RENOVATIONS"}]
[]
["SPECIFICATION","UNIT","QTY","Unit Price","Amount"]
["REPAIRS AND RENOVATIONS"]
[" "]
["PRELIMINARY AND GENERAL"]
["Contractural Requirements including Site Establishment and removal of site establishment.","No",1,0,{"$f":"C10*D10","v":0}]
["Compliance to Occupational Health and Safety Act and Regulations\nThe contractors attention is drawn to the notes to tenderers “Occupational Health and Safety Act” with the full contents thereof as well as the Government Gazette No. 25207 (18 July 2003) and O.H & S.  Specification is provided.  The total cost of the Health and Safety items must be priced under this clause as no additional claims will be entertained.","No",1,0,{"$f":"C11*D11","v":0}]
["SUB TOTAL",{"$nulls":3},0]
[]
["EARTHWORKS"]
["EXCAVATIONS"]
["DEFINITIONS FOR EXCAVATIONS:\nEarth shall mean ground that can be removed by hand tools and shall include loose gravel, clay, made up ground, loose or soft shale, ouklip and any loose boulders less than 75mm in diameter.\nSoft rock shall mean rock that can be loosened by hand pick or crowbar and includes hard shale, compact ouklip, stone of a similar hardness and boulders from 75mm diameter up to 0, 03 cubic meters in volume.\nHard rock shall mean granite, quartzitic sandstone, slate and rock of similar or greater hardness, and boulders over 0, 03 cubic meters in volume.\n"]
["EXCAVATIONS FOR NEW SEWER, INCREASE GRADIENT OF EXISTING SEWER AND NEW WATER SUPPLY PIPE TRENCHING"]
["Excavate in earth for a 330m trench exceeding 1000mm and not exceeding 2000mm deep to lay a 160mm diameter Upvc drain pipe measured elswhere. Excavations must be 600mm wide and in straight lines and neatly trimmed.","m³",370,0,{"$f":"C18*D18","v":0}]
["Excavate earth out of 8 holes, 1mx1mx exceeding 1meter and not exceeding 2m deep for the construction of 8 manholes measured elsewhere.","m³",7,0,{"$f":"C19*D19","v":0}]
["Excavate earth out of 150m trench, 600mm deep x 300mm wide for a new water pipe measured elsewhere.","m³",20,0,{"$f":"C20*D20","v":0}]
["Extra over trench excavations in earth for excavations "]
["Soft rock","m³",22,0,{"$f":"C22*D22","v":0}]
["Hard rock","m³",12,0,0]
["Extra over all excavations for carting away"]
["Surplus material including rock from excavations and/or stock piles on site to be used to fill up the existing conservancy tank. Material shall be well watered and rammed in layers not exceeding 150mm in depth and thoroughly consolidated to a density of not less than 90% Modified AASHTO.","m³",14,0,{"$f":"C25*D25","v":0}]
["Filling"]
["Place 100mm river sand blinding and compact- length 480m ","m³",48,0,{"$f":"C27*D27","v":0}]
["Place 200mm river sand blanket and compact- length 480m ","m³",96,0,{"$f":"C28*D28","v":0}]
["Backfill trench and compact to a density of not less than 90 per cent Modified AASHTO.","m³",417,0,{"$f":"C29*D29","v":0}]
["Filling of conservancy tank shall be of approved clean earth, well watered and rammed in layers not exceeding 150mm in depth and thoroughly  consolidated to a density of not less than 90% Modified AASHTO."]
["SUB TOTAL",{"$nulls":3},0]
[]
[]
["CONCRETE WORK"]
["Break up existing six manhole concrete bases of 600mm( L) x 450mm (W) x 100mm thick which will be directed on site.","m³",1,0,{"$f":"C35*D35","v":0}]
["Cast new concrete base of 600mm( L) x 450mm (W) x 100mm thick in class C-concrete with concrete strength not less than 25Mpa for eight new drain manholes measured elswhere.","m³",1,0,{"$f":"C36*D36","v":0}]
["SUB TOTAL",{"$nulls":3},0]
[]
["MASONRY"]
["BRICKWORK"]
["Manholes"]
["Demolish six existing manholes, 600mm(L) x  600mm(W), not exceeding 1000mm deep.","no",6,0,{"$f":"C42*D42","v":0}]
["Break into existing sewer drain not exceeding 1000mm deep, connect new 160mm diameter PVC piping and make good to wall, etc. Also redo the benching according to the new flow direction.","no",1,0,0]
["Supply and install a new 450 x 450mm light duty single seal manhole cover with frame on top of existing valve chamber.\n \n","no",1,0,0]
["Construct a new manhole with a 600 x 600mm medium duty double seal manhole cover with frame. Build a manhole of 15 course one brick walls in stretcher bond with NFX bricks in Class11 mortar, plastered interior walls and the exposed exterior one brick coarse above natural ground level. Benching to the floor of manhole and around drain pipe. \n \n","no",5,0,0]
["Construct a new manhole with a 600 x 600mm medium duty double seal manhole cover with frame. Build a manhole of 19 course one brick walls in stretcher bond with NFX bricks in Class11 mortar, plastered interior walls and the exposed exterior one brick coarse above natural ground level. Benching to the floor of manhole and around drain pipe. \n \n","no",2,0,0]
["Construct a new manhole with a 600 x 600mm medium duty double seal manhole cover with frame. Build a manhole of 23 course one brick walls in stretcher bond with NFX bricks in Class11 mortar, plastered interior walls and the exposed exterior one brick coarse above natural ground level. Benching to the floor of manhole and around drain pipe. \n \n","no",1,0,0]
["SUB TOTAL",{"$nulls":3},0]
[]
[]
["ROOF COVERING"]
["REPAIR ROOF LEAKAGES"]
["Thoroughly examine roof surfaces of buildings. The contractor is to pay special attention internally where watermarks are evident on ceilings to locate leaks. All loose, missing or worn out roof screws are to be replaced, plug screw holes using an approved wood glue and fit new and longer roof screws including new washers and under cup washers. Holes in sheets are to be soldered. Similarly examine all ridging and make good where defective sections are located. Areas of roof that have been previously sealed must be carefully re-examined and all defective membranes should be removed and repaired as mentioned above. In addition to this, the contractor is to provide the Department with a written guarantee equivalent to one year starting from the date of final delivery.                                         Location:\nBuilding Block A:           204m²\nBuilding Block B:           936m²   \nOffice Block D:              936m²                                                                                     Office Block E:              936m²\nCovered Passages:     405m²\n","m²",3417,0,{"$f":"C53*D53","v":0}]
["SUPPLY AND INSTALL NEW 0,6MM CORUGATED ROOF SHEETS"]
[]
["Replace rusted corrugated roof sheets with new SABS approved 0,6mm corrugated roof sheets with 6 x 75mm roof screws on roof of office block C which will be directed on site.","m²",858,0,{"$f":"C56*D56","v":0}]
["SHEET METAL FLASHINGS"]
["Supply and install new 0,55mm thick approved galvanized metal  ridgeflashings and accessories. Fixtite stitching screws to be used to fix flashings to sheeting at Office block C.","m",80,0,0]
["Replace missing 25mm x 10mm gable flashing with new 0,55mm thick approved galvanized metal flashings and accessories. Clips and Fixtite stitching screws to be used to fix flashings to sheeting at Office block C.","m",12,0,0]
["Refit existing loose gable flashing with suitable fastners at office block E.","m",3,0,0]
{"$rows_left_out":228}