{"text_format":"3","workbook":"xlsx","n_sheets":9,"sheets":["Cover","PS5_Supply","BoQ_Equipment","BoQ - Services","Summary","Transport and Offloading Matrix","Installation & Commissioning","CPA Formula","Exchange Rates"],"not_rendered":{"images":1,"defined_names":19},"read":"whole","date_system":"1900"}

{"sheet":"Cover","index":0,"n_rows":41,"n_cols":2,"rows_kept":41,"merged":[[28,0,28,1],[31,0,31,1]]}
{"$rows_empty":10}
["PRICING INFORMATION"]
[]
["INVITATION TO TENDER"]
[]
[" ENQUIRY No. or RFP number"]
["FOR"]
["Name of enquiry"]
[]
[]
{"$rows_left_out":23}
{"sheet":"PS5_Supply","index":1,"n_rows":106,"n_cols":110,"rows_kept":106,"merged":[[3,18,4,19],[3,28,4,29],[3,38,4,39],[3,48,4,49],[3,58,4,59],[3,68,4,69],[3,78,4,79],[3,88,4,89],[3,98,4,99],[3,108,4,109],[5,1,6,9],[9,10,12,10],[9,11,12,11],[9,12,12,12],[9,13,12,13],[9,14,12,14],[9,15,12,15],[9,16,12,16],[9,17,12,17],[9,18,12,18],[9,19,12,19],[9,20,12,20],[9,21,12,21],[9,22,12,22],[9,23,12,23],[9,24,12,24],[9,25,12,25],[9,26,12,26],[9,27,12,27],[9,28,12,28],[9,29,12,29],[9,30,12,30],[9,31,12,31],[9,32,12,32],[9,33,12,33],[9,34,12,34],[9,35,12,35],[9,36,12,36],[9,37,12,37],[9,38,12,38],[9,39,12,39],[9,40,12,40],[9,41,12,41],[9,42,12,42],[9,43,12,43],[9,44,12,44],[9,45,12,45],[9,46,12,46],[9,47,12,47],[9,48,12,48],[9,49,12,49],[9,50,12,50],[9,51,12,51],[9,52,12,52],[9,53,12,53],[9,54,12,54],[9,55,12,55],[9,56,12,56],[9,57,12,57],[9,58,12,58],[9,59,12,59],[9,60,12,60],[9,61,12,61],[9,62,12,62],[9,63,12,63],[9,64,12,64],[9,65,12,65],[9,66,12,66],[9,67,12,67],[9,68,12,68],[9,69,12,69],[9,70,12,70],[9,71,12,71],[9,72,12,72],[9,73,12,73],[9,74,12,74],[9,75,12,75],[9,76,12,76],[9,77,12,77],[9,78,12,78],[9,79,12,79],[9,80,12,80],[9,81,12,81],[9,82,12,82],[9,83,12,83],[9,84,12,84],[9,85,12,85],[9,86,12,86],[9,87,12,87],[9,88,12,88],[9,89,12,89],[9,90,12,90],[9,91,12,91],[9,92,12,92],[9,93,12,93],[9,94,12,94],[9,95,12,95],[9,96,12,96],[9,97,12,97],[9,98,12,98],[9,99,12,99],[9,100,12,100],[9,101,12,101],[9,102,12,102],[9,103,12,103],[9,104,12,104],[9,105,12,105],[9,106,12,106],[9,107,12,107],[9,108,12,108],[9,109,12,109],[61,18,62,19],[61,28,62,29],[61,38,62,39],[61,48,62,49],[61,58,62,59],[61,68,62,69],[61,78,62,79],[61,88,62,89],[61,98,62,99],[61,108,62,109],[63,1,64,9],[68,10,70,10],[68,11,70,11],[68,12,70,12],[68,13,70,13],[68,14,70,14],[68,15,70,15],[68,16,70,16],[68,17,70,17],[68,18,70,18],[68,19,70,19],[68,20,70,20],[68,21,70,21],[68,22,70,22],[68,23,70,23],[68,24,70,24],[68,25,70,25],[68,26,70,26],[68,27,70,27],[68,28,70,28],[68,29,70,29],[68,30,70,30],[68,31,70,31],[68,32,70,32],[68,33,70,33],[68,34,70,34],[68,35,70,35],[68,36,70,36],[68,37,70,37],[68,38,70,38],[68,39,70,39],[68,40,70,40],[68,41,70,41],[68,42,70,42],[68,43,70,43],[68,44,70,44],[68,45,70,45],[68,46,70,46],[68,47,70,47],[68,48,70,48],[68,49,70,49],[68,50,70,50],[68,51,70,51],[68,52,70,52],[68,53,70,53],[68,54,70,54],[68,55,70,55],[68,56,70,56],[68,57,70,57],[68,58,70,58],[68,59,70,59],[68,60,70,60],[68,61,70,61],[68,62,70,62],[68,63,70,63],[68,64,70,64],[68,65,70,65],[68,66,70,66],[68,67,70,67],[68,68,70,68],[68,69,70,69],[68,70,70,70],[68,71,70,71],[68,72,70,72],[68,73,70,73],[68,74,70,74],[68,75,70,75],[68,76,70,76],[68,77,70,77],[68,78,70,78],[68,79,70,79],[68,80,70,80],[68,81,70,81],[68,82,70,82],[68,83,70,83],[68,84,70,84],[68,85,70,85],[68,86,70,86],[68,87,70,87],[68,88,70,88],[68,89,70,89],[68,90,70,90],[68,91,70,91],[68,92,70,92],[68,93,70,93],[68,94,70,94],[68,95,70,95],[68,96,70,96],[68,97,70,97],[68,98,70,98],[68,99,70,99],[68,100,70,100],[68,101,70,101],[68,102,70,102],[68,103,70,103],[68,104,70,104],[68,105,70,105],[68,106,70,106],[68,107,70,107],[68,108,70,108],[68,109,70,109]]}
[]
[null,{"$f":"\"ENQUIRY NUMBER :\"&Cover!$B$15","v":"ENQUIRY NUMBER :"},{"$nulls":3},"PRICES INCLUSIVE OF VAT (VALUE ADDED TAX)"]
[]
[null,{"$f":"\"PRICE SCHEDULE : C (PS5) :\"&Cover!$B$17","v":"PRICE SCHEDULE : C (PS5) :"},{"$nulls":16},{"$f":"\"SUPPLIER:\"&Cover!$B$21","v":"SUPPLIER:"},{"$nulls":9},{"$f":"\"SUPPLIER:\"&Cover!$B$21","v":"SUPPLIER:"},{"$nulls":9},{"$f":"\"SUPPLIER:\"&Cover!$B$21","v":"SUPPLIER:"},{"$nulls":9},{"$f":"\"SUPPLIER:\"&Cover!$B$21","v":"SUPPLIER:"},{"$nulls":9},{"$f":"\"SUPPLIER:\"&Cover!$B$21","v":"SUPPLIER:"},{"$nulls":9},{"$f":"\"SUPPLIER:\"&Cover!$B$21","v":"SUPPLIER:"},{"$nulls":9},{"$f":"\"SUPPLIER:\"&Cover!$B$21","v":"SUPPLIER:"},{"$nulls":9},{"$f":"\"SUPPLIER:\"&Cover!$B$21","v":"SUPPLIER:"},{"$nulls":9},{"$f":"\"SUPPLIER:\"&Cover!$B$21","v":"SUPPLIER:"},{"$nulls":9},{"$f":"\"SUPPLIER:\"&Cover!$B$21","v":"SUPPLIER:"}]
[]
[null,"PRICE SCHEDULE FOR GOODS MANUFACTURED IN AND OUTSIDE THE R.S.A.  PRICE PER UNIT FOR SUPPLY, DELIVERY AND OFF LOADING.  ALL AMOUNTS EXPRESSED IN RANDS"]
[]
[]
[null," REMARKS",{"$nulls":5},"                       ITEM NO",null,null,1,2,3,4,5,6,7,8,9,10,11,12,13,14,15,16,17,18,19,20,21,22,23,24,25,26,27,28,29,30,31,32,33,34,35,36,37,38,39,40,41,42,43,44,45,46,47,48,49,50,51,52,53,54,55,56,57,58,59,60,61,62,63,64,65,66,67,68,69,70,71,72,73,74,75,76,77,78,79,80,81,82,83,84,85,86,87,88,89,90,91,92,93,94,95,96,97,98]
[null," *Eskom may effect this insurance which includes war",{"$nulls":5},"                  ITEM DESCRIPTION",null,null,{"$f":"INDEX(BoQ_Equipment!$C:$C,MATCH(PS5_Supply!K$9,BoQ_Equipment!$B:$B,0))","v":"Scheme: 1 Feeder Double Busbar - 110 VDC"},{"$f":"INDEX(BoQ_Equipment!$C:$C,MATCH(PS5_Supply!L$9,BoQ_Equipment!$B:$B,0))","v":"Scheme: 1 Feeder Double Busbar - 220 VDC"},{"$f":"INDEX(BoQ_Equipment!$C:$C,MATCH(PS5_Supply!M$9,BoQ_Equipment!$B:$B,0))","v":"Scheme: 2 Feeder Double Busbar  - 110 VDC"},{"$f":"INDEX(BoQ_Equipment!$C:$C,MATCH(PS5_Supply!N$9,BoQ_Equipment!$B:$B,0))","v":"Scheme: 2 Feeder Double Busbar  - 220 VDC"},{"$f":"INDEX(BoQ_Equipment!$C:$C,MATCH(PS5_Supply!O$9,BoQ_Equipment!$B:$B,0))","v":"Scheme: 3 Feeder Double Busbar - 110 VDC"},{"$f":"INDEX(BoQ_Equipment!$C:$C,MATCH(PS5_Supply!P$9,BoQ_Equipment!$B:$B,0))","v":"Scheme: 3 Feeder Double Busbar - 220 VDC"},{"$f":"INDEX(BoQ_Equipment!$C:$C,MATCH(PS5_Supply!Q$9,BoQ_Equipment!$B:$B,0))","v":"Scheme: 4 Feeder Double Busbar - 110 VDC"},{"$f":"INDEX(BoQ_Equipment!$C:$C,MATCH(PS5_Supply!R$9,BoQ_Equipment!$B:$B,0))","v":"Scheme: 4 Feeder Double Busbar - 220 VDC"},{"$f":"INDEX(BoQ_Equipment!$C:$C,MATCH(PS5_Supply!S$9,BoQ_Equipment!$B:$B,0))","v":"Scheme: 1 Feeder & 1 Transformer BAH - 110 VDC"},{"$f":"INDEX(BoQ_Equipment!$C:$C,MATCH(PS5_Supply!T$9,BoQ_Equipment!$B:$B,0))","v":"Scheme: 1 Feeder & 1 Transformer BAH - 220 VDC"},{"$f":"INDEX(BoQ_Equipment!$C:$C,MATCH(PS5_Supply!U$9,BoQ_Equipment!$B:$B,0))","v":"Scheme: 2 Feeders BAH - 110 VDC"},{"$f":"INDEX(BoQ_Equipment!$C:$C,MATCH(PS5_Supply!V$9,BoQ_Equipment!$B:$B,0))","v":"Scheme: 2 Feeders BAH - 220 VDC"},{"$f":"INDEX(BoQ_Equipment!$C:$C,MATCH(PS5_Supply!W$9,BoQ_Equipment!$B:$B,0))","v":"Scheme: 1 Feeder with Line Reactor BAH - 110 VDC"},{"$f":"INDEX(BoQ_Equipment!$C:$C,MATCH(PS5_Supply!X$9,BoQ_Equipment!$B:$B,0))","v":"Scheme: 1 Feeder with Line Reactor BAH - 220 VDC"},{"$f":"INDEX(BoQ_Equipment!$C:$C,MATCH(PS5_Supply!Y$9,BoQ_Equipment!$B:$B,0))","v":"Scheme: 1 Feeder with Line Reactor & 1 Transformer BAH - 110 VDC"},{"$f":"INDEX(BoQ_Equipment!$C:$C,MATCH(PS5_Supply!Z$9,BoQ_Equipment!$B:$B,0))","v":"Scheme: 1 Feeder with Line Reactor & 1 Transformer BAH - 220 VDC"},{"$f":"INDEX(BoQ_Equipment!$C:$C,MATCH(PS5_Supply!AA$9,BoQ_Equipment!$B:$B,0))","v":"Scheme: 2 Feeders with Line Reactors BAH - 110 VDC"},{"$f":"INDEX(BoQ_Equipment!$C:$C,MATCH(PS5_Supply!AB$9,BoQ_Equipment!$B:$B,0))","v":"Scheme: 2 Feeders with Line Reactors BAH - 220 VDC"},{"$f":"INDEX(BoQ_Equipment!$C:$C,MATCH(PS5_Supply!AC$9,BoQ_Equipment!$B:$B,0))","v":"Scheme: 1 Feeder & 1 Feeder with Line Reactor BAH - 110 VDC"},{"$f":"INDEX(BoQ_Equipment!$C:$C,MATCH(PS5_Supply!AD$9,BoQ_Equipment!$B:$B,0))","v":"Scheme: 1 Feeder & 1 Feeder with Line Reactor BAH - 220 VDC"},{"$f":"INDEX(BoQ_Equipment!$C:$C,MATCH(PS5_Supply!AE$9,BoQ_Equipment!$B:$B,0))","v":"Scheme: 1 Busbar Reactor BAH - 110 VDC"},{"$f":"INDEX(BoQ_Equipment!$C:$C,MATCH(PS5_Supply!AF$9,BoQ_Equipment!$B:$B,0))","v":"Scheme: 1 Busbar Reactor BAH - 220 VDC"},{"$f":"INDEX(BoQ_Equipment!$C:$C,MATCH(PS5_Supply!AG$9,BoQ_Equipment!$B:$B,0))","v":"Scheme: 1 Feeder BAH - 110 VDC"},{"$f":"INDEX(BoQ_Equipment!$C:$C,MATCH(PS5_Supply!AH$9,BoQ_Equipment!$B:$B,0))","v":"Scheme: 1 Feeder BAH - 220 VDC"},{"$f":"INDEX(BoQ_Equipment!$C:$C,MATCH(PS5_Supply!AI$9,BoQ_Equipment!$B:$B,0))","v":"Scheme: 1 Transformer BAH - 110 VDC"},{"$f":"INDEX(BoQ_Equipment!$C:$C,MATCH(PS5_Supply!AJ$9,BoQ_Equipment!$B:$B,0))","v":"Scheme: 1 Transformer BAH - 220 VDC"},{"$f":"INDEX(BoQ_Equipment!$C:$C,MATCH(PS5_Supply!AK$9,BoQ_Equipment!$B:$B,0))","v":"Scheme: 1 Feeder & 1 Transformer BAH (Trfr MV - DBB Config) - 110 VDC"},{"$f":"INDEX(BoQ_Equipment!$C:$C,MATCH(PS5_Supply!AL$9,BoQ_Equipment!$B:$B,0))","v":"Scheme: 1 Feeder & 1 Transformer BAH (Trfr MV - DBB Config) - 220 VDC"},{"$f":"INDEX(BoQ_Equipment!$C:$C,MATCH(PS5_Supply!AM$9,BoQ_Equipment!$B:$B,0))","v":"Scheme: 1 Feeder with Line Reactor & 1 Transformer BAH (Trfr MV - DBB Config) - 110 VDC"},{"$f":"INDEX(BoQ_Equipment!$C:$C,MATCH(PS5_Supply!AN$9,BoQ_Equipment!$B:$B,0))","v":"Scheme: 1 Feeder with Line Reactor & 1 Transformer BAH (Trfr MV - DBB Config) - 220 VDC"},{"$f":"INDEX(BoQ_Equipment!$C:$C,MATCH(PS5_Supply!AO$9,BoQ_Equipment!$B:$B,0))","v":"Scheme: 1 Transformer BAH (Trfr MV - DBB Config) - 110 VDC"},{"$f":"INDEX(BoQ_Equipment!$C:$C,MATCH(PS5_Supply!AP$9,BoQ_Equipment!$B:$B,0))","v":"Scheme: 1 Transformer BAH (Trfr MV - DBB Config) - 220 VDC"},{"$f":"INDEX(BoQ_Equipment!$C:$C,MATCH(PS5_Supply!AQ$9,BoQ_Equipment!$B:$B,0))","v":"Scheme: IDM+6U with 1 Traveling Wave Fault Locator Card for 2 Lines (DBB) - 110 VDC"},{"$f":"INDEX(BoQ_Equipment!$C:$C,MATCH(PS5_Supply!AR$9,BoQ_Equipment!$B:$B,0))","v":"Scheme: IDM+6U with 1 Traveling Wave Fault Locator Card for 2 Lines (DBB) - 220 VDC"},{"$f":"INDEX(BoQ_Equipment!$C:$C,MATCH(PS5_Supply!AS$9,BoQ_Equipment!$B:$B,0))","v":"Scheme: IDM+6U with 1 Traveling Wave Fault Locator Card for 1 Line (BAH) - 110 VDC"},{"$f":"INDEX(BoQ_Equipment!$C:$C,MATCH(PS5_Supply!AT$9,BoQ_Equipment!$B:$B,0))","v":"Scheme: IDM+6U with 1 Traveling Wave Fault Locator Card for 1 Line (BAH) - 220 VDC"},{"$f":"INDEX(BoQ_Equipment!$C:$C,MATCH(PS5_Supply!AU$9,BoQ_Equipment!$B:$B,0))","v":"Scheme: IDM+6U with 2 Traveling Wave Fault Locator Cards for 4 Lines (DBB) - 110 VDC"},{"$f":"INDEX(BoQ_Equipment!$C:$C,MATCH(PS5_Supply!AV$9,BoQ_Equipment!$B:$B,0))","v":"Scheme: IDM+6U with 2 Traveling Wave Fault Locator Cards for 4 Lines (DBB) - 220 VDC"},{"$f":"INDEX(BoQ_Equipment!$C:$C,MATCH(PS5_Supply!AW$9,BoQ_Equipment!$B:$B,0))","v":"Scheme: IDM+6U with 2 Traveling Wave Fault Locator Cards for 2 Lines (BAH)  - 110 VDC"},{"$f":"INDEX(BoQ_Equipment!$C:$C,MATCH(PS5_Supply!AX$9,BoQ_Equipment!$B:$B,0))","v":"Scheme: IDM+6U with 2 Traveling Wave Fault Locator Cards for 2 Lines (BAH)  - 220 VDC"},{"$f":"INDEX(BoQ_Equipment!$C:$C,MATCH(PS5_Supply!AY$9,BoQ_Equipment!$B:$B,0))","v":"Loose: IDM+6U with 9A/32B c/w Chassis Plate & Loom - 110 VDC"},{"$f":"INDEX(BoQ_Equipment!$C:$C,MATCH(PS5_Supply!AZ$9,BoQ_Equipment!$B:$B,0))","v":"Loose: IDM+6U with 9A/32B c/w Chassis Plate & Loom - 220 VDC"},{"$f":"INDEX(BoQ_Equipment!$C:$C,MATCH(PS5_Supply!BA$9,BoQ_Equipment!$B:$B,0))","v":"Loose: IDM+6U with 18A/64B c/w Chassis Plate & Loom - 110 VDC"},{"$f":"INDEX(BoQ_Equipment!$C:$C,MATCH(PS5_Supply!BB$9,BoQ_Equipment!$B:$B,0))","v":"Loose: IDM+6U with 18A/64B c/w Chassis Plate & Loom - 220 VDC"},{"$f":"INDEX(BoQ_Equipment!$C:$C,MATCH(PS5_Supply!BC$9,BoQ_Equipment!$B:$B,0))","v":"Loose: IDM+6U with 27A/96B c/w Chassis Plate & Loom - 110 VDC"},{"$f":"INDEX(BoQ_Equipment!$C:$C,MATCH(PS5_Supply!BD$9,BoQ_Equipment!$B:$B,0))","v":"Loose: IDM+6U with 27A/96B c/w Chassis Plate & Loom - 220 VDC"},{"$f":"INDEX(BoQ_Equipment!$C:$C,MATCH(PS5_Supply!BE$9,BoQ_Equipment!$B:$B,0))","v":"Loose: IDM+6U with 36A/128B c/w Chassis Plate & Loom - 110 VDC"},{"$f":"INDEX(BoQ_Equipment!$C:$C,MATCH(PS5_Supply!BF$9,BoQ_Equipment!$B:$B,0))","v":"Loose: IDM+6U with 36A/128B c/w Chassis Plate & Loom - 220 VDC"},{"$f":"INDEX(BoQ_Equipment!$C:$C,MATCH(PS5_Supply!BG$9,BoQ_Equipment!$B:$B,0))","v":"Loose: IDM+6U with 1 x TWS Card, 1 x 9A/32B Card c/w Chassis Plate & Loom - 110 VDC"},{"$f":"INDEX(BoQ_Equipment!$C:$C,MATCH(PS5_Supply!BH$9,BoQ_Equipment!$B:$B,0))","v":"Loose: IDM+6U with 1 x TWS Card, 1 x 9A/32B Card c/w Chassis Plate & Loom - 220 VDC"},{"$f":"INDEX(BoQ_Equipment!$C:$C,MATCH(PS5_Supply!BI$9,BoQ_Equipment!$B:$B,0))","v":"Loose: IDM+6U with 2 x TWS Cards, 2 x 9A/32B Cards c/w Chassis Plate & Loom - 110 VDC"},{"$f":"INDEX(BoQ_Equipment!$C:$C,MATCH(PS5_Supply!BJ$9,BoQ_Equipment!$B:$B,0))","v":"Loose: IDM+6U with 2 x TWS Cards, 2 x 9A/32B Cards c/w Chassis Plate & Loom - 220 VDC"},{"$f":"INDEX(BoQ_Equipment!$C:$C,MATCH(PS5_Supply!BK$9,BoQ_Equipment!$B:$B,0))","v":"Portable IDM+6U Unit 1 with 18A/64B and long loom"},{"$f":"INDEX(BoQ_Equipment!$C:$C,MATCH(PS5_Supply!BL$9,BoQ_Equipment!$B:$B,0))","v":"Portable IDM+6U Unit 2 with 36A/128B and long loom"},{"$f":"INDEX(BoQ_Equipment!$C:$C,MATCH(PS5_Supply!BM$9,BoQ_Equipment!$B:$B,0))","v":"Portable IDM+6U Unit 3 with 1 x TWS Card, 1 x 9A/32B Card and long loom "},{"$f":"INDEX(BoQ_Equipment!$C:$C,MATCH(PS5_Supply!BN$9,BoQ_Equipment!$B:$B,0))","v":"Portable IDM+6U Unit 4 with 2 x TWS Card, 2 x 9A/32B Card and long loom "},{"$f":"INDEX(BoQ_Equipment!$C:$C,MATCH(PS5_Supply!BO$9,BoQ_Equipment!$B:$B,0))","v":"Additional Card for Traveling Wave Fault Locator "},{"$f":"INDEX(BoQ_Equipment!$C:$C,MATCH(PS5_Supply!BP$9,BoQ_Equipment!$B:$B,0))","v":"Expansion Kit: 9A/32B to 18A/64B "},{"$f":"INDEX(BoQ_Equipment!$C:$C,MATCH(PS5_Supply!BQ$9,BoQ_Equipment!$B:$B,0))","v":"Expansion Kit: 18A/64B to 27A/96B - 110 VDC"},{"$f":"INDEX(BoQ_Equipment!$C:$C,MATCH(PS5_Supply!BR$9,BoQ_Equipment!$B:$B,0))","v":"Expansion Kit: 18A/64B to 27A/96B - 220 VDC"},{"$f":"INDEX(BoQ_Equipment!$C:$C,MATCH(PS5_Supply!BS$9,BoQ_Equipment!$B:$B,0))","v":"Expansion Kit: 27A/96B to 36A/128B"},{"$f":"INDEX(BoQ_Equipment!$C:$C,MATCH(PS5_Supply!BT$9,BoQ_Equipment!$B:$B,0))","v":"Loose: Chassis Plate & Loom for 9A/32B Card "},{"$f":"INDEX(BoQ_Equipment!$C:$C,MATCH(PS5_Supply!BU$9,BoQ_Equipment!$B:$B,0))","v":"PC Communications cable for DFRs (RJ45 for PC connection)"},{"$f":"INDEX(BoQ_Equipment!$C:$C,MATCH(PS5_Supply!BV$9,BoQ_Equipment!$B:$B,0))","v":"Ethernet Switch: RSG2100 "},{"$f":"INDEX(BoQ_Equipment!$C:$C,MATCH(PS5_Supply!BW$9,BoQ_Equipment!$B:$B,0))","v":"Fibre Optic Patch Panel"},{"$f":"INDEX(BoQ_Equipment!$C:$C,MATCH(PS5_Supply!BX$9,BoQ_Equipment!$B:$B,0))","v":"CPU Board "},{"$f":"INDEX(BoQ_Equipment!$C:$C,MATCH(PS5_Supply!BY$9,BoQ_Equipment!$B:$B,0))","v":"Signal Conditioning Board  (18-250Vdc Pickup)"},{"$f":"INDEX(BoQ_Equipment!$C:$C,MATCH(PS5_Supply!BZ$9,BoQ_Equipment!$B:$B,0))","v":"Signal Conditioning Board  (35-250Vdc Pickup)"},{"$f":"INDEX(BoQ_Equipment!$C:$C,MATCH(PS5_Supply!CA$9,BoQ_Equipment!$B:$B,0))","v":"PSU Board "},{"$f":"INDEX(BoQ_Equipment!$C:$C,MATCH(PS5_Supply!CB$9,BoQ_Equipment!$B:$B,0))","v":"MMI Board "},{"$f":"INDEX(BoQ_Equipment!$C:$C,MATCH(PS5_Supply!CC$9,BoQ_Equipment!$B:$B,0))","v":"IDM+ with 9A/32D "},{"$f":"INDEX(BoQ_Equipment!$C:$C,MATCH(PS5_Supply!CD$9,BoQ_Equipment!$B:$B,0))","v":"IDM+ with 18A/64D "},{"$f":"INDEX(BoQ_Equipment!$C:$C,MATCH(PS5_Supply!CE$9,BoQ_Equipment!$B:$B,0))","v":"IDM+ with 27A/96D "},{"$f":"INDEX(BoQ_Equipment!$C:$C,MATCH(PS5_Supply!CF$9,BoQ_Equipment!$B:$B,0))","v":"IDM+ with 36A/128D "},{"$f":"INDEX(BoQ_Equipment!$C:$C,MATCH(PS5_Supply!CG$9,BoQ_Equipment!$B:$B,0))","v":"IDM+ with 1 x TWS (No LC or CT Snap) & 1 x 9/32 "},{"$f":"INDEX(BoQ_Equipment!$C:$C,MATCH(PS5_Supply!CH$9,BoQ_Equipment!$B:$B,0))","v":"IDM+ with 2 x TWS (No LC or CT Snap) & 2 x 9/32 "},{"$f":"INDEX(BoQ_Equipment!$C:$C,MATCH(PS5_Supply!CI$9,BoQ_Equipment!$B:$B,0))","v":"FL Card "},{"$f":"INDEX(BoQ_Equipment!$C:$C,MATCH(PS5_Supply!CJ$9,BoQ_Equipment!$B:$B,0))","v":"Internal GPS Receiver "},{"$f":"INDEX(BoQ_Equipment!$C:$C,MATCH(PS5_Supply!CK$9,BoQ_Equipment!$B:$B,0))","v":"GPS Cable & Antenna 30m "},{"$f":"INDEX(BoQ_Equipment!$C:$C,MATCH(PS5_Supply!CL$9,BoQ_Equipment!$B:$B,0))","v":"Linear Couplers with cables (set of 3) "},{"$f":"INDEX(BoQ_Equipment!$C:$C,MATCH(PS5_Supply!CM$9,BoQ_Equipment!$B:$B,0))","v":"Linear Couplers mounted on Snaptrack with cables (set of 3) "},{"$f":"INDEX(BoQ_Equipment!$C:$C,MATCH(PS5_Supply!CN$9,BoQ_Equipment!$B:$B,0))","v":"230Vac Finder Relay with Base (60.13.8.230)"},{"$f":"INDEX(BoQ_Equipment!$C:$C,MATCH(PS5_Supply!CO$9,BoQ_Equipment!$B:$B,0))","v":"24Vdc Finder Relay with Base (60.13.9.24)"},{"$f":"INDEX(BoQ_Equipment!$C:$C,MATCH(PS5_Supply!CP$9,BoQ_Equipment!$B:$B,0))","v":"48Vdc Finder Relay with Base (60.13.9.48)"},{"$f":"INDEX(BoQ_Equipment!$C:$C,MATCH(PS5_Supply!CQ$9,BoQ_Equipment!$B:$B,0))","v":"110Vdc Finder Relay with Base (60.13.9.110)"},{"$f":"INDEX(BoQ_Equipment!$C:$C,MATCH(PS5_Supply!CR$9,BoQ_Equipment!$B:$B,0))","v":"220Vdc Finder Relay with Base (60.13.9.220)"},{"$f":"INDEX(BoQ_Equipment!$C:$C,MATCH(PS5_Supply!CS$9,BoQ_Equipment!$B:$B,0))","v":"RF4 Relay with Base (RF4 & FN-DE-IP-10) (110Vdc)"},{"$f":"INDEX(BoQ_Equipment!$C:$C,MATCH(PS5_Supply!CT$9,BoQ_Equipment!$B:$B,0))","v":"RF4 Relay with Base (RF4 & FN-DE-IP-10) (220Vdc)"},{"$f":"INDEX(BoQ_Equipment!$C:$C,MATCH(PS5_Supply!CU$9,BoQ_Equipment!$B:$B,0))","v":"DC Monitoring Relay (CM-ESS.1S)"},{"$f":"INDEX(BoQ_Equipment!$C:$C,MATCH(PS5_Supply!CV$9,BoQ_Equipment!$B:$B,0))","v":"110/220Vdc 6A MCB (S202M-C6UC +S2C-H6R)"},{"$f":"INDEX(BoQ_Equipment!$C:$C,MATCH(PS5_Supply!CW$9,BoQ_Equipment!$B:$B,0))","v":"110/220Vdc 10A MCB (S202M-C10UC +S2C-H6R)"},{"$f":"INDEX(BoQ_Equipment!$C:$C,MATCH(PS5_Supply!CX$9,BoQ_Equipment!$B:$B,0))","v":"230Vac 10A 2P MCB (S202-C10)"},{"$f":"INDEX(BoQ_Equipment!$C:$C,MATCH(PS5_Supply!CY$9,BoQ_Equipment!$B:$B,0))","v":"230Vac 2A 2P MCB (S202-C2 + S2C-H6R)"},{"$f":"INDEX(BoQ_Equipment!$C:$C,MATCH(PS5_Supply!CZ$9,BoQ_Equipment!$B:$B,0))","v":"415Vac 2A 3P MCB (S203-C2 + S2C-H6R)"},{"$f":"INDEX(BoQ_Equipment!$C:$C,MATCH(PS5_Supply!DA$9,BoQ_Equipment!$B:$B,0))","v":"SecuControl 8 Way Test Block (FLTP08015AD-SL17F-1523)"},{"$f":"INDEX(BoQ_Equipment!$C:$C,MATCH(PS5_Supply!DB$9,BoQ_Equipment!$B:$B,0))","v":"DC/DC Converter (ML60.242)"},{"$f":"INDEX(BoQ_Equipment!$C:$C,MATCH(PS5_Supply!DC$9,BoQ_Equipment!$B:$B,0))","v":"8GB Flash Drive "},{"$f":"INDEX(BoQ_Equipment!$C:$C,MATCH(PS5_Supply!DD$9,BoQ_Equipment!$B:$B,0))","v":"Diode Board (4 Way)"}]
{"$rows_left_out":97}
{"sheet":"BoQ_Equipment","index":2,"n_rows":119,"n_cols":25,"rows_kept":119,"merged":[[6,6,6,10],[6,11,6,14],[6,15,6,22],[6,23,8,23],[6,24,8,24],[7,6,7,10],[7,11,7,14],[7,15,7,22]]}
["SCHEDULE OF PRICES"]
[]
["ESKOM TENDER",null,{"$f":"Cover!B17","v":0}]
[]
["YOUR REF: ",null,{"$f":"Cover!B15","v":0}]
[]
[{"$nulls":6},{"$f":"PS5_Supply!B15","v":"SUPPLIED FROM OUTSIDE R.S.A.(If Applicable):"},{"$nulls":4},{"$f":"PS5_Supply!B32","v":"SUPPLIED FROM INSIDE R.S.A."},{"$nulls":3},{"$f":"PS5_Supply!B40","v":" SITE WORK (ERECTION / INSTALLATION INCL. COMMISSIONING) (per Installation & Commissioning matrix)"},{"$nulls":7},"Total Unit Rate","Total Amount (Excl.VAT)"]
[{"$nulls":6},"In Local Currency",{"$nulls":4},"In Local Currency",{"$nulls":3},"In Local Currency"]
["SAP No.","ITEM","SHORT DESCRIPTION","LONG DESCRIPTION","UOM","Estimated Qty",{"$f":"PS5_Supply!B20","v":"5: TOTAL PRICE DELIVERED PORT R.S.A. ..."},{"$f":"PS5_Supply!B26","v":"11: COST OF IMPORTATION ..."},{"$f":"PS5_Supply!B29","v":"14: TOTAL COST OF TRANSPORT S.A. PORT TO WORK/SITE ..."},{"$f":"PS5_Supply!B30","v":"15: TOTAL PRICE (F.O.B.) DELIVERED TO WORKS/SITE..."},"TOTAL FOREIGN PORTION (IN LOCAL CURRENCY)",{"$f":"PS5_Supply!B35","v":"18: TOTAL F.O.R. PRICE ..."},{"$f":"PS5_Supply!B38","v":"21: COST OF TRANSPORT WORKS TO SITE ...          "},{"$f":"PS5_Supply!B39","v":"22: PRICE (F.O.R.) DELIVERED TO SITE ...          "},"TOTAL LOCAL PORTION (IN LOCAL CURRENCY)",{"$f":"PS5_Supply!B41","v":"23: LOCAL LABOUR"},{"$f":"PS5_Supply!B42","v":"24: EXPATRIATE  LABOUR"},{"$f":"PS5_Supply!B44","v":"26: OVERSEAS ENGINEERING SERVICES"},{"$f":"PS5_Supply!B45","v":"27: LOCAL ENGINEERING SERVICES"},"Total Foreign Labour; Engineering & Commissioning","Total Local Labour; Engineering & Commissioning",{"$f":"PS5_Supply!B46","v":"28: TOTAL PRICE FOR ENGINEERING SERVICES..."},"TOTAL PRICE FOR LABOUR & ENGINEERING SERVICES (IN LOCAL CURRENCY)"]
[{"$nulls":6},"CPA Formula:","CPA Formula:","CPA Formula:",null,null,"CPA Formula:","CPA Formula:",null,null,"CPA Formula:","CPA Formula:","CPA Formula:","CPA Formula:"]
{"$rows_left_out":110}
{"sheet":"BoQ - Services","index":3,"n_rows":32,"n_cols":13,"rows_kept":32,"merged":[[8,5,8,6],[8,7,8,10],[8,11,10,11],[8,12,10,12]]}
["SCHEDULE OF PRICES"]
[]
["ESKOM TENDER",null,{"$f":"Cover!B17","v":0}]
[]
["YOUR REF: ",null,{"$f":"Cover!B15","v":0}]
[]
["SERVICES - ENGINEERING & TRAINING"]
[]
[{"$nulls":5},"Local Portion",null,"Foreign Portion",{"$nulls":3},"Total Local + Foreign Value Rate/Unit (In Local Currency)","Total Local + Foreign TOTAL Value (In Local Currency)"]
[]
{"$rows_left_out":23}
{"sheet":"Summary","index":4,"n_rows":36,"n_cols":7,"rows_kept":36,"merged":[[10,6,11,6],[14,1,15,3],[14,4,15,4],[14,5,15,5],[14,6,15,6],[16,1,17,3],[16,4,17,4],[16,5,17,5],[16,6,17,6],[18,1,19,3],[18,4,19,4],[18,5,19,5],[18,6,19,6],[20,1,21,3],[20,4,21,4],[20,5,21,5],[20,6,21,6]]}
[null,"Enquiry No."]
[]
[null,"Package Name:"]
[]
[null,"Tenderer's Name:"]
[]
[null,"Category of Offer:"]
[]
[null,"SUMMARY"]
[]
{"$rows_left_out":27}
{"sheet":"Transport and Offloading Matrix","index":5,"n_rows":32,"n_cols":4,"rows_kept":32,"merged":[[0,0,0,3],[2,0,3,2],[2,3,3,3],[4,0,5,2],[4,3,5,3],[6,0,7,2],[6,3,7,3],[8,0,11,0],[8,1,11,1],[8,2,8,3],[9,2,9,3],[10,2,10,3],[28,2,28,3],[31,0,31,3],[32,0,32,3],[33,0,33,3],[34,0,34,3]]}
["TRANSPORT AND OFF LOADING COSTS MATRIX"]
[]
[" ENQUIRY NO",null,null,{"$f":"Cover!B15","v":0}]
[]
["COMMODITY",null,null,{"$f":"Cover!B17","v":0}]
[]
["SUPPLIER",null,null,{"$f":"Cover!B21","v":0}]
[]
["Item","One way Trip Distance [km]","Prices in South African Currency (Excluding VAT)"]
[null,null,"Transport to site or regional store and off-loading"]
{"$rows_left_out":23}
{"sheet":"Installation & Commissioning","index":6,"n_rows":33,"n_cols":5,"rows_kept":33,"merged":[[0,0,0,5],[2,0,3,1],[2,2,3,5],[4,0,5,1],[4,2,5,5],[6,0,7,1],[6,2,7,5],[8,0,11,0],[8,1,11,1],[8,2,8,5],[9,2,9,5],[10,2,10,5],[11,2,11,3],[11,4,11,5],[12,2,12,3],[12,4,12,5],[13,2,13,3],[13,4,13,5],[14,2,14,3],[14,4,14,5],[15,2,15,3],[15,4,15,5],[16,2,16,3],[16,4,16,5],[17,2,17,3],[17,4,17,5],[18,2,18,3],[18,4,18,5],[19,2,19,3],[19,4,19,5],[20,2,20,3],[20,4,20,5],[21,2,21,3],[21,4,21,5],[22,2,22,3],[22,4,22,5],[23,2,23,3],[23,4,23,5],[24,2,24,3],[24,4,24,5],[25,2,25,3],[25,4,25,5],[26,2,26,3],[26,4,26,5],[27,2,27,3],[27,4,27,5],[28,2,28,3],[28,4,28,5],[30,1,30,5],[31,1,31,5],[32,0,32,5],[33,0,33,5],[34,0,34,5],[35,0,35,5]]}
["INSTALLATION & COMMISSIONING MATRIX"]
[]
[" ENQUIRY NO",null,{"$f":"Cover!B15","v":0}]
[]
["COMMODITY",null,{"$f":"Cover!B17","v":0}]
[]
["SUPPLIER",null,{"$f":"Cover!B21","v":0}]
[]
["Item","One way Trip Distance [km]","Prices in South African Currency (Excluding VAT)"]
[null,null,"Installation on site, in theControl Room"]
{"$rows_left_out":24}
{"sheet":"CPA Formula","index":7,"n_rows":148,"n_cols":14,"rows_kept":148,"merged":[[0,0,0,1],[1,0,1,1],[2,0,2,1],[3,0,3,1],[5,0,5,4],[8,2,8,3],[8,5,8,7],[9,2,9,4],[9,5,18,7],[10,2,10,4],[11,2,11,4],[12,2,12,4],[13,2,13,4],[14,2,14,4],[15,2,15,4],[16,2,16,4],[17,2,17,4],[18,2,18,4],[21,1,21,6],[22,1,22,6],[25,1,25,6],[26,1,26,6],[27,1,27,6],[28,1,28,6],[29,1,29,6],[30,1,30,6],[32,1,32,6],[33,1,33,6],[34,1,34,6],[35,1,35,6],[36,1,36,6],[40,1,40,6],[51,1,51,6],[62,1,62,6],[73,1,73,6],[84,1,84,6],[95,1,95,6],[106,1,106,6],[117,1,117,6],[128,1,128,6],[139,1,139,6]]}
["Enquiry No.",null,{"$f":"Cover!B15","v":0}]
["Package Name:",null,{"$f":"Cover!B17","v":0}]
["Tenderer's Name:",null,{"$f":"Cover!B21","v":0}]
["Category of Offer:",null,"Main Offer Only"]
[]
["CONTRACT PRICE ADJUSTMENT (CPA) FOR INFLATION"]
[]
["No.","Formula Code","Summary of the description of the Tenderer's Formulae"]
[1,"Fixed","Firm and Fixed and Firm for the full duration of Contract",null,null,"Prices are 100 % fixed and firm. CPA is not applicable. "]
[2,"A",{"$f":"B41","v":"Tenderer's description of Formula A"},null,null,"Type in the description of each formula in the tables below"]
{"$rows_left_out":139}
{"sheet":"Exchange Rates","index":8,"n_rows":36,"n_cols":8,"rows_kept":36,"merged":[[0,0,0,1],[0,2,0,4],[1,0,1,1],[1,2,1,4],[2,0,2,1],[2,2,2,4],[7,1,7,6],[8,0,10,0],[8,1,8,6],[8,14,8,19],[9,1,9,6],[10,1,10,6],[11,1,11,6],[12,1,12,6],[13,0,15,0],[13,1,13,6],[14,1,14,6],[15,1,15,6],[20,7,20,12]]}
["Enquiry No.",null,{"$f":"Cover!B15","v":0}]
["Package Name:",null,{"$f":"Cover!B17","v":0}]
["Tenderer's Name:",null,{"$f":"Cover!B21","v":0}]
[]
["EXCHANGE RATES FOR MULTIPLE CURRENCIES"]
[]
["NOTES:"]
[1,"The table below needs to be completed if the Employer will be exposed to any currency fluctuation as stipulated in Secondary Clause X3.  For conversion of the foreign portions to Rand, please use the South African Reserve Bank's (SARB) exchange rate at 12:00 on the day of advertisement of the bid.  This is in terms of the Preferential Procurement Policy Framework Act (PPPFA) with which the Employer has to comply.\nNB: Tenderers must submit proof of the SARB rate(s) of exchange used  "]
[2,"The following URL (electronic route) is to be followed to access the relevant SARB rates on their web pages:\n"]
[null,"www.resbank.co.za"]
{"$rows_left_out":26}