{"text_format":"3","workbook":"xlsx","n_sheets":10,"sheets":["Instructions to complete","PART 1 Technical Evaluation","Annex A Technical req 1","Annex A Technical req 2","Annex B SLA Perf requirements","Annex C Company Info","PART 2 Pricing Schedule","TCO","Lookups","References"],"not_rendered":{"images":1},"read":"whole","date_system":"1900"}

{"sheet":"Instructions to complete","index":0,"n_rows":5,"n_cols":1,"rows_kept":5,"merged":[[0,0,0,2],[1,0,1,2],[2,0,2,2],[3,0,3,2],[4,0,4,2]]}
["Instructions to complete:"]
["1. Please complete only the green cells in Sheets: \n      Annex B SLA Perf requirements, \n      Annex A Technical spec 1,\n      Annex A Technical spec 2,\n      Annex C Company Info, and \n      PART 2 Pricing Schedule"]
["2. The SLA Performance requirements and sub-sections will become part of the contracted agreement, should the Bidder be successful"]
["3. By answering yes, the Bidder binds themselves to deliver on each corresponding aspect of the project."]
["4. Scores for Annexure A, B, and C, will be automatically populated from the respective sheets. "]

{"sheet":"PART 1 Technical Evaluation","index":1,"n_rows":13,"n_cols":5,"rows_kept":13,"merged":[[3,0,3,4],[4,1,4,4],[10,1,10,2],[11,1,11,2],[12,1,12,2]]}
["Instructions to the evaluations committee:"]
["1. Scores for Annexure A, B, and C, will be automatically populated from the respective sheets. "]
[]
["PART 1: RFP Technical specifications"]
["Bidder Name:",{"$f":"IF('Annex A Technical req 1'!C4=\"\",\"\",'Annex A Technical req 1'!C4)","v":"hkjg nb"}]
["Functional Factors","Proof Required","Weight","Points achieved","Individual section result"]
["Annex A Technical Requirement 1","Bidder to submit a completed PART 1 TECHNICAL ROPOSAL.XLSX (Sheet: Annex A Technical Requirement 1)",{"v":0.6,"d":"60%"},{"$f":"'Annex A Technical req 1'!D10","v":{"v":0,"d":"0.00"}},{"$f":"IF(D7>=7.5,\"Proceed\",\"Do not proceed\")","v":"Do not proceed"}]
["Annex A Technical Requirement 2","Bidder to submit a completed PART 1 TECHNICAL ROPOSAL.XLSX (Sheet: Annex A Technical Requirement 2)",{"v":0.2,"d":"20%"},{"$f":"'Annex A Technical req 2'!D55","v":{"v":0,"d":"0.00"}},{"$f":"'Annex A Technical req 2'!C57","v":"Do not proceed"}]
["Annex B SLA Perf requirements","Bidder to submit a completed PART 1 TECHNICAL ROPOSAL.XLSX (Sheet: Annexure B: SLA Performance requirements)",{"v":0.1,"d":"10%"},{"$f":"'Annex B SLA Perf requirements'!G24","v":{"v":0,"d":"0.00"}},{"$f":"'Annex B SLA Perf requirements'!C23","v":"Do not proceed"}]
["Annex C Company Information","Annexure C: Company Information -Requirements: \na) Presence in all Geographical locations of the CSIR\nb) Call Centre presence and operating hours\nc) Number of Next Business Day On-site Repair Agents\nb) Parts and stock holding available at all Geographical locations of the CSIR",{"v":0.1,"d":"10%"},{"$f":"'Annex C Company Info'!B23/10","v":{"v":0,"d":"0.00"}},{"$f":"IF(D10>=7,\"Proceed\",\"Do not proceed\")","v":"Do not proceed"}]
[null,"Overall PART 1 points out of 10:",null,{"$f":"(D7*C7+D8*C8+D9*C9+D10*C10)/10","v":{"v":0,"d":"0.00"}}]
[null,"Overall PART 1 points out of 100:",null,{"$f":"D11*10","v":{"v":0,"d":"0.00"}}]
[null,"Proceed or Do not proceed",null,{"$f":"IF(D12>=70,\"Proceed\",\"Do not proceed\")","v":"Do not proceed"}]

{"sheet":"Annex A Technical req 1","index":2,"n_rows":1048252,"n_cols":49,"rows_kept":1048252,"merged":[[3,0,3,1],[5,0,5,3],[6,1,6,2],[7,1,7,2],[8,1,8,2],[17,0,20,0],[17,1,20,2],[17,3,20,3],[17,30,20,30],[17,31,20,32],[17,33,20,33],[18,6,18,8],[18,11,18,13],[18,16,18,18],[18,21,18,23],[18,26,18,28],[18,36,18,38],[18,41,18,43],[18,46,18,48],[19,6,19,8],[19,11,19,13],[19,16,19,18],[19,21,19,23],[19,26,19,28],[19,36,19,38],[19,41,19,43],[19,46,19,48],[80,0,83,0],[80,30,83,30],[85,0,88,0],[85,1,85,2],[85,30,88,30],[85,31,85,32],[86,1,86,2],[86,31,86,32],[87,1,87,2],[87,31,87,32],[88,1,88,2],[88,31,88,32],[89,1,89,2],[89,31,89,32],[92,1,92,2],[92,31,92,32],[93,1,93,2],[93,31,93,32],[94,1,94,2],[94,31,94,32],[95,1,95,2],[95,31,95,32],[96,1,96,2],[96,31,96,32],[97,1,97,2],[97,31,97,32],[98,1,98,2],[98,31,98,32],[99,1,99,2],[99,31,99,32],[100,1,100,2],[100,31,100,32],[101,1,101,2],[101,31,101,32],[102,1,102,2],[102,31,102,32],[103,1,103,2],[103,31,103,32],[104,1,104,2],[104,31,104,32],[105,1,105,2],[105,31,105,32],[108,0,111,0],[108,1,111,2],[108,3,111,3],[109,6,109,8],[109,11,109,13],[110,6,110,8],[110,11,110,13],[120,0,121,0],[120,1,120,2],[121,1,121,2]]}
[]
["ANNEXURE A:  TECHNICAL REQUIREMENTS PART 1"]
[]
["Bidder Name: ",null,"hkjg nb"]
[]
["Scoring Summary",{"$nulls":6},"Scoring Legend"]
[{"v":0.6,"d":"60%"},"The consolidated overall score for Computing Devices",null,{"$f":"IF(OR(I91=0,I123=0,N91=0,N123=0,S91=0,X91=0,AC91=0,AM91=0,AR91=0,AW91=0),0,I91*Lookups!K3+N91*Lookups!K4+S91*Lookups!K5+X91*Lookups!K6+AC91*Lookups!K7+AM91*Lookups!K8+AR91*Lookups!K9+AW91*Lookups!K10)","v":0},{"$nulls":3},"Not present",0]
[{"v":0.3,"d":"30%"},"The consolidated overall score for Component Failures",null,{"$f":"IF(OR(H107=0,M107=0,R107=0,W107=0,AB107=0,AL107=0,AQ107=0,AV107=0),0,ROUND(100-(H107*Lookups!K3+M107*Lookups!K4+R107*Lookups!K5+W107*Lookups!K6+AB107*Lookups!K7+AL107*Lookups!K8+AQ107*Lookups!K9+AV107*Lookups!K10),0))","v":0},{"$nulls":3},"Below minimum",3]
[{"v":0.1,"d":"10%"},"The consolidated overall score for Docking Station/Port Replicators ",null,{"$f":"IF(OR(I123=0,N123=0),0,AVERAGE(I123,N123))","v":0},{"$nulls":3},"Meets mimum",6]
[null,null,"Technical Requirement 1 score out of 10",{"$f":"IF(OR(D7=0,D8=0,D9=0),0,ROUND(SUMPRODUCT(A7:A9,D7:D9),0)/10)","v":0},{"$nulls":3},"Meets desired",8]
[{"$nulls":7},"Exceeds desired or max possible",10]
[]
[]
[null,"You MUST complete the information for each Notebook/Desktop/Port Replicator option.  Failure to do so will result is a score of zero for the category.  You may propose the same model for one or more options by repeating the values."]
[null,"You MUST complete the failure rate for each components listed.  You may enter a zero, but remember the failure rates submitted as part of your proposal will be included in the contract should you be successful."]
[]
[]
["Weight","Notebook Configuration",null,"Weight",null,"Highly Mobile Notebook (Mobile, Connector)",{"$nulls":4},"Traditional Mainstream Notebook  (Connector, Collaborator)",{"$nulls":4},"Modern Mainstream Notebook  (Connector, Collaborator)",{"$nulls":4},"High-End Notebook  (Connector, Collaborator)- 15\" screen",{"$nulls":4},"High-End Notebook (Connector, Collaborator) - 17\" screen",{"$nulls":4},"Weight","Configuration",null,"Weight",null,"Traditional Mainstream Desktop (Connector, Collaborator)",{"$nulls":4},"Modern Mainstream Desktop (Connector, Collaborator)",{"$nulls":4},"High-End Desktop with Xeon CPU (Connector, Collaborator)"]
[{"$nulls":5},"Make",{"$nulls":4},"Make",{"$nulls":4},"Make",{"$nulls":4},"Make",{"$nulls":4},"Make",{"$nulls":9},"Make",{"$nulls":4},"Make",{"$nulls":4},"Make"]
[{"$nulls":5},"Model",{"$nulls":4},"Model",{"$nulls":4},"Model",{"$nulls":4},"Model",{"$nulls":4},"Model",{"$nulls":9},"Model",{"$nulls":4},"Model",{"$nulls":4},"Model"]
[{"$nulls":5},"Required","Desired","Proposed","Score",null,"Required","Desired","Proposed","Score",null,"Required","Desired","Proposed","Score",null,"Required","Desired","Proposed","Score",null,"Required","Desired","Proposed","Score",{"$nulls":6},"Required","Desired","Proposed","Score",null,"Required","Desired","Proposed","Score",null,"Required","Desired","Proposed","Score"]
[{"$f":"SUM(D22:D24)","v":{"v":0.09,"d":"9%"}},"Intel Processor","Family (ix)",{"v":0.03,"d":"3.0%"},null,5,7,7,{"$f":"IF(H22=\"\",$I$7,IF(H22<F22,$I$8,IF(AND(H22>=F22,H22<0.9*G22),$I$9,IF(AND(H22<=G22,H22>=0.9*G22),$I$10,IF(H22>G22,$I$11,\"\")))))","v":8},null,5,5,null,{"$f":"IF(M22=\"\",$I$7,IF(M22<K22,$I$8,IF(AND(M22>=K22,M22<0.9*L22),$I$9,IF(AND(M22<=L22,M22>=0.9*L22),$I$10,IF(M22>L22,$I$11,\"\")))))","v":0},null,5,7,null,{"$f":"IF(R22=\"\",$I$7,IF(R22<P22,$I$8,IF(AND(R22>=P22,R22<0.9*Q22),$I$9,IF(AND(R22<=Q22,R22>=0.9*Q22),$I$10,IF(R22>Q22,$I$11,\"\")))))","v":0},null,7,9,null,{"$f":"IF(W22=\"\",$I$7,IF(W22<U22,$I$8,IF(AND(W22>=U22,W22<0.9*V22),$I$9,IF(AND(W22<=V22,W22>=0.9*V22),$I$10,IF(W22>V22,$I$11,\"\")))))","v":0},null,7,9,null,{"$f":"IF(AB22=\"\",$I$7,IF(AB22<Z22,$I$8,IF(AND(AB22>=Z22,AB22<0.9*AA22),$I$9,IF(AND(AB22<=AA22,AB22>=0.9*AA22),$I$10,IF(AB22>AA22,$I$11,\"\")))))","v":0},null,{"$f":"SUM(AH22:AH24)","v":{"v":0.12,"d":"12%"}},"Intel Processor","Family (ix)",{"v":0.04,"d":"4.0%"},null,3,5,null,{"$f":"IF(AL22=\"\",$I$7,IF(AL22<AJ22,$I$8,IF(AND(AL22>=AJ22,AL22<0.9*AK22),$I$9,IF(AND(AL22<=AK22,AL22>=0.9*AK22),$I$10,IF(AL22>AK22,$I$11,\"\")))))","v":0},null,5,7,null,{"$f":"IF(AQ22=\"\",$I$7,IF(AQ22<AO22,$I$8,IF(AND(AQ22>=AO22,AQ22<0.9*AP22),$I$9,IF(AND(AQ22<=AP22,AQ22>=0.9*AP22),$I$10,IF(AQ22>AP22,$I$11,\"\")))))","v":0},null,10,10,null,{"$f":"IF(AV22=\"\",$I$7,IF(AV22<AT22,$I$8,IF(AND(AV22>=AT22,AV22<0.9*AU22),$I$9,IF(AND(AV22<=AU22,AV22>=0.9*AU22),$I$10,IF(AV22>AU22,$I$11,\"\")))))","v":0}]
[null,null,"Generation",{"v":0.03,"d":"3.0%"},null,11,12,null,{"$f":"IF(H23=\"\",$I$7,IF(H23<F23,$I$8,IF(AND(H23>=F23,H23<G23),$I$9,IF(H23=G23,$I$10,IF(H23>G23,$I$11,\"\")))))","v":0},null,10,11,null,{"$f":"IF(M23=\"\",$I$7,IF(M23<K23,$I$8,IF(AND(M23>=K23,M23<L23),$I$9,IF(M23=L23,$I$10,IF(M23>L23,$I$11,\"\")))))","v":0},null,11,12,null,{"$f":"IF(R23=\"\",$I$7,IF(R23<P23,$I$8,IF(AND(R23>=P23,R23<Q23),$I$9,IF(R23=Q23,$I$10,IF(R23>Q23,$I$11,\"\")))))","v":0},null,11,12,null,{"$f":"IF(W23=\"\",$I$7,IF(W23<U23,$I$8,IF(AND(W23>=U23,W23<V23),$I$9,IF(W23=V23,$I$10,IF(W23>V23,$I$11,\"\")))))","v":0},null,11,12,null,{"$f":"IF(AB23=\"\",$I$7,IF(AB23<Z23,$I$8,IF(AND(AB23>=Z23,AB23<AA23),$I$9,IF(AB23=AA23,$I$10,IF(AB23>AA23,$I$11,\"\")))))","v":0},{"$nulls":3},"Generation",{"v":0.04,"d":"4.0%"},null,10,11,null,{"$f":"IF(AL23=\"\",$I$7,IF(AL23<AJ23,$I$8,IF(AND(AL23>=AJ23,AL23<AK23),$I$9,IF(AL23=AK23,$I$10,IF(AL23>AK23,$I$11,\"\")))))","v":0},null,11,12,null,{"$f":"IF(AQ23=\"\",$I$7,IF(AQ23<AO23,$I$8,IF(AND(AQ23>=AO23,AQ23<AP23),$I$9,IF(AQ23=AP23,$I$10,IF(AQ23>AP23,$I$11,\"\")))))","v":0},null,22,23,null,{"$f":"IF(AV23=\"\",$I$7,IF(AV23<AT23,$I$8,IF(AND(AV23>=AT23,AV23<AU23),$I$9,IF(AV23=AU23,$I$10,IF(AV23>AU23,$I$11,\"\")))))","v":0}]
[null,null,"Base Frequency p-cores (GHz)",{"v":0.03,"d":"3.0%"},null,2.1,2.1,null,{"$f":"IF(H24=\"\",$I$7,IF(H24<F24,$I$8,IF(AND(H24>=F24,H24<0.9*G24),$I$9,IF(AND(H24<=G24,H24>=0.9*G24),$I$10,IF(H24>G24,$I$11,\"\")))))","v":0},null,1.6,2.1,null,{"$f":"IF(M24=\"\",$I$7,IF(M24<K24,$I$8,IF(AND(M24>=K24,M24<0.9*L24),$I$9,IF(AND(M24<=L24,M24>=0.9*L24),$I$10,IF(M24>L24,$I$11,\"\")))))","v":0},null,2.1,2.1,null,{"$f":"IF(R24=\"\",$I$7,IF(R24<P24,$I$8,IF(AND(R24>=P24,R24<0.9*Q24),$I$9,IF(AND(R24<=Q24,R24>=0.9*Q24),$I$10,IF(R24>Q24,$I$11,\"\")))))","v":0},null,2.1,2.4,null,{"$f":"IF(W24=\"\",$I$7,IF(W24<U24,$I$8,IF(AND(W24>=U24,W24<0.9*V24),$I$9,IF(AND(W24<=V24,W24>=0.9*V24),$I$10,IF(W24>V24,$I$11,\"\")))))","v":0},null,2.1,2.4,null,{"$f":"IF(AB24=\"\",$I$7,IF(AB24<Z24,$I$8,IF(AND(AB24>=Z24,AB24<0.9*AA24),$I$9,IF(AND(AB24<=AA24,AB24>=0.9*AA24),$I$10,IF(AB24>AA24,$I$11,\"\")))))","v":0},{"$nulls":3},"Base Frequency p-cores (GHz)",{"v":0.04,"d":"4.0%"},null,2.6,3,null,{"$f":"IF(AL24=\"\",$I$7,IF(AL24<AJ24,$I$8,IF(AND(AL24>=AJ24,AL24<0.9*AK24),$I$9,IF(AND(AL24<=AK24,AL24>=0.9*AK24),$I$10,IF(AL24>AK24,$I$11,\"\")))))","v":0},null,2.6,3,null,{"$f":"IF(AQ24=\"\",$I$7,IF(AQ24<AO24,$I$8,IF(AND(AQ24>=AO24,AQ24<0.9*AP24),$I$9,IF(AND(AQ24<=AP24,AQ24>=0.9*AP24),$I$10,IF(AQ24>AP24,$I$11,\"\")))))","v":0},null,3.7,4.5,null,{"$f":"IF(AV24=\"\",$I$7,IF(AV24<AT24,$I$8,IF(AND(AV24>=AT24,AV24<0.9*AU24),$I$9,IF(AND(AV24<=AU24,AV24>=0.9*AU24),$I$10,IF(AV24>AU24,$I$11,\"\")))))","v":0}]
[{"$f":"SUM(D25:D30)","v":{"v":0.07,"d":"7%"}},"Memory (RAM)","Size included(GB)",{"v":0.03,"d":"3.0%"},null,16,16,null,0,null,8,16,null,0,null,16,32,null,0,null,16,32,null,0,null,16,32,null,0,null,{"$f":"SUM(AH25:AH30)","v":{"v":0.08,"d":"8%"}},"Memory (RAM)","Size included(GB)",{"v":0.04,"d":"4.0%"},null,8,16,null,0,null,16,32,null,0,null,32,64,null,0]
[null,null,"Generation (DDRx)",{"v":0.01,"d":"1.0%"},null,4,4,null,0,null,4,4,null,0,null,4,4,null,0,null,4,5,null,0,null,4,5,null,0,{"$nulls":3},"Generation (DDRx)",{"v":0.01,"d":"1.0%"},null,4,4,null,0,null,4,4,null,0,null,4,5,null,0]
[null,null,"Speed (MHz)",{"v":0.005,"d":"0.5%"},null,2667,3200,null,0,null,2667,3200,null,{"$f":"IF(M27=\"\",$I$7,IF(M27<K27,$I$8,IF(AND(M27>=K27,M27<0.9*L27),$I$9,IF(AND(M27<=L27,M27>=0.9*L27),$I$10,IF(M27>L27,$I$11,\"\")))))","v":0},null,3200,4268,null,0,null,2667,4800,null,0,null,2667,4800,null,0,{"$nulls":3},"Speed (MHz)",{"v":0.005,"d":"0.5%"},null,2666,3200,null,0,null,3200,3200,null,0,null,3200,4800,null,0]
[null,null,"Total no of memory slots",{"v":0.01,"d":"1.0%"},null,1,2,null,0,null,1,2,null,{"$f":"IF(M28=\"\",$I$7,IF(M28<K28,$I$8,IF(AND(M28>=K28,M28<0.9*L28),$I$9,IF(AND(M28<=L28,M28>=0.9*L28),$I$10,IF(M28>L28,$I$11,\"\")))))","v":0},null,2,2,null,0,null,2,2,null,0,null,2,2,null,0,{"$nulls":3},"Total no of memory slots",{"v":0.01,"d":"1.0%"},null,2,4,null,0,null,2,4,null,0,null,4,8,null,0]
[null,null,"Memory slots free",{"v":0.01,"d":"1.0%"},null,0,1,null,0,null,1,1,null,0,null,0,1,null,0,null,1,1,null,0,null,1,1,null,0,{"$nulls":3},"Memory slots free",{"v":0.01,"d":"1.0%"},null,1,2,null,0,null,1,2,null,0,null,2,4,null,0]
[null,null,"Maximum memory module size",{"v":0.005,"d":"0.5%"},null,16,32,null,0,null,16,32,null,0,null,16,32,null,0,null,64,128,null,0,null,64,128,null,0,{"$nulls":3},"Maximum memory module size",{"v":0.005,"d":"0.5%"},null,32,64,null,0,null,32,64,null,0,null,64,512,null,0]
[{"$f":"SUM(D31:D33)","v":{"v":0.08,"d":"8%"}},"Primary HDD","Size (GB)",{"v":0.03,"d":"3.0%"},null,512,512,null,0,null,512,512,null,0,null,512,1024,null,0,null,512,1024,null,0,null,512,1024,null,0,null,{"$f":"SUM(AH31:AH33)","v":{"v":0.08,"d":"8%"}},"Primary HDD","Size (GB)",{"v":0.03,"d":"3.0%"},null,512,512,null,0,null,512,512,null,0,null,512,1024,null,0]
[null,null,"Connection Type",{"v":0.02,"d":"2.0%"},null,"SATA SSD","M.2 PCIe SSD",null,{"$f":"IF(H32=\"\",$I$7,IF(VLOOKUP(H32,Lookups!$A$12:$B$14,2,FALSE)<VLOOKUP(F32,Lookups!$A$12:$B$14,2,FALSE),$I$8,IF(AND(VLOOKUP(H32,Lookups!$A$12:$B$14,2,FALSE)>=VLOOKUP(F32,Lookups!$A$12:$B$14,2,FALSE),VLOOKUP(H32,Lookups!$A$12:$B$14,2,FALSE)<0.8*VLOOKUP(G32,Lookups!$A$12:$B$14,2,FALSE)),$I$9,IF(AND(VLOOKUP(H32,Lookups!$A$12:$B$14,2,FALSE)<=VLOOKUP(G32,Lookups!$A$12:$B$14,2,FALSE),VLOOKUP(H32,Lookups!$A$12:$B$14,2,FALSE)>=0.8*VLOOKUP(G32,Lookups!$A$12:$B$14,2,FALSE)),$I$10,IF(VLOOKUP(H32,Lookups!$A$12:$B$14,2,FALSE)>VLOOKUP(G32,Lookups!$A$12:$B$14,2,FALSE),$I$11,\"\")))))","v":0},null,"SATA SSD","M.2 PCIe SSD",null,{"$f":"IF(M32=\"\",$I$7,IF(VLOOKUP(M32,Lookups!$A$12:$B$14,2,FALSE)<VLOOKUP(K32,Lookups!$A$12:$B$14,2,FALSE),$I$8,IF(AND(VLOOKUP(M32,Lookups!$A$12:$B$14,2,FALSE)>=VLOOKUP(K32,Lookups!$A$12:$B$14,2,FALSE),VLOOKUP(M32,Lookups!$A$12:$B$14,2,FALSE)<0.8*VLOOKUP(L32,Lookups!$A$12:$B$14,2,FALSE)),$I$9,IF(AND(VLOOKUP(M32,Lookups!$A$12:$B$14,2,FALSE)<=VLOOKUP(L32,Lookups!$A$12:$B$14,2,FALSE),VLOOKUP(M32,Lookups!$A$12:$B$14,2,FALSE)>=0.8*VLOOKUP(L32,Lookups!$A$12:$B$14,2,FALSE)),$I$10,IF(VLOOKUP(M32,Lookups!$A$12:$B$14,2,FALSE)>VLOOKUP(L32,Lookups!$A$12:$B$14,2,FALSE),$I$11,\"\")))))","v":0},null,"SATA SSD","M.2 PCIe SSD",null,{"$f":"IF(R32=\"\",$I$7,IF(VLOOKUP(R32,Lookups!$A$12:$B$14,2,FALSE)<VLOOKUP(P32,Lookups!$A$12:$B$14,2,FALSE),$I$8,IF(AND(VLOOKUP(R32,Lookups!$A$12:$B$14,2,FALSE)>=VLOOKUP(P32,Lookups!$A$12:$B$14,2,FALSE),VLOOKUP(R32,Lookups!$A$12:$B$14,2,FALSE)<0.8*VLOOKUP(Q32,Lookups!$A$12:$B$14,2,FALSE)),$I$9,IF(AND(VLOOKUP(R32,Lookups!$A$12:$B$14,2,FALSE)<=VLOOKUP(Q32,Lookups!$A$12:$B$14,2,FALSE),VLOOKUP(R32,Lookups!$A$12:$B$14,2,FALSE)>=0.8*VLOOKUP(Q32,Lookups!$A$12:$B$14,2,FALSE)),$I$10,IF(VLOOKUP(R32,Lookups!$A$12:$B$14,2,FALSE)>VLOOKUP(Q32,Lookups!$A$12:$B$14,2,FALSE),$I$11,\"\")))))","v":0},null,"M.2 PCIe SSD","M.2 PCIe SSD",null,{"$f":"IF(W32=\"\",$I$7,IF(VLOOKUP(W32,Lookups!$A$12:$B$14,2,FALSE)<VLOOKUP(U32,Lookups!$A$12:$B$14,2,FALSE),$I$8,IF(AND(VLOOKUP(W32,Lookups!$A$12:$B$14,2,FALSE)>=VLOOKUP(U32,Lookups!$A$12:$B$14,2,FALSE),VLOOKUP(W32,Lookups!$A$12:$B$14,2,FALSE)<0.8*VLOOKUP(V32,Lookups!$A$12:$B$14,2,FALSE)),$I$9,IF(AND(VLOOKUP(W32,Lookups!$A$12:$B$14,2,FALSE)<=VLOOKUP(V32,Lookups!$A$12:$B$14,2,FALSE),VLOOKUP(W32,Lookups!$A$12:$B$14,2,FALSE)>=0.8*VLOOKUP(V32,Lookups!$A$12:$B$14,2,FALSE)),$I$10,IF(VLOOKUP(W32,Lookups!$A$12:$B$14,2,FALSE)>VLOOKUP(V32,Lookups!$A$12:$B$14,2,FALSE),$I$11,\"\")))))","v":0},null,"M.2 PCIe SSD","M.2 PCIe SSD",null,{"$f":"IF(AB32=\"\",$I$7,IF(VLOOKUP(AB32,Lookups!$A$12:$B$14,2,FALSE)<VLOOKUP(Z32,Lookups!$A$12:$B$14,2,FALSE),$I$8,IF(AND(VLOOKUP(AB32,Lookups!$A$12:$B$14,2,FALSE)>=VLOOKUP(Z32,Lookups!$A$12:$B$14,2,FALSE),VLOOKUP(AB32,Lookups!$A$12:$B$14,2,FALSE)<0.8*VLOOKUP(AA32,Lookups!$A$12:$B$14,2,FALSE)),$I$9,IF(AND(VLOOKUP(AB32,Lookups!$A$12:$B$14,2,FALSE)<=VLOOKUP(AA32,Lookups!$A$12:$B$14,2,FALSE),VLOOKUP(AB32,Lookups!$A$12:$B$14,2,FALSE)>=0.8*VLOOKUP(AA32,Lookups!$A$12:$B$14,2,FALSE)),$I$10,IF(VLOOKUP(AB32,Lookups!$A$12:$B$14,2,FALSE)>VLOOKUP(AA32,Lookups!$A$12:$B$14,2,FALSE),$I$11,\"\")))))","v":0},{"$nulls":3},"Connection Type",{"v":0.02,"d":"2.0%"},null,"SATA SSD","M.2 PCIe SSD",null,{"$f":"IF(AL32=\"\",$I$7,IF(VLOOKUP(AL32,Lookups!$A$12:$B$14,2,FALSE)<VLOOKUP(AJ32,Lookups!$A$12:$B$14,2,FALSE),$I$8,IF(AND(VLOOKUP(AL32,Lookups!$A$12:$B$14,2,FALSE)>=VLOOKUP(AJ32,Lookups!$A$12:$B$14,2,FALSE),VLOOKUP(AL32,Lookups!$A$12:$B$14,2,FALSE)<0.8*VLOOKUP(AK32,Lookups!$A$12:$B$14,2,FALSE)),$I$9,IF(AND(VLOOKUP(AL32,Lookups!$A$12:$B$14,2,FALSE)<=VLOOKUP(AK32,Lookups!$A$12:$B$14,2,FALSE),VLOOKUP(AL32,Lookups!$A$12:$B$14,2,FALSE)>=0.8*VLOOKUP(AK32,Lookups!$A$12:$B$14,2,FALSE)),$I$10,IF(VLOOKUP(AL32,Lookups!$A$12:$B$14,2,FALSE)>VLOOKUP(AK32,Lookups!$A$12:$B$14,2,FALSE),$I$11,\"\")))))","v":0},null,"SATA SSD","M.2 PCIe SSD",null,{"$f":"IF(AQ32=\"\",$I$7,IF(VLOOKUP(AQ32,Lookups!$A$12:$B$14,2,FALSE)<VLOOKUP(AO32,Lookups!$A$12:$B$14,2,FALSE),$I$8,IF(AND(VLOOKUP(AQ32,Lookups!$A$12:$B$14,2,FALSE)>=VLOOKUP(AO32,Lookups!$A$12:$B$14,2,FALSE),VLOOKUP(AQ32,Lookups!$A$12:$B$14,2,FALSE)<0.8*VLOOKUP(AP32,Lookups!$A$12:$B$14,2,FALSE)),$I$9,IF(AND(VLOOKUP(AQ32,Lookups!$A$12:$B$14,2,FALSE)<=VLOOKUP(AP32,Lookups!$A$12:$B$14,2,FALSE),VLOOKUP(AQ32,Lookups!$A$12:$B$14,2,FALSE)>=0.8*VLOOKUP(AP32,Lookups!$A$12:$B$14,2,FALSE)),$I$10,IF(VLOOKUP(AQ32,Lookups!$A$12:$B$14,2,FALSE)>VLOOKUP(AP32,Lookups!$A$12:$B$14,2,FALSE),$I$11,\"\")))))","v":0},null,"M.2 PCIe SSD","M.2 PCIe SSD",null,{"$f":"IF(AV32=\"\",$I$7,IF(VLOOKUP(AV32,Lookups!$A$12:$B$14,2,FALSE)<VLOOKUP(AT32,Lookups!$A$12:$B$14,2,FALSE),$I$8,IF(AND(VLOOKUP(AV32,Lookups!$A$12:$B$14,2,FALSE)>=VLOOKUP(AT32,Lookups!$A$12:$B$14,2,FALSE),VLOOKUP(AV32,Lookups!$A$12:$B$14,2,FALSE)<0.8*VLOOKUP(AU32,Lookups!$A$12:$B$14,2,FALSE)),$I$9,IF(AND(VLOOKUP(AV32,Lookups!$A$12:$B$14,2,FALSE)<=VLOOKUP(AU32,Lookups!$A$12:$B$14,2,FALSE),VLOOKUP(AV32,Lookups!$A$12:$B$14,2,FALSE)>=0.8*VLOOKUP(AU32,Lookups!$A$12:$B$14,2,FALSE)),$I$10,IF(VLOOKUP(AV32,Lookups!$A$12:$B$14,2,FALSE)>VLOOKUP(AU32,Lookups!$A$12:$B$14,2,FALSE),$I$11,\"\")))))","v":0}]
[null,null,"Storage Class",{"v":0.03,"d":"3.0%"},null,35,40,null,{"$f":"IF(H33=\"\",$I$7,IF(VLOOKUP(H33,Lookups!$A$147:$B$152,2,FALSE)<VLOOKUP(F33,Lookups!$A$147:$B$152,2,FALSE),$I$8,IF(AND(VLOOKUP(H33,Lookups!$A$147:$B$152,2,FALSE)>=VLOOKUP(F33,Lookups!$A$147:$B$152,2,FALSE),VLOOKUP(H33,Lookups!$A$147:$B$152,2,FALSE)<0.8*VLOOKUP(G33,Lookups!$A$147:$B$152,2,FALSE)),$I$9,IF(AND(VLOOKUP(H33,Lookups!$A$147:$B$152,2,FALSE)<=VLOOKUP(G33,Lookups!$A$147:$B$152,2,FALSE),VLOOKUP(H33,Lookups!$A$147:$B$152,2,FALSE)>=0.8*VLOOKUP(G33,Lookups!$A$147:$B$152,2,FALSE)),$I$10,IF(VLOOKUP(H33,Lookups!$A$147:$B$152,2,FALSE)>VLOOKUP(G33,Lookups!$A$147:$B$152,2,FALSE),$I$11,\"\")))))","v":0},null,30,35,null,{"$f":"IF(M33=\"\",$I$7,IF(VLOOKUP(M33,Lookups!$A$147:$B$152,2,FALSE)<VLOOKUP(K33,Lookups!$A$147:$B$152,2,FALSE),$I$8,IF(AND(VLOOKUP(M33,Lookups!$A$147:$B$152,2,FALSE)>=VLOOKUP(K33,Lookups!$A$147:$B$152,2,FALSE),VLOOKUP(M33,Lookups!$A$147:$B$152,2,FALSE)<0.8*VLOOKUP(L33,Lookups!$A$147:$B$152,2,FALSE)),$I$9,IF(AND(VLOOKUP(M33,Lookups!$A$147:$B$152,2,FALSE)<=VLOOKUP(L33,Lookups!$A$147:$B$152,2,FALSE),VLOOKUP(M33,Lookups!$A$147:$B$152,2,FALSE)>=0.8*VLOOKUP(L33,Lookups!$A$147:$B$152,2,FALSE)),$I$10,IF(VLOOKUP(M33,Lookups!$A$147:$B$152,2,FALSE)>VLOOKUP(L33,Lookups!$A$147:$B$152,2,FALSE),$I$11,\"\")))))","v":0},null,35,40,null,{"$f":"IF(R33=\"\",$I$7,IF(VLOOKUP(R33,Lookups!$A$147:$B$152,2,FALSE)<VLOOKUP(P33,Lookups!$A$147:$B$152,2,FALSE),$I$8,IF(AND(VLOOKUP(R33,Lookups!$A$147:$B$152,2,FALSE)>=VLOOKUP(P33,Lookups!$A$147:$B$152,2,FALSE),VLOOKUP(R33,Lookups!$A$147:$B$152,2,FALSE)<0.8*VLOOKUP(Q33,Lookups!$A$147:$B$152,2,FALSE)),$I$9,IF(AND(VLOOKUP(R33,Lookups!$A$147:$B$152,2,FALSE)<=VLOOKUP(Q33,Lookups!$A$147:$B$152,2,FALSE),VLOOKUP(R33,Lookups!$A$147:$B$152,2,FALSE)>=0.8*VLOOKUP(Q33,Lookups!$A$147:$B$152,2,FALSE)),$I$10,IF(VLOOKUP(R33,Lookups!$A$147:$B$152,2,FALSE)>VLOOKUP(Q33,Lookups!$A$147:$B$152,2,FALSE),$I$11,\"\")))))","v":0},null,35,40,null,{"$f":"IF(W33=\"\",$I$7,IF(VLOOKUP(W33,Lookups!$A$147:$B$152,2,FALSE)<VLOOKUP(U33,Lookups!$A$147:$B$152,2,FALSE),$I$8,IF(AND(VLOOKUP(W33,Lookups!$A$147:$B$152,2,FALSE)>=VLOOKUP(U33,Lookups!$A$147:$B$152,2,FALSE),VLOOKUP(W33,Lookups!$A$147:$B$152,2,FALSE)<0.8*VLOOKUP(V33,Lookups!$A$147:$B$152,2,FALSE)),$I$9,IF(AND(VLOOKUP(W33,Lookups!$A$147:$B$152,2,FALSE)<=VLOOKUP(V33,Lookups!$A$147:$B$152,2,FALSE),VLOOKUP(W33,Lookups!$A$147:$B$152,2,FALSE)>=0.8*VLOOKUP(V33,Lookups!$A$147:$B$152,2,FALSE)),$I$10,IF(VLOOKUP(W33,Lookups!$A$147:$B$152,2,FALSE)>VLOOKUP(V33,Lookups!$A$147:$B$152,2,FALSE),$I$11,\"\")))))","v":0},null,35,40,null,{"$f":"IF(AB33=\"\",$I$7,IF(VLOOKUP(AB33,Lookups!$A$147:$B$152,2,FALSE)<VLOOKUP(Z33,Lookups!$A$147:$B$152,2,FALSE),$I$8,IF(AND(VLOOKUP(AB33,Lookups!$A$147:$B$152,2,FALSE)>=VLOOKUP(Z33,Lookups!$A$147:$B$152,2,FALSE),VLOOKUP(AB33,Lookups!$A$147:$B$152,2,FALSE)<0.8*VLOOKUP(AA33,Lookups!$A$147:$B$152,2,FALSE)),$I$9,IF(AND(VLOOKUP(AB33,Lookups!$A$147:$B$152,2,FALSE)<=VLOOKUP(AA33,Lookups!$A$147:$B$152,2,FALSE),VLOOKUP(AB33,Lookups!$A$147:$B$152,2,FALSE)>=0.8*VLOOKUP(AA33,Lookups!$A$147:$B$152,2,FALSE)),$I$10,IF(VLOOKUP(AB33,Lookups!$A$147:$B$152,2,FALSE)>VLOOKUP(AA33,Lookups!$A$147:$B$152,2,FALSE),$I$11,\"\")))))","v":0},{"$nulls":3},"Storage Class",{"v":0.03,"d":"3.0%"},null,30,35,null,{"$f":"IF(AL33=\"\",$I$7,IF(VLOOKUP(AL33,Lookups!$A$147:$B$152,2,FALSE)<VLOOKUP(AJ33,Lookups!$A$147:$B$152,2,FALSE),$I$8,IF(AND(VLOOKUP(AL33,Lookups!$A$147:$B$152,2,FALSE)>=VLOOKUP(AJ33,Lookups!$A$147:$B$152,2,FALSE),VLOOKUP(AL33,Lookups!$A$147:$B$152,2,FALSE)<0.8*VLOOKUP(AK33,Lookups!$A$147:$B$152,2,FALSE)),$I$9,IF(AND(VLOOKUP(AL33,Lookups!$A$147:$B$152,2,FALSE)<=VLOOKUP(AK33,Lookups!$A$147:$B$152,2,FALSE),VLOOKUP(AL33,Lookups!$A$147:$B$152,2,FALSE)>=0.8*VLOOKUP(AK33,Lookups!$A$147:$B$152,2,FALSE)),$I$10,IF(VLOOKUP(AL33,Lookups!$A$147:$B$152,2,FALSE)>VLOOKUP(AK33,Lookups!$A$147:$B$152,2,FALSE),$I$11,\"\")))))","v":0},null,30,35,null,{"$f":"IF(AQ33=\"\",$I$7,IF(VLOOKUP(AQ33,Lookups!$A$147:$B$152,2,FALSE)<VLOOKUP(AO33,Lookups!$A$147:$B$152,2,FALSE),$I$8,IF(AND(VLOOKUP(AQ33,Lookups!$A$147:$B$152,2,FALSE)>=VLOOKUP(AO33,Lookups!$A$147:$B$152,2,FALSE),VLOOKUP(AQ33,Lookups!$A$147:$B$152,2,FALSE)<0.8*VLOOKUP(AP33,Lookups!$A$147:$B$152,2,FALSE)),$I$9,IF(AND(VLOOKUP(AQ33,Lookups!$A$147:$B$152,2,FALSE)<=VLOOKUP(AP33,Lookups!$A$147:$B$152,2,FALSE),VLOOKUP(AQ33,Lookups!$A$147:$B$152,2,FALSE)>=0.8*VLOOKUP(AP33,Lookups!$A$147:$B$152,2,FALSE)),$I$10,IF(VLOOKUP(AQ33,Lookups!$A$147:$B$152,2,FALSE)>VLOOKUP(AP33,Lookups!$A$147:$B$152,2,FALSE),$I$11,\"\")))))","v":0},null,35,40,null,{"$f":"IF(AV33=\"\",$I$7,IF(VLOOKUP(AV33,Lookups!$A$147:$B$152,2,FALSE)<VLOOKUP(AT33,Lookups!$A$147:$B$152,2,FALSE),$I$8,IF(AND(VLOOKUP(AV33,Lookups!$A$147:$B$152,2,FALSE)>=VLOOKUP(AT33,Lookups!$A$147:$B$152,2,FALSE),VLOOKUP(AV33,Lookups!$A$147:$B$152,2,FALSE)<0.8*VLOOKUP(AU33,Lookups!$A$147:$B$152,2,FALSE)),$I$9,IF(AND(VLOOKUP(AV33,Lookups!$A$147:$B$152,2,FALSE)<=VLOOKUP(AU33,Lookups!$A$147:$B$152,2,FALSE),VLOOKUP(AV33,Lookups!$A$147:$B$152,2,FALSE)>=0.8*VLOOKUP(AU33,Lookups!$A$147:$B$152,2,FALSE)),$I$10,IF(VLOOKUP(AV33,Lookups!$A$147:$B$152,2,FALSE)>VLOOKUP(AU33,Lookups!$A$147:$B$152,2,FALSE),$I$11,\"\")))))","v":0}]
[{"$f":"SUM(D34:D37)","v":{"v":0.04,"d":"4%"}},"Additional Disk Drives","Maximum number of additional disk drives that can be installed",{"v":0.015,"d":"1.5%"},null,0,1,null,{"$f":"IF(H34=\"\",$I$7,IF(H34<F34,$I$8,IF(AND(H34>=F34,H34<G34),$I$9,IF(H34=G34,$I$10,IF(H34>G34,$I$11,\"\")))))","v":0},null,0,1,null,{"$f":"IF(M34=\"\",$I$7,IF(M34<K34,$I$8,IF(AND(M34>=K34,M34<L34),$I$9,IF(M34=L34,$I$10,IF(M34>L34,$I$11,\"\")))))","v":0},null,0,1,null,{"$f":"IF(R34=\"\",$I$7,IF(R34<P34,$I$8,IF(AND(R34>=P34,R34<Q34),$I$9,IF(R34=Q34,$I$10,IF(R34>Q34,$I$11,\"\")))))","v":0},null,0,1,null,{"$f":"IF(W34=\"\",$I$7,IF(W34<U34,$I$8,IF(AND(W34>=U34,W34<V34),$I$9,IF(W34=V34,$I$10,IF(W34>V34,$I$11,\"\")))))","v":0},null,0,1,null,{"$f":"IF(AB34=\"\",$I$7,IF(AB34<Z34,$I$8,IF(AND(AB34>=Z34,AB34<AA34),$I$9,IF(AB34=AA34,$I$10,IF(AB34>AA34,$I$11,\"\")))))","v":0},null,{"$f":"SUM(AH34:AH37)","v":{"v":0.05,"d":"5%"}},"Additional Disk Drives","Maximum number of additional disk drives that can be installed",{"v":0.02,"d":"2.0%"},null,0,1,null,{"$f":"IF(AL34=\"\",$I$7,IF(AL34<AJ34,$I$8,IF(AND(AL34>=AJ34,AL34<AK34),$I$9,IF(AL34=AK34,$I$10,IF(AL34>AK34,$I$11,\"\")))))","v":0},null,2,3,null,{"$f":"IF(AQ34=\"\",$I$7,IF(AQ34<AO34,$I$8,IF(AND(AQ34>=AO34,AQ34<AP34),$I$9,IF(AQ34=AP34,$I$10,IF(AQ34>AP34,$I$11,\"\")))))","v":0},null,3,6,null,{"$f":"IF(AV34=\"\",$I$7,IF(AV34<AT34,$I$8,IF(AND(AV34>=AT34,AV34<AU34),$I$9,IF(AV34=AU34,$I$10,IF(AV34>AU34,$I$11,\"\")))))","v":0}]
[null,"that can be installed","M.2 PCIe SSD",{"v":0.01,"d":"1.0%"},null,0,1,null,{"$f":"IF(H35=\"\",$I$7,IF(SUM(H$35:H35)>H$34,$I$7,IF(H35<F35,$I$8,IF(G35=0,IF(H35>=F35,$I$9,IF(H35=G35,$I$10,IF(H35>G35,$I$11,\"\"))),IF(AND(H35>=F35,H35<G35),$I$9,IF(H35=G35,$I$10,IF(H35>G35,$I$11,\"\")))))))","v":0},null,0,1,null,{"$f":"IF(M35=\"\",$I$7,IF(SUM(M$35:M35)>M$34,$I$7,IF(M35<K35,$I$8,IF(L35=0,IF(M35>=K35,$I$9,IF(M35=L35,$I$10,IF(M35>L35,$I$11,\"\"))),IF(AND(M35>=K35,M35<L35),$I$9,IF(M35=L35,$I$10,IF(M35>L35,$I$11,\"\")))))))","v":0},null,0,1,null,{"$f":"IF(R35=\"\",$I$7,IF(SUM(R$35:R35)>R$34,$I$7,IF(R35<P35,$I$8,IF(Q35=0,IF(R35>=P35,$I$9,IF(R35=Q35,$I$10,IF(R35>Q35,$I$11,\"\"))),IF(AND(R35>=P35,R35<Q35),$I$9,IF(R35=Q35,$I$10,IF(R35>Q35,$I$11,\"\")))))))","v":0},null,0,1,null,{"$f":"IF(W35=\"\",$I$7,IF(SUM(W$35:W35)>W$34,$I$7,IF(W35<U35,$I$8,IF(V35=0,IF(W35>=U35,$I$9,IF(W35=V35,$I$10,IF(W35>V35,$I$11,\"\"))),IF(AND(W35>=U35,W35<V35),$I$9,IF(W35=V35,$I$10,IF(W35>V35,$I$11,\"\")))))))","v":0},null,0,1,null,{"$f":"IF(AB35=\"\",$I$7,IF(SUM(AB$35:AB35)>AB$34,$I$7,IF(AB35<Z35,$I$8,IF(AA35=0,IF(AB35>=Z35,$I$9,IF(AB35=AA35,$I$10,IF(AB35>AA35,$I$11,\"\"))),IF(AND(AB35>=Z35,AB35<AA35),$I$9,IF(AB35=AA35,$I$10,IF(AB35>AA35,$I$11,\"\")))))))","v":0},null,null,"that can be installed","M.2 PCIe SSD",{"v":0.015,"d":"1.5%"},null,0,1,null,{"$f":"IF(AL35=\"\",$I$7,IF(SUM(AL$35:AL35)>AL$34,$I$7,IF(AL35<AJ35,$I$8,IF(AK35=0,IF(AL35>=AJ35,$I$9,IF(AL35=AK35,$I$10,IF(AL35>AK35,$I$11,\"\"))),IF(AND(AL35>=AJ35,AL35<AK35),$I$9,IF(AL35=AK35,$I$10,IF(AL35>AK35,$I$11,\"\")))))))","v":0},null,0,1,null,{"$f":"IF(AQ35=\"\",$I$7,IF(SUM(AQ$35:AQ35)>AQ$34,$I$7,IF(AQ35<AO35,$I$8,IF(AP35=0,IF(AQ35>=AO35,$I$9,IF(AQ35=AP35,$I$10,IF(AQ35>AP35,$I$11,\"\"))),IF(AND(AQ35>=AO35,AQ35<AP35),$I$9,IF(AQ35=AP35,$I$10,IF(AQ35>AP35,$I$11,\"\")))))))","v":0},null,1,1,null,{"$f":"IF(AV35=\"\",$I$7,IF(SUM(AV$35:AV35)>AV$34,$I$7,IF(AV35<AT35,$I$8,IF(AU35=0,IF(AV35>=AT35,$I$9,IF(AV35=AU35,$I$10,IF(AV35>AU35,$I$11,\"\"))),IF(AND(AV35>=AT35,AV35<AU35),$I$9,IF(AV35=AU35,$I$10,IF(AV35>AU35,$I$11,\"\")))))))","v":0}]
[null,null,"SATA SSD",{"v":0.01,"d":"1.0%"},null,1,0,null,{"$f":"IF(H36=\"\",$I$7,IF(SUM(H$35:H36)>H$34,$I$7,IF(H36<F36,$I$8,IF(G36=0,IF(H36>=F36,$I$9,IF(H36=G36,$I$10,IF(H36>G36,$I$11,\"\"))),IF(AND(H36>=F36,H36<G36),$I$9,IF(H36=G36,$I$10,IF(H36>G36,$I$11,\"\")))))))","v":0},null,1,0,null,{"$f":"IF(M36=\"\",$I$7,IF(SUM(M$35:M36)>M$34,$I$7,IF(M36<K36,$I$8,IF(L36=0,IF(M36>=K36,$I$9,IF(M36=L36,$I$10,IF(M36>L36,$I$11,\"\"))),IF(AND(M36>=K36,M36<L36),$I$9,IF(M36=L36,$I$10,IF(M36>L36,$I$11,\"\")))))))","v":0},null,1,0,null,{"$f":"IF(R36=\"\",$I$7,IF(SUM(R$35:R36)>R$34,$I$7,IF(R36<P36,$I$8,IF(Q36=0,IF(R36>=P36,$I$9,IF(R36=Q36,$I$10,IF(R36>Q36,$I$11,\"\"))),IF(AND(R36>=P36,R36<Q36),$I$9,IF(R36=Q36,$I$10,IF(R36>Q36,$I$11,\"\")))))))","v":0},null,1,0,null,{"$f":"IF(W36=\"\",$I$7,IF(SUM(W$35:W36)>W$34,$I$7,IF(W36<U36,$I$8,IF(V36=0,IF(W36>=U36,$I$9,IF(W36=V36,$I$10,IF(W36>V36,$I$11,\"\"))),IF(AND(W36>=U36,W36<V36),$I$9,IF(W36=V36,$I$10,IF(W36>V36,$I$11,\"\")))))))","v":0},null,1,0,null,{"$f":"IF(AB36=\"\",$I$7,IF(SUM(AB$35:AB36)>AB$34,$I$7,IF(AB36<Z36,$I$8,IF(AA36=0,IF(AB36>=Z36,$I$9,IF(AB36=AA36,$I$10,IF(AB36>AA36,$I$11,\"\"))),IF(AND(AB36>=Z36,AB36<AA36),$I$9,IF(AB36=AA36,$I$10,IF(AB36>AA36,$I$11,\"\")))))))","v":0},{"$nulls":3},"SATA SSD",{"v":0.01,"d":"1.0%"},null,0,1,null,{"$f":"IF(AL36=\"\",$I$7,IF(SUM(AL$35:AL36)>AL$34,$I$7,IF(AL36<AJ36,$I$8,IF(AK36=0,IF(AL36>=AJ36,$I$9,IF(AL36=AK36,$I$10,IF(AL36>AK36,$I$11,\"\"))),IF(AND(AL36>=AJ36,AL36<AK36),$I$9,IF(AL36=AK36,$I$10,IF(AL36>AK36,$I$11,\"\")))))))","v":0},null,2,2,null,{"$f":"IF(AQ36=\"\",$I$7,IF(SUM(AQ$35:AQ36)>AQ$34,$I$7,IF(AQ36<AO36,$I$8,IF(AP36=0,IF(AQ36>=AO36,$I$9,IF(AQ36=AP36,$I$10,IF(AQ36>AP36,$I$11,\"\"))),IF(AND(AQ36>=AO36,AQ36<AP36),$I$9,IF(AQ36=AP36,$I$10,IF(AQ36>AP36,$I$11,\"\")))))))","v":0},null,2,4,null,{"$f":"IF(AV36=\"\",$I$7,IF(SUM(AV$35:AV36)>AV$34,$I$7,IF(AV36<AT36,$I$8,IF(AU36=0,IF(AV36>=AT36,$I$9,IF(AV36=AU36,$I$10,IF(AV36>AU36,$I$11,\"\"))),IF(AND(AV36>=AT36,AV36<AU36),$I$9,IF(AV36=AU36,$I$10,IF(AV36>AU36,$I$11,\"\")))))))","v":0}]
[null,null,"SATA HDD",{"v":0.005,"d":"0.5%"},null,0,0,null,{"$f":"IF(H37=\"\",$I$7,IF(SUM(H$35:H37)>H$34,$I$7,IF(H37<F37,$I$8,IF(G37=0,IF(H37>=F37,$I$9,IF(H37=G37,$I$10,IF(H37>G37,$I$11,\"\"))),IF(AND(H37>=F37,H37<G37),$I$9,IF(H37=G37,$I$10,IF(H37>G37,$I$11,\"\")))))))","v":0},null,0,0,null,{"$f":"IF(M37=\"\",$I$7,IF(SUM(M$35:M37)>M$34,$I$7,IF(M37<K37,$I$8,IF(L37=0,IF(M37>=K37,$I$9,IF(M37=L37,$I$10,IF(M37>L37,$I$11,\"\"))),IF(AND(M37>=K37,M37<L37),$I$9,IF(M37=L37,$I$10,IF(M37>L37,$I$11,\"\")))))))","v":0},null,0,0,null,{"$f":"IF(R37=\"\",$I$7,IF(SUM(R$35:R37)>R$34,$I$7,IF(R37<P37,$I$8,IF(Q37=0,IF(R37>=P37,$I$9,IF(R37=Q37,$I$10,IF(R37>Q37,$I$11,\"\"))),IF(AND(R37>=P37,R37<Q37),$I$9,IF(R37=Q37,$I$10,IF(R37>Q37,$I$11,\"\")))))))","v":0},null,0,0,null,{"$f":"IF(W37=\"\",$I$7,IF(SUM(W$35:W37)>W$34,$I$7,IF(W37<U37,$I$8,IF(V37=0,IF(W37>=U37,$I$9,IF(W37=V37,$I$10,IF(W37>V37,$I$11,\"\"))),IF(AND(W37>=U37,W37<V37),$I$9,IF(W37=V37,$I$10,IF(W37>V37,$I$11,\"\")))))))","v":0},null,0,0,null,{"$f":"IF(AB37=\"\",$I$7,IF(SUM(AB$35:AB37)>AB$34,$I$7,IF(AB37<Z37,$I$8,IF(AA37=0,IF(AB37>=Z37,$I$9,IF(AB37=AA37,$I$10,IF(AB37>AA37,$I$11,\"\"))),IF(AND(AB37>=Z37,AB37<AA37),$I$9,IF(AB37=AA37,$I$10,IF(AB37>AA37,$I$11,\"\")))))))","v":0},{"$nulls":3},"SATA HDD",{"v":0.005,"d":"0.5%"},null,1,0,null,{"$f":"IF(AL37=\"\",$I$7,IF(SUM(AL$35:AL37)>AL$34,$I$7,IF(AL37<AJ37,$I$8,IF(AK37=0,IF(AL37>=AJ37,$I$9,IF(AL37=AK37,$I$10,IF(AL37>AK37,$I$11,\"\"))),IF(AND(AL37>=AJ37,AL37<AK37),$I$9,IF(AL37=AK37,$I$10,IF(AL37>AK37,$I$11,\"\")))))))","v":0},null,2,2,null,{"$f":"IF(AQ37=\"\",$I$7,IF(SUM(AQ$35:AQ37)>AQ$34,$I$7,IF(AQ37<AO37,$I$8,IF(AP37=0,IF(AQ37>=AO37,$I$9,IF(AQ37=AP37,$I$10,IF(AQ37>AP37,$I$11,\"\"))),IF(AND(AQ37>=AO37,AQ37<AP37),$I$9,IF(AQ37=AP37,$I$10,IF(AQ37>AP37,$I$11,\"\")))))))","v":0},null,2,4,null,{"$f":"IF(AV37=\"\",$I$7,IF(SUM(AV$35:AV37)>AV$34,$I$7,IF(AV37<AT37,$I$8,IF(AU37=0,IF(AV37>=AT37,$I$9,IF(AV37=AU37,$I$10,IF(AV37>AU37,$I$11,\"\"))),IF(AND(AV37>=AT37,AV37<AU37),$I$9,IF(AV37=AU37,$I$10,IF(AV37>AU37,$I$11,\"\")))))))","v":0}]
[{"$f":"SUM(D38:D42)","v":{"v":0.09,"d":"9%"}},"Graphics Processor Unit (GPU)","Maximum Horizontal Resolution",{"v":0.04,"d":"4.0%"},null,3840,3840,null,{"$f":"IF(H38=\"\",$I$7,IF(H38<F38,$I$8,IF(AND(H38>=F38,H38<0.9*G38),$I$9,IF(AND(H38<=G38,H38>=0.9*G38),$I$10,IF(H38>G38,$I$11,\"\")))))","v":0},null,3840,3840,null,{"$f":"IF(M38=\"\",$I$7,IF(M38<K38,$I$8,IF(AND(M38>=K38,M38<0.9*L38),$I$9,IF(AND(M38<=L38,M38>=0.9*L38),$I$10,IF(M38>L38,$I$11,\"\")))))","v":0},null,3840,3840,null,{"$f":"IF(R38=\"\",$I$7,IF(R38<P38,$I$8,IF(AND(R38>=P38,R38<0.9*Q38),$I$9,IF(AND(R38<=Q38,R38>=0.9*Q38),$I$10,IF(R38>Q38,$I$11,\"\")))))","v":0},null,3840,7680,null,{"$f":"IF(W38=\"\",$I$7,IF(W38<U38,$I$8,IF(AND(W38>=U38,W38<0.9*V38),$I$9,IF(AND(W38<=V38,W38>=0.9*V38),$I$10,IF(W38>V38,$I$11,\"\")))))","v":0},null,3840,7680,null,{"$f":"IF(AB38=\"\",$I$7,IF(AB38<Z38,$I$8,IF(AND(AB38>=Z38,AB38<0.9*AA38),$I$9,IF(AND(AB38<=AA38,AB38>=0.9*AA38),$I$10,IF(AB38>AA38,$I$11,\"\")))))","v":0},null,{"$f":"SUM(AH38:AH42)","v":{"v":0.11000000000000001,"d":"11%"}},"Graphics Processor Unit (GPU)","Maximum Horizontal Resolution",{"v":0.04,"d":"4.0%"},null,3840,7680,null,{"$f":"IF(AL38=\"\",$I$7,IF(AL38<AJ38,$I$8,IF(AND(AL38>=AJ38,AL38<0.9*AK38),$I$9,IF(AND(AL38<=AK38,AL38>=0.9*AK38),$I$10,IF(AL38>AK38,$I$11,\"\")))))","v":0},null,3840,7680,null,{"$f":"IF(AQ38=\"\",$I$7,IF(AQ38<AO38,$I$8,IF(AND(AQ38>=AO38,AQ38<0.9*AP38),$I$9,IF(AND(AQ38<=AP38,AQ38>=0.9*AP38),$I$10,IF(AQ38>AP38,$I$11,\"\")))))","v":0},null,3840,7680,null,{"$f":"IF(AV38=\"\",$I$7,IF(AV38<AT38,$I$8,IF(AND(AV38>=AT38,AV38<0.9*AU38),$I$9,IF(AND(AV38<=AU38,AV38>=0.9*AU38),$I$10,IF(AV38>AU38,$I$11,\"\")))))","v":0}]
[null,null,"Maximum Vertical Resolution",null,null,{"$f":"IF(F38=\"\",\"\",VLOOKUP(F38,Lookups!$B$3:$C$7,2))","v":2160},{"$f":"IF(G38=\"\",\"\",VLOOKUP(G38,Lookups!$B$3:$C$7,2))","v":2160},{"$f":"IF(H38=\"\",\"\",VLOOKUP(H38,Lookups!$B$3:$C$7,2))","v":""},null,null,{"$f":"IF(K38=\"\",\"\",VLOOKUP(K38,Lookups!$B$3:$C$7,2))","v":2160},{"$f":"IF(L38=\"\",\"\",VLOOKUP(L38,Lookups!$B$3:$C$7,2))","v":2160},{"$f":"IF(M38=\"\",\"\",VLOOKUP(M38,Lookups!$B$3:$C$7,2))","v":""},null,null,{"$f":"IF(P38=\"\",\"\",VLOOKUP(P38,Lookups!$B$3:$C$7,2))","v":2160},{"$f":"IF(Q38=\"\",\"\",VLOOKUP(Q38,Lookups!$B$3:$C$7,2))","v":2160},{"$f":"IF(R38=\"\",\"\",VLOOKUP(R38,Lookups!$B$3:$C$7,2))","v":""},null,null,{"$f":"IF(U38=\"\",\"\",VLOOKUP(U38,Lookups!$B$3:$C$7,2))","v":2160},{"$f":"IF(V38=\"\",\"\",VLOOKUP(V38,Lookups!$B$3:$C$7,2))","v":4320},{"$f":"IF(W38=\"\",\"\",VLOOKUP(W38,Lookups!$B$3:$C$7,2))","v":""},null,null,{"$f":"IF(Z38=\"\",\"\",VLOOKUP(Z38,Lookups!$B$3:$C$7,2))","v":2160},{"$f":"IF(AA38=\"\",\"\",VLOOKUP(AA38,Lookups!$B$3:$C$7,2))","v":4320},{"$f":"IF(AB38=\"\",\"\",VLOOKUP(AB38,Lookups!$B$3:$C$7,2))","v":""},{"$nulls":4},"Maximum Vertical Resolution",null,null,{"$f":"IF(AJ38=\"\",\"\",VLOOKUP(AJ38,Lookups!$B$3:$C$7,2))","v":2160},{"$f":"IF(AK38=\"\",\"\",VLOOKUP(AK38,Lookups!$B$3:$C$7,2))","v":4320},{"$f":"IF(AL38=\"\",\"\",VLOOKUP(AL38,Lookups!$B$3:$C$7,2))","v":""},null,null,{"$f":"IF(AO38=\"\",\"\",VLOOKUP(AO38,Lookups!$B$3:$C$7,2))","v":2160},{"$f":"IF(AP38=\"\",\"\",VLOOKUP(AP38,Lookups!$B$3:$C$7,2))","v":4320},{"$f":"IF(AQ38=\"\",\"\",VLOOKUP(AQ38,Lookups!$B$3:$C$7,2))","v":""},null,null,{"$f":"IF(AT38=\"\",\"\",VLOOKUP(AT38,Lookups!$B$3:$C$7,2))","v":2160},{"$f":"IF(AU38=\"\",\"\",VLOOKUP(AU38,Lookups!$B$3:$C$7,2))","v":4320},{"$f":"IF(AV38=\"\",\"\",VLOOKUP(AV38,Lookups!$B$3:$C$7,2))","v":""}]
[null,null,"Maximum Refresh Rate at Maximum Resolution (Hz)",{"v":0.01,"d":"1.0%"},null,60,75,null,{"$f":"IF(H40=\"\",$I$7,IF(H40<F40,$I$8,IF(AND(H40>=F40,H40<0.9*G40),$I$9,IF(AND(H40<=G40,H40>=0.9*G40),$I$10,IF(H40>G40,$I$11,\"\")))))","v":0},null,60,75,null,{"$f":"IF(M40=\"\",$I$7,IF(M40<K40,$I$8,IF(AND(M40>=K40,M40<0.9*L40),$I$9,IF(AND(M40<=L40,M40>=0.9*L40),$I$10,IF(M40>L40,$I$11,\"\")))))","v":0},null,60,75,null,{"$f":"IF(R40=\"\",$I$7,IF(R40<P40,$I$8,IF(AND(R40>=P40,R40<0.9*Q40),$I$9,IF(AND(R40<=Q40,R40>=0.9*Q40),$I$10,IF(R40>Q40,$I$11,\"\")))))","v":0},null,75,144,null,{"$f":"IF(W40=\"\",$I$7,IF(W40<U40,$I$8,IF(AND(W40>=U40,W40<0.9*V40),$I$9,IF(AND(W40<=V40,W40>=0.9*V40),$I$10,IF(W40>V40,$I$11,\"\")))))","v":0},null,75,144,null,{"$f":"IF(AB40=\"\",$I$7,IF(AB40<Z40,$I$8,IF(AND(AB40>=Z40,AB40<0.9*AA40),$I$9,IF(AND(AB40<=AA40,AB40>=0.9*AA40),$I$10,IF(AB40>AA40,$I$11,\"\")))))","v":0},{"$nulls":3},"Maximum Refresh Rate at Maximum Resolution (Hz)",{"v":0.01,"d":"1.0%"},null,60,75,null,{"$f":"IF(AL40=\"\",$I$7,IF(AL40<AJ40,$I$8,IF(AND(AL40>=AJ40,AL40<0.9*AK40),$I$9,IF(AND(AL40<=AK40,AL40>=0.9*AK40),$I$10,IF(AL40>AK40,$I$11,\"\")))))","v":0},null,60,75,null,{"$f":"IF(AQ40=\"\",$I$7,IF(AQ40<AO40,$I$8,IF(AND(AQ40>=AO40,AQ40<0.9*AP40),$I$9,IF(AND(AQ40<=AP40,AQ40>=0.9*AP40),$I$10,IF(AQ40>AP40,$I$11,\"\")))))","v":0},null,100,144,null,{"$f":"IF(AV40=\"\",$I$7,IF(AV40<AT40,$I$8,IF(AND(AV40>=AT40,AV40<0.9*AU40),$I$9,IF(AND(AV40<=AU40,AV40>=0.9*AU40),$I$10,IF(AV40>AU40,$I$11,\"\")))))","v":0}]
[null,null,"Maximum number of screens that can be connected",{"v":0.01,"d":"1.0%"},null,2,4,null,{"$f":"IF(H41=\"\",$I$7,IF(VLOOKUP(H41,Lookups!$A$155:$B$160,2,FALSE)<VLOOKUP(F41,Lookups!$A$155:$B$160,2,FALSE),$I$8,IF(AND(VLOOKUP(H41,Lookups!$A$155:$B$160,2,FALSE)>=VLOOKUP(F41,Lookups!$A$155:$B$160,2,FALSE),VLOOKUP(H41,Lookups!$A$155:$B$160,2,FALSE)<0.8*VLOOKUP(G41,Lookups!$A$155:$B$160,2,FALSE)),$I$9,IF(AND(VLOOKUP(H41,Lookups!$A$155:$B$160,2,FALSE)<=VLOOKUP(G41,Lookups!$A$155:$B$160,2,FALSE),VLOOKUP(H41,Lookups!$A$155:$B$160,2,FALSE)>=0.8*VLOOKUP(G41,Lookups!$A$155:$B$160,2,FALSE)),$I$10,IF(VLOOKUP(H41,Lookups!$A$155:$B$160,2,FALSE)>VLOOKUP(G41,Lookups!$A$155:$B$160,2,FALSE),$I$11,\"\")))))","v":0},null,2,4,null,{"$f":"IF(M41=\"\",$I$7,IF(VLOOKUP(M41,Lookups!$A$155:$B$160,2,FALSE)<VLOOKUP(K41,Lookups!$A$155:$B$160,2,FALSE),$I$8,IF(AND(VLOOKUP(M41,Lookups!$A$155:$B$160,2,FALSE)>=VLOOKUP(K41,Lookups!$A$155:$B$160,2,FALSE),VLOOKUP(M41,Lookups!$A$155:$B$160,2,FALSE)<0.8*VLOOKUP(L41,Lookups!$A$155:$B$160,2,FALSE)),$I$9,IF(AND(VLOOKUP(M41,Lookups!$A$155:$B$160,2,FALSE)<=VLOOKUP(L41,Lookups!$A$155:$B$160,2,FALSE),VLOOKUP(M41,Lookups!$A$155:$B$160,2,FALSE)>=0.8*VLOOKUP(L41,Lookups!$A$155:$B$160,2,FALSE)),$I$10,IF(VLOOKUP(M41,Lookups!$A$155:$B$160,2,FALSE)>VLOOKUP(L41,Lookups!$A$155:$B$160,2,FALSE),$I$11,\"\")))))","v":0},null,2,4,null,{"$f":"IF(R41=\"\",$I$7,IF(VLOOKUP(R41,Lookups!$A$155:$B$160,2,FALSE)<VLOOKUP(P41,Lookups!$A$155:$B$160,2,FALSE),$I$8,IF(AND(VLOOKUP(R41,Lookups!$A$155:$B$160,2,FALSE)>=VLOOKUP(P41,Lookups!$A$155:$B$160,2,FALSE),VLOOKUP(R41,Lookups!$A$155:$B$160,2,FALSE)<0.8*VLOOKUP(Q41,Lookups!$A$155:$B$160,2,FALSE)),$I$9,IF(AND(VLOOKUP(R41,Lookups!$A$155:$B$160,2,FALSE)<=VLOOKUP(Q41,Lookups!$A$155:$B$160,2,FALSE),VLOOKUP(R41,Lookups!$A$155:$B$160,2,FALSE)>=0.8*VLOOKUP(Q41,Lookups!$A$155:$B$160,2,FALSE)),$I$10,IF(VLOOKUP(R41,Lookups!$A$155:$B$160,2,FALSE)>VLOOKUP(Q41,Lookups!$A$155:$B$160,2,FALSE),$I$11,\"\")))))","v":0},null,4,6,null,{"$f":"IF(W41=\"\",$I$7,IF(VLOOKUP(W41,Lookups!$A$155:$B$160,2,FALSE)<VLOOKUP(U41,Lookups!$A$155:$B$160,2,FALSE),$I$8,IF(AND(VLOOKUP(W41,Lookups!$A$155:$B$160,2,FALSE)>=VLOOKUP(U41,Lookups!$A$155:$B$160,2,FALSE),VLOOKUP(W41,Lookups!$A$155:$B$160,2,FALSE)<0.8*VLOOKUP(V41,Lookups!$A$155:$B$160,2,FALSE)),$I$9,IF(AND(VLOOKUP(W41,Lookups!$A$155:$B$160,2,FALSE)<=VLOOKUP(V41,Lookups!$A$155:$B$160,2,FALSE),VLOOKUP(W41,Lookups!$A$155:$B$160,2,FALSE)>=0.8*VLOOKUP(V41,Lookups!$A$155:$B$160,2,FALSE)),$I$10,IF(VLOOKUP(W41,Lookups!$A$155:$B$160,2,FALSE)>VLOOKUP(V41,Lookups!$A$155:$B$160,2,FALSE),$I$11,\"\")))))","v":0},null,4,6,null,{"$f":"IF(AB41=\"\",$I$7,IF(VLOOKUP(AB41,Lookups!$A$155:$B$160,2,FALSE)<VLOOKUP(Z41,Lookups!$A$155:$B$160,2,FALSE),$I$8,IF(AND(VLOOKUP(AB41,Lookups!$A$155:$B$160,2,FALSE)>=VLOOKUP(Z41,Lookups!$A$155:$B$160,2,FALSE),VLOOKUP(AB41,Lookups!$A$155:$B$160,2,FALSE)<0.8*VLOOKUP(AA41,Lookups!$A$155:$B$160,2,FALSE)),$I$9,IF(AND(VLOOKUP(AB41,Lookups!$A$155:$B$160,2,FALSE)<=VLOOKUP(AA41,Lookups!$A$155:$B$160,2,FALSE),VLOOKUP(AB41,Lookups!$A$155:$B$160,2,FALSE)>=0.8*VLOOKUP(AA41,Lookups!$A$155:$B$160,2,FALSE)),$I$10,IF(VLOOKUP(AB41,Lookups!$A$155:$B$160,2,FALSE)>VLOOKUP(AA41,Lookups!$A$155:$B$160,2,FALSE),$I$11,\"\")))))","v":0},{"$nulls":3},"Maximum number of screens that can be connected",{"v":0.02,"d":"2.0%"},null,2,4,null,{"$f":"IF(AL41=\"\",$I$7,IF(VLOOKUP(AL41,Lookups!$A$155:$B$160,2,FALSE)<VLOOKUP(AJ41,Lookups!$A$155:$B$160,2,FALSE),$I$8,IF(AND(VLOOKUP(AL41,Lookups!$A$155:$B$160,2,FALSE)>=VLOOKUP(AJ41,Lookups!$A$155:$B$160,2,FALSE),VLOOKUP(AL41,Lookups!$A$155:$B$160,2,FALSE)<0.8*VLOOKUP(AK41,Lookups!$A$155:$B$160,2,FALSE)),$I$9,IF(AND(VLOOKUP(AL41,Lookups!$A$155:$B$160,2,FALSE)<=VLOOKUP(AK41,Lookups!$A$155:$B$160,2,FALSE),VLOOKUP(AL41,Lookups!$A$155:$B$160,2,FALSE)>=0.8*VLOOKUP(AK41,Lookups!$A$155:$B$160,2,FALSE)),$I$10,IF(VLOOKUP(AL41,Lookups!$A$155:$B$160,2,FALSE)>VLOOKUP(AK41,Lookups!$A$155:$B$160,2,FALSE),$I$11,\"\")))))","v":0},null,2,4,null,{"$f":"IF(AQ41=\"\",$I$7,IF(VLOOKUP(AQ41,Lookups!$A$155:$B$160,2,FALSE)<VLOOKUP(AO41,Lookups!$A$155:$B$160,2,FALSE),$I$8,IF(AND(VLOOKUP(AQ41,Lookups!$A$155:$B$160,2,FALSE)>=VLOOKUP(AO41,Lookups!$A$155:$B$160,2,FALSE),VLOOKUP(AQ41,Lookups!$A$155:$B$160,2,FALSE)<0.8*VLOOKUP(AP41,Lookups!$A$155:$B$160,2,FALSE)),$I$9,IF(AND(VLOOKUP(AQ41,Lookups!$A$155:$B$160,2,FALSE)<=VLOOKUP(AP41,Lookups!$A$155:$B$160,2,FALSE),VLOOKUP(AQ41,Lookups!$A$155:$B$160,2,FALSE)>=0.8*VLOOKUP(AP41,Lookups!$A$155:$B$160,2,FALSE)),$I$10,IF(VLOOKUP(AQ41,Lookups!$A$155:$B$160,2,FALSE)>VLOOKUP(AP41,Lookups!$A$155:$B$160,2,FALSE),$I$11,\"\")))))","v":0},null,4,6,null,{"$f":"IF(AV41=\"\",$I$7,IF(VLOOKUP(AV41,Lookups!$A$155:$B$160,2,FALSE)<VLOOKUP(AT41,Lookups!$A$155:$B$160,2,FALSE),$I$8,IF(AND(VLOOKUP(AV41,Lookups!$A$155:$B$160,2,FALSE)>=VLOOKUP(AT41,Lookups!$A$155:$B$160,2,FALSE),VLOOKUP(AV41,Lookups!$A$155:$B$160,2,FALSE)<0.8*VLOOKUP(AU41,Lookups!$A$155:$B$160,2,FALSE)),$I$9,IF(AND(VLOOKUP(AV41,Lookups!$A$155:$B$160,2,FALSE)<=VLOOKUP(AU41,Lookups!$A$155:$B$160,2,FALSE),VLOOKUP(AV41,Lookups!$A$155:$B$160,2,FALSE)>=0.8*VLOOKUP(AU41,Lookups!$A$155:$B$160,2,FALSE)),$I$10,IF(VLOOKUP(AV41,Lookups!$A$155:$B$160,2,FALSE)>VLOOKUP(AU41,Lookups!$A$155:$B$160,2,FALSE),$I$11,\"\")))))","v":0}]
[null,null,"Integrated/Discreet",{"v":0.03,"d":"3.0%"},null,"Integrated","Integrated",null,{"$f":"IF(H42=\"\",$I$7,IF(VLOOKUP(H42,Lookups!$A$27:$B$28,2,FALSE)<VLOOKUP(F42,Lookups!$A$27:$B$28,2,FALSE),$I$8,IF(AND(VLOOKUP(H42,Lookups!$A$27:$B$28,2,FALSE)>=VLOOKUP(F42,Lookups!$A$27:$B$28,2,FALSE),VLOOKUP(H42,Lookups!$A$27:$B$28,2,FALSE)<0.8*VLOOKUP(G42,Lookups!$A$27:$B$28,2,FALSE)),$I$9,IF(AND(VLOOKUP(H42,Lookups!$A$27:$B$28,2,FALSE)<=VLOOKUP(G42,Lookups!$A$27:$B$28,2,FALSE),VLOOKUP(H42,Lookups!$A$27:$B$28,2,FALSE)>=0.8*VLOOKUP(G42,Lookups!$A$27:$B$28,2,FALSE)),$I$10,IF(VLOOKUP(H42,Lookups!$A$27:$B$28,2,FALSE)>VLOOKUP(G42,Lookups!$A$27:$B$28,2,FALSE),$I$11,\"\")))))","v":0},null,"Integrated","Integrated",null,{"$f":"IF(M42=\"\",$I$7,IF(VLOOKUP(M42,Lookups!$A$27:$B$28,2,FALSE)<VLOOKUP(K42,Lookups!$A$27:$B$28,2,FALSE),$I$8,IF(AND(VLOOKUP(M42,Lookups!$A$27:$B$28,2,FALSE)>=VLOOKUP(K42,Lookups!$A$27:$B$28,2,FALSE),VLOOKUP(M42,Lookups!$A$27:$B$28,2,FALSE)<0.8*VLOOKUP(L42,Lookups!$A$27:$B$28,2,FALSE)),$I$9,IF(AND(VLOOKUP(M42,Lookups!$A$27:$B$28,2,FALSE)<=VLOOKUP(L42,Lookups!$A$27:$B$28,2,FALSE),VLOOKUP(M42,Lookups!$A$27:$B$28,2,FALSE)>=0.8*VLOOKUP(L42,Lookups!$A$27:$B$28,2,FALSE)),$I$10,IF(VLOOKUP(M42,Lookups!$A$27:$B$28,2,FALSE)>VLOOKUP(L42,Lookups!$A$27:$B$28,2,FALSE),$I$11,\"\")))))","v":0},null,"Integrated","Integrated",null,{"$f":"IF(R42=\"\",$I$7,IF(VLOOKUP(R42,Lookups!$A$27:$B$28,2,FALSE)<VLOOKUP(P42,Lookups!$A$27:$B$28,2,FALSE),$I$8,IF(AND(VLOOKUP(R42,Lookups!$A$27:$B$28,2,FALSE)>=VLOOKUP(P42,Lookups!$A$27:$B$28,2,FALSE),VLOOKUP(R42,Lookups!$A$27:$B$28,2,FALSE)<0.8*VLOOKUP(Q42,Lookups!$A$27:$B$28,2,FALSE)),$I$9,IF(AND(VLOOKUP(R42,Lookups!$A$27:$B$28,2,FALSE)<=VLOOKUP(Q42,Lookups!$A$27:$B$28,2,FALSE),VLOOKUP(R42,Lookups!$A$27:$B$28,2,FALSE)>=0.8*VLOOKUP(Q42,Lookups!$A$27:$B$28,2,FALSE)),$I$10,IF(VLOOKUP(R42,Lookups!$A$27:$B$28,2,FALSE)>VLOOKUP(Q42,Lookups!$A$27:$B$28,2,FALSE),$I$11,\"\")))))","v":0},null,"Discreet","Discreet",null,{"$f":"IF(W42=\"\",$I$7,IF(VLOOKUP(W42,Lookups!$A$27:$B$28,2,FALSE)<VLOOKUP(U42,Lookups!$A$27:$B$28,2,FALSE),$I$8,IF(AND(VLOOKUP(W42,Lookups!$A$27:$B$28,2,FALSE)>=VLOOKUP(U42,Lookups!$A$27:$B$28,2,FALSE),VLOOKUP(W42,Lookups!$A$27:$B$28,2,FALSE)<0.8*VLOOKUP(V42,Lookups!$A$27:$B$28,2,FALSE)),$I$9,IF(AND(VLOOKUP(W42,Lookups!$A$27:$B$28,2,FALSE)<=VLOOKUP(V42,Lookups!$A$27:$B$28,2,FALSE),VLOOKUP(W42,Lookups!$A$27:$B$28,2,FALSE)>=0.8*VLOOKUP(V42,Lookups!$A$27:$B$28,2,FALSE)),$I$10,IF(VLOOKUP(W42,Lookups!$A$27:$B$28,2,FALSE)>VLOOKUP(V42,Lookups!$A$27:$B$28,2,FALSE),$I$11,\"\")))))","v":0},null,"Discreet","Discreet",null,{"$f":"IF(AB42=\"\",$I$7,IF(VLOOKUP(AB42,Lookups!$A$27:$B$28,2,FALSE)<VLOOKUP(Z42,Lookups!$A$27:$B$28,2,FALSE),$I$8,IF(AND(VLOOKUP(AB42,Lookups!$A$27:$B$28,2,FALSE)>=VLOOKUP(Z42,Lookups!$A$27:$B$28,2,FALSE),VLOOKUP(AB42,Lookups!$A$27:$B$28,2,FALSE)<0.8*VLOOKUP(AA42,Lookups!$A$27:$B$28,2,FALSE)),$I$9,IF(AND(VLOOKUP(AB42,Lookups!$A$27:$B$28,2,FALSE)<=VLOOKUP(AA42,Lookups!$A$27:$B$28,2,FALSE),VLOOKUP(AB42,Lookups!$A$27:$B$28,2,FALSE)>=0.8*VLOOKUP(AA42,Lookups!$A$27:$B$28,2,FALSE)),$I$10,IF(VLOOKUP(AB42,Lookups!$A$27:$B$28,2,FALSE)>VLOOKUP(AA42,Lookups!$A$27:$B$28,2,FALSE),$I$11,\"\")))))","v":0},{"$nulls":3},"Integrated/Discreet",{"v":0.04,"d":"4.0%"},null,"Integrated","Integrated",null,{"$f":"IF(AL42=\"\",$I$7,IF(VLOOKUP(AL42,Lookups!$A$27:$B$28,2,FALSE)<VLOOKUP(AJ42,Lookups!$A$27:$B$28,2,FALSE),$I$8,IF(AND(VLOOKUP(AL42,Lookups!$A$27:$B$28,2,FALSE)>=VLOOKUP(AJ42,Lookups!$A$27:$B$28,2,FALSE),VLOOKUP(AL42,Lookups!$A$27:$B$28,2,FALSE)<0.8*VLOOKUP(AK42,Lookups!$A$27:$B$28,2,FALSE)),$I$9,IF(AND(VLOOKUP(AL42,Lookups!$A$27:$B$28,2,FALSE)<=VLOOKUP(AK42,Lookups!$A$27:$B$28,2,FALSE),VLOOKUP(AL42,Lookups!$A$27:$B$28,2,FALSE)>=0.8*VLOOKUP(AK42,Lookups!$A$27:$B$28,2,FALSE)),$I$10,IF(VLOOKUP(AL42,Lookups!$A$27:$B$28,2,FALSE)>VLOOKUP(AK42,Lookups!$A$27:$B$28,2,FALSE),$I$11,\"\")))))","v":0},null,"Integrated","Discreet",null,{"$f":"IF(AQ42=\"\",$I$7,IF(VLOOKUP(AQ42,Lookups!$A$27:$B$28,2,FALSE)<VLOOKUP(AO42,Lookups!$A$27:$B$28,2,FALSE),$I$8,IF(AND(VLOOKUP(AQ42,Lookups!$A$27:$B$28,2,FALSE)>=VLOOKUP(AO42,Lookups!$A$27:$B$28,2,FALSE),VLOOKUP(AQ42,Lookups!$A$27:$B$28,2,FALSE)<0.8*VLOOKUP(AP42,Lookups!$A$27:$B$28,2,FALSE)),$I$9,IF(AND(VLOOKUP(AQ42,Lookups!$A$27:$B$28,2,FALSE)<=VLOOKUP(AP42,Lookups!$A$27:$B$28,2,FALSE),VLOOKUP(AQ42,Lookups!$A$27:$B$28,2,FALSE)>=0.8*VLOOKUP(AP42,Lookups!$A$27:$B$28,2,FALSE)),$I$10,IF(VLOOKUP(AQ42,Lookups!$A$27:$B$28,2,FALSE)>VLOOKUP(AP42,Lookups!$A$27:$B$28,2,FALSE),$I$11,\"\")))))","v":0},null,"Discreet","Discreet",null,{"$f":"IF(AV42=\"\",$I$7,IF(VLOOKUP(AV42,Lookups!$A$27:$B$28,2,FALSE)<VLOOKUP(AT42,Lookups!$A$27:$B$28,2,FALSE),$I$8,IF(AND(VLOOKUP(AV42,Lookups!$A$27:$B$28,2,FALSE)>=VLOOKUP(AT42,Lookups!$A$27:$B$28,2,FALSE),VLOOKUP(AV42,Lookups!$A$27:$B$28,2,FALSE)<0.8*VLOOKUP(AU42,Lookups!$A$27:$B$28,2,FALSE)),$I$9,IF(AND(VLOOKUP(AV42,Lookups!$A$27:$B$28,2,FALSE)<=VLOOKUP(AU42,Lookups!$A$27:$B$28,2,FALSE),VLOOKUP(AV42,Lookups!$A$27:$B$28,2,FALSE)>=0.8*VLOOKUP(AU42,Lookups!$A$27:$B$28,2,FALSE)),$I$10,IF(VLOOKUP(AV42,Lookups!$A$27:$B$28,2,FALSE)>VLOOKUP(AU42,Lookups!$A$27:$B$28,2,FALSE),$I$11,\"\")))))","v":0}]
[{"$f":"SUM(D43:D54)","v":{"v":0.13,"d":"13%"}},"Display Screen/Panel","Size (Diagonal measurement in inches)",{"v":0.02,"d":"2.0%"},null,12,13,null,{"$f":"IF(H43=\"\",$I$7,IF(H43<F43,$I$8,IF(AND(H43>=F43,H43<G43),$I$9,IF(AND(H43<=G43,H43>=G43),$I$10,IF(H43>G43,$I$11,\"\")))))","v":0},null,14,15,null,{"$f":"IF(M43=\"\",$I$7,IF(M43<K43,$I$8,IF(AND(M43>=K43,M43<L43),$I$9,IF(AND(M43<=L43,M43>=L43),$I$10,IF(M43>L43,$I$11,\"\")))))","v":0},null,15,15,null,{"$f":"IF(R43=\"\",$I$7,IF(R43<P43,$I$8,IF(AND(R43>=P43,R43<Q43),$I$9,IF(AND(R43<=Q43,R43>=Q43),$I$10,IF(R43>Q43,$I$11,\"\")))))","v":0},null,15,15,null,{"$f":"IF(W43=\"\",$I$7,IF(W43<U43,$I$8,IF(AND(W43>=U43,W43<V43),$I$9,IF(AND(W43<=V43,W43>=V43),$I$10,IF(W43>V43,$I$11,\"\")))))","v":0},null,17,17,null,{"$f":"IF(AB43=\"\",$I$7,IF(AB43<Z43,$I$8,IF(AND(AB43>=Z43,AB43<AA43),$I$9,IF(AND(AB43<=AA43,AB43>=AA43),$I$10,IF(AB43>AA43,$I$11,\"\")))))","v":0},null,{"$f":"SUM(AH43:AH54)","v":{"v":0.13,"d":"13%"}},"Display Screen/Panel","Size (Diagonal measurement in inches)",{"v":0.02,"d":"2.0%"},null,22,24,null,{"$f":"IF(AL43=\"\",$I$7,IF(AL43<AJ43,$I$8,IF(AND(AL43>=AJ43,AL43<AK43),$I$9,IF(AND(AL43<=AK43,AL43>=AK43),$I$10,IF(AL43>AK43,$I$11,\"\")))))","v":0},null,24,27,null,{"$f":"IF(AQ43=\"\",$I$7,IF(AQ43<AO43,$I$8,IF(AND(AQ43>=AO43,AQ43<AP43),$I$9,IF(AND(AQ43<=AP43,AQ43>=AP43),$I$10,IF(AQ43>AP43,$I$11,\"\")))))","v":0},null,27,32,null,{"$f":"IF(AV43=\"\",$I$7,IF(AV43<AT43,$I$8,IF(AND(AV43>=AT43,AV43<AU43),$I$9,IF(AND(AV43<=AU43,AV43>=AU43),$I$10,IF(AV43>AU43,$I$11,\"\")))))","v":0}]
[null,null,"Maximum Horizontal Resolution",{"v":0.02,"d":"2.0%"},null,1920,1920,null,{"$f":"IF(H44=\"\",$I$7,IF(H44<F44,$I$8,IF(AND(H44>=F44,H44<0.9*G44),$I$9,IF(AND(H44<=G44,H44>=0.9*G44),$I$10,IF(H44>G44,$I$11,\"\")))))","v":0},null,1920,1920,null,{"$f":"IF(M44=\"\",$I$7,IF(M44<K44,$I$8,IF(AND(M44>=K44,M44<0.9*L44),$I$9,IF(AND(M44<=L44,M44>=0.9*L44),$I$10,IF(M44>L44,$I$11,\"\")))))","v":0},null,1920,3840,null,{"$f":"IF(R44=\"\",$I$7,IF(R44<P44,$I$8,IF(AND(R44>=P44,R44<0.9*Q44),$I$9,IF(AND(R44<=Q44,R44>=0.9*Q44),$I$10,IF(R44>Q44,$I$11,\"\")))))","v":0},null,1920,3840,null,{"$f":"IF(W44=\"\",$I$7,IF(W44<U44,$I$8,IF(AND(W44>=U44,W44<0.9*V44),$I$9,IF(AND(W44<=V44,W44>=0.9*V44),$I$10,IF(W44>V44,$I$11,\"\")))))","v":0},null,1920,3840,null,{"$f":"IF(AB44=\"\",$I$7,IF(AB44<Z44,$I$8,IF(AND(AB44>=Z44,AB44<0.9*AA44),$I$9,IF(AND(AB44<=AA44,AB44>=0.9*AA44),$I$10,IF(AB44>AA44,$I$11,\"\")))))","v":0},{"$nulls":3},"Maximum Horizontal Resolution",{"v":0.02,"d":"2.0%"},null,1920,1920,null,{"$f":"IF(AL44=\"\",$I$7,IF(AL44<AJ44,$I$8,IF(AND(AL44>=AJ44,AL44<0.9*AK44),$I$9,IF(AND(AL44<=AK44,AL44>=0.9*AK44),$I$10,IF(AL44>AK44,$I$11,\"\")))))","v":0},null,1920,2560,null,{"$f":"IF(AQ44=\"\",$I$7,IF(AQ44<AO44,$I$8,IF(AND(AQ44>=AO44,AQ44<0.9*AP44),$I$9,IF(AND(AQ44<=AP44,AQ44>=0.9*AP44),$I$10,IF(AQ44>AP44,$I$11,\"\")))))","v":0},null,2560,3840,null,{"$f":"IF(AV44=\"\",$I$7,IF(AV44<AT44,$I$8,IF(AND(AV44>=AT44,AV44<0.9*AU44),$I$9,IF(AND(AV44<=AU44,AV44>=0.9*AU44),$I$10,IF(AV44>AU44,$I$11,\"\")))))","v":0}]
[null,null,"Maximum Vertical Resolution",null,null,{"$f":"IF(F44=\"\",\"\",VLOOKUP(F44,Lookups!$B$3:$C$7,2))","v":1080},{"$f":"IF(G44=\"\",\"\",VLOOKUP(G44,Lookups!$B$3:$C$7,2))","v":1080},{"$f":"IF(H44=\"\",\"\",VLOOKUP(H44,Lookups!$B$3:$C$7,2))","v":""},null,null,{"$f":"IF(K44=\"\",\"\",VLOOKUP(K44,Lookups!$B$3:$C$7,2))","v":1080},{"$f":"IF(L44=\"\",\"\",VLOOKUP(L44,Lookups!$B$3:$C$7,2))","v":1080},{"$f":"IF(M44=\"\",\"\",VLOOKUP(M44,Lookups!$B$3:$C$7,2))","v":""},null,null,{"$f":"IF(P44=\"\",\"\",VLOOKUP(P44,Lookups!$B$3:$C$7,2))","v":1080},{"$f":"IF(Q44=\"\",\"\",VLOOKUP(Q44,Lookups!$B$3:$C$7,2))","v":2160},{"$f":"IF(R44=\"\",\"\",VLOOKUP(R44,Lookups!$B$3:$C$7,2))","v":""},null,null,{"$f":"IF(U44=\"\",\"\",VLOOKUP(U44,Lookups!$B$3:$C$7,2))","v":1080},{"$f":"IF(V44=\"\",\"\",VLOOKUP(V44,Lookups!$B$3:$C$7,2))","v":2160},{"$f":"IF(W44=\"\",\"\",VLOOKUP(W44,Lookups!$B$3:$C$7,2))","v":""},null,null,{"$f":"IF(Z44=\"\",\"\",VLOOKUP(Z44,Lookups!$B$3:$C$7,2))","v":1080},{"$f":"IF(AA44=\"\",\"\",VLOOKUP(AA44,Lookups!$B$3:$C$7,2))","v":2160},{"$f":"IF(AB44=\"\",\"\",VLOOKUP(AB44,Lookups!$B$3:$C$7,2))","v":""},{"$nulls":4},"Maximum Vertical Resolution",null,null,{"$f":"IF(AJ44=\"\",\"\",VLOOKUP(AJ44,Lookups!$B$3:$C$7,2))","v":1080},{"$f":"IF(AK44=\"\",\"\",VLOOKUP(AK44,Lookups!$B$3:$C$7,2))","v":1080},{"$f":"IF(AL44=\"\",\"\",VLOOKUP(AL44,Lookups!$B$3:$C$7,2))","v":""},null,null,{"$f":"IF(AO44=\"\",\"\",VLOOKUP(AO44,Lookups!$B$3:$C$7,2))","v":1080},{"$f":"IF(AP44=\"\",\"\",VLOOKUP(AP44,Lookups!$B$3:$C$7,2))","v":1440},{"$f":"IF(AQ44=\"\",\"\",VLOOKUP(AQ44,Lookups!$B$3:$C$7,2))","v":""},null,null,{"$f":"IF(AT44=\"\",\"\",VLOOKUP(AT44,Lookups!$B$3:$C$7,2))","v":1440},{"$f":"IF(AU44=\"\",\"\",VLOOKUP(AU44,Lookups!$B$3:$C$7,2))","v":2160},{"$f":"IF(AV44=\"\",\"\",VLOOKUP(AV44,Lookups!$B$3:$C$7,2))","v":""}]
[null,null,"Maximum Refresh Rate at Maximum Resolution (Hz)",{"v":0.01,"d":"1.0%"},null,60,75,null,{"$f":"IF(H46=\"\",$I$7,IF(H46<F46,$I$8,IF(AND(H46>=F46,H46<0.9*G46),$I$9,IF(AND(H46<=G46,H46>=0.9*G46),$I$10,IF(H46>G46,$I$11,\"\")))))","v":0},null,60,75,null,{"$f":"IF(M46=\"\",$I$7,IF(M46<K46,$I$8,IF(AND(M46>=K46,M46<0.9*L46),$I$9,IF(AND(M46<=L46,M46>=0.9*L46),$I$10,IF(M46>L46,$I$11,\"\")))))","v":0},null,60,75,null,{"$f":"IF(R46=\"\",$I$7,IF(R46<P46,$I$8,IF(AND(R46>=P46,R46<0.9*Q46),$I$9,IF(AND(R46<=Q46,R46>=0.9*Q46),$I$10,IF(R46>Q46,$I$11,\"\")))))","v":0},null,60,100,null,{"$f":"IF(W46=\"\",$I$7,IF(W46<U46,$I$8,IF(AND(W46>=U46,W46<0.9*V46),$I$9,IF(AND(W46<=V46,W46>=0.9*V46),$I$10,IF(W46>V46,$I$11,\"\")))))","v":0},null,60,100,null,{"$f":"IF(AB46=\"\",$I$7,IF(AB46<Z46,$I$8,IF(AND(AB46>=Z46,AB46<0.9*AA46),$I$9,IF(AND(AB46<=AA46,AB46>=0.9*AA46),$I$10,IF(AB46>AA46,$I$11,\"\")))))","v":0},{"$nulls":3},"Maximum Refresh Rate at Maximum Resolution (Hz)",{"v":0.01,"d":"1.0%"},null,60,75,null,{"$f":"IF(AL46=\"\",$I$7,IF(AL46<AJ46,$I$8,IF(AND(AL46>=AJ46,AL46<0.9*AK46),$I$9,IF(AND(AL46<=AK46,AL46>=0.9*AK46),$I$10,IF(AL46>AK46,$I$11,\"\")))))","v":0},null,60,75,null,{"$f":"IF(AQ46=\"\",$I$7,IF(AQ46<AO46,$I$8,IF(AND(AQ46>=AO46,AQ46<0.9*AP46),$I$9,IF(AND(AQ46<=AP46,AQ46>=0.9*AP46),$I$10,IF(AQ46>AP46,$I$11,\"\")))))","v":0},null,75,100,null,{"$f":"IF(AV46=\"\",$I$7,IF(AV46<AT46,$I$8,IF(AND(AV46>=AT46,AV46<0.9*AU46),$I$9,IF(AND(AV46<=AU46,AV46>=0.9*AU46),$I$10,IF(AV46>AU46,$I$11,\"\")))))","v":0}]
[null,null,"Maximum Brightness (Nits)",{"v":0.01,"d":"1.0%"},null,250,350,null,{"$f":"IF(H47=\"\",$I$7,IF(H47<F47,$I$8,IF(AND(H47>=F47,H47<0.9*G47),$I$9,IF(AND(H47<=G47,H47>=0.9*G47),$I$10,IF(H47>G47,$I$11,\"\")))))","v":0},null,250,350,null,{"$f":"IF(M47=\"\",$I$7,IF(M47<K47,$I$8,IF(AND(M47>=K47,M47<0.9*L47),$I$9,IF(AND(M47<=L47,M47>=0.9*L47),$I$10,IF(M47>L47,$I$11,\"\")))))","v":0},null,250,350,null,{"$f":"IF(R47=\"\",$I$7,IF(R47<P47,$I$8,IF(AND(R47>=P47,R47<0.9*Q47),$I$9,IF(AND(R47<=Q47,R47>=0.9*Q47),$I$10,IF(R47>Q47,$I$11,\"\")))))","v":0},null,250,350,null,{"$f":"IF(W47=\"\",$I$7,IF(W47<U47,$I$8,IF(AND(W47>=U47,W47<0.9*V47),$I$9,IF(AND(W47<=V47,W47>=0.9*V47),$I$10,IF(W47>V47,$I$11,\"\")))))","v":0},null,250,350,null,{"$f":"IF(AB47=\"\",$I$7,IF(AB47<Z47,$I$8,IF(AND(AB47>=Z47,AB47<0.9*AA47),$I$9,IF(AND(AB47<=AA47,AB47>=0.9*AA47),$I$10,IF(AB47>AA47,$I$11,\"\")))))","v":0},{"$nulls":3},"Maximum Brightness (Nits)",{"v":0.01,"d":"1.0%"},null,250,350,null,{"$f":"IF(AL47=\"\",$I$7,IF(AL47<AJ47,$I$8,IF(AND(AL47>=AJ47,AL47<0.9*AK47),$I$9,IF(AND(AL47<=AK47,AL47>=0.9*AK47),$I$10,IF(AL47>AK47,$I$11,\"\")))))","v":0},null,250,350,null,{"$f":"IF(AQ47=\"\",$I$7,IF(AQ47<AO47,$I$8,IF(AND(AQ47>=AO47,AQ47<0.9*AP47),$I$9,IF(AND(AQ47<=AP47,AQ47>=0.9*AP47),$I$10,IF(AQ47>AP47,$I$11,\"\")))))","v":0},null,250,350,null,{"$f":"IF(AV47=\"\",$I$7,IF(AV47<AT47,$I$8,IF(AND(AV47>=AT47,AV47<0.9*AU47),$I$9,IF(AND(AV47<=AU47,AV47>=0.9*AU47),$I$10,IF(AV47>AU47,$I$11,\"\")))))","v":0}]
[null,null,"Blue Light Filter",{"v":0.01,"d":"1.0%"},null,"No","Yes",null,{"$f":"IF(H48=\"\",$I$7,IF(VLOOKUP(H48,Lookups!$A$32:$B$33,2,FALSE)<VLOOKUP(F48,Lookups!$A$32:$B$33,2,FALSE),$I$8,IF(AND(VLOOKUP(H48,Lookups!$A$32:$B$33,2,FALSE)>=VLOOKUP(F48,Lookups!$A$32:$B$33,2,FALSE),VLOOKUP(H48,Lookups!$A$32:$B$33,2,FALSE)<0.8*VLOOKUP(G48,Lookups!$A$32:$B$33,2,FALSE)),$I$9,IF(AND(VLOOKUP(H48,Lookups!$A$32:$B$33,2,FALSE)<=VLOOKUP(G48,Lookups!$A$32:$B$33,2,FALSE),VLOOKUP(H48,Lookups!$A$32:$B$33,2,FALSE)>=0.8*VLOOKUP(G48,Lookups!$A$32:$B$33,2,FALSE)),$I$10,IF(VLOOKUP(H48,Lookups!$A$32:$B$33,2,FALSE)>VLOOKUP(G48,Lookups!$A$32:$B$33,2,FALSE),$I$11,\"\")))))","v":0},null,"No","Yes",null,{"$f":"IF(M48=\"\",$I$7,IF(VLOOKUP(M48,Lookups!$A$32:$B$33,2,FALSE)<VLOOKUP(K48,Lookups!$A$32:$B$33,2,FALSE),$I$8,IF(AND(VLOOKUP(M48,Lookups!$A$32:$B$33,2,FALSE)>=VLOOKUP(K48,Lookups!$A$32:$B$33,2,FALSE),VLOOKUP(M48,Lookups!$A$32:$B$33,2,FALSE)<0.8*VLOOKUP(L48,Lookups!$A$32:$B$33,2,FALSE)),$I$9,IF(AND(VLOOKUP(M48,Lookups!$A$32:$B$33,2,FALSE)<=VLOOKUP(L48,Lookups!$A$32:$B$33,2,FALSE),VLOOKUP(M48,Lookups!$A$32:$B$33,2,FALSE)>=0.8*VLOOKUP(L48,Lookups!$A$32:$B$33,2,FALSE)),$I$10,IF(VLOOKUP(M48,Lookups!$A$32:$B$33,2,FALSE)>VLOOKUP(L48,Lookups!$A$32:$B$33,2,FALSE),$I$11,\"\")))))","v":0},null,"No","Yes",null,{"$f":"IF(R48=\"\",$I$7,IF(VLOOKUP(R48,Lookups!$A$32:$B$33,2,FALSE)<VLOOKUP(P48,Lookups!$A$32:$B$33,2,FALSE),$I$8,IF(AND(VLOOKUP(R48,Lookups!$A$32:$B$33,2,FALSE)>=VLOOKUP(P48,Lookups!$A$32:$B$33,2,FALSE),VLOOKUP(R48,Lookups!$A$32:$B$33,2,FALSE)<0.8*VLOOKUP(Q48,Lookups!$A$32:$B$33,2,FALSE)),$I$9,IF(AND(VLOOKUP(R48,Lookups!$A$32:$B$33,2,FALSE)<=VLOOKUP(Q48,Lookups!$A$32:$B$33,2,FALSE),VLOOKUP(R48,Lookups!$A$32:$B$33,2,FALSE)>=0.8*VLOOKUP(Q48,Lookups!$A$32:$B$33,2,FALSE)),$I$10,IF(VLOOKUP(R48,Lookups!$A$32:$B$33,2,FALSE)>VLOOKUP(Q48,Lookups!$A$32:$B$33,2,FALSE),$I$11,\"\")))))","v":0},null,"No","Yes",null,{"$f":"IF(W48=\"\",$I$7,IF(VLOOKUP(W48,Lookups!$A$32:$B$33,2,FALSE)<VLOOKUP(U48,Lookups!$A$32:$B$33,2,FALSE),$I$8,IF(AND(VLOOKUP(W48,Lookups!$A$32:$B$33,2,FALSE)>=VLOOKUP(U48,Lookups!$A$32:$B$33,2,FALSE),VLOOKUP(W48,Lookups!$A$32:$B$33,2,FALSE)<0.8*VLOOKUP(V48,Lookups!$A$32:$B$33,2,FALSE)),$I$9,IF(AND(VLOOKUP(W48,Lookups!$A$32:$B$33,2,FALSE)<=VLOOKUP(V48,Lookups!$A$32:$B$33,2,FALSE),VLOOKUP(W48,Lookups!$A$32:$B$33,2,FALSE)>=0.8*VLOOKUP(V48,Lookups!$A$32:$B$33,2,FALSE)),$I$10,IF(VLOOKUP(W48,Lookups!$A$32:$B$33,2,FALSE)>VLOOKUP(V48,Lookups!$A$32:$B$33,2,FALSE),$I$11,\"\")))))","v":0},null,"No","Yes",null,{"$f":"IF(AB48=\"\",$I$7,IF(VLOOKUP(AB48,Lookups!$A$32:$B$33,2,FALSE)<VLOOKUP(Z48,Lookups!$A$32:$B$33,2,FALSE),$I$8,IF(AND(VLOOKUP(AB48,Lookups!$A$32:$B$33,2,FALSE)>=VLOOKUP(Z48,Lookups!$A$32:$B$33,2,FALSE),VLOOKUP(AB48,Lookups!$A$32:$B$33,2,FALSE)<0.8*VLOOKUP(AA48,Lookups!$A$32:$B$33,2,FALSE)),$I$9,IF(AND(VLOOKUP(AB48,Lookups!$A$32:$B$33,2,FALSE)<=VLOOKUP(AA48,Lookups!$A$32:$B$33,2,FALSE),VLOOKUP(AB48,Lookups!$A$32:$B$33,2,FALSE)>=0.8*VLOOKUP(AA48,Lookups!$A$32:$B$33,2,FALSE)),$I$10,IF(VLOOKUP(AB48,Lookups!$A$32:$B$33,2,FALSE)>VLOOKUP(AA48,Lookups!$A$32:$B$33,2,FALSE),$I$11,\"\")))))","v":0},{"$nulls":3},"Blue Light Filter",{"v":0.01,"d":"1.0%"},null,"No","Yes",null,{"$f":"IF(AL48=\"\",$I$7,IF(VLOOKUP(AL48,Lookups!$A$32:$B$33,2,FALSE)<VLOOKUP(AJ48,Lookups!$A$32:$B$33,2,FALSE),$I$8,IF(AND(VLOOKUP(AL48,Lookups!$A$32:$B$33,2,FALSE)>=VLOOKUP(AJ48,Lookups!$A$32:$B$33,2,FALSE),VLOOKUP(AL48,Lookups!$A$32:$B$33,2,FALSE)<0.8*VLOOKUP(AK48,Lookups!$A$32:$B$33,2,FALSE)),$I$9,IF(AND(VLOOKUP(AL48,Lookups!$A$32:$B$33,2,FALSE)<=VLOOKUP(AK48,Lookups!$A$32:$B$33,2,FALSE),VLOOKUP(AL48,Lookups!$A$32:$B$33,2,FALSE)>=0.8*VLOOKUP(AK48,Lookups!$A$32:$B$33,2,FALSE)),$I$10,IF(VLOOKUP(AL48,Lookups!$A$32:$B$33,2,FALSE)>VLOOKUP(AK48,Lookups!$A$32:$B$33,2,FALSE),$I$11,\"\")))))","v":0},null,"No","Yes",null,{"$f":"IF(AQ48=\"\",$I$7,IF(VLOOKUP(AQ48,Lookups!$A$32:$B$33,2,FALSE)<VLOOKUP(AO48,Lookups!$A$32:$B$33,2,FALSE),$I$8,IF(AND(VLOOKUP(AQ48,Lookups!$A$32:$B$33,2,FALSE)>=VLOOKUP(AO48,Lookups!$A$32:$B$33,2,FALSE),VLOOKUP(AQ48,Lookups!$A$32:$B$33,2,FALSE)<0.8*VLOOKUP(AP48,Lookups!$A$32:$B$33,2,FALSE)),$I$9,IF(AND(VLOOKUP(AQ48,Lookups!$A$32:$B$33,2,FALSE)<=VLOOKUP(AP48,Lookups!$A$32:$B$33,2,FALSE),VLOOKUP(AQ48,Lookups!$A$32:$B$33,2,FALSE)>=0.8*VLOOKUP(AP48,Lookups!$A$32:$B$33,2,FALSE)),$I$10,IF(VLOOKUP(AQ48,Lookups!$A$32:$B$33,2,FALSE)>VLOOKUP(AP48,Lookups!$A$32:$B$33,2,FALSE),$I$11,\"\")))))","v":0},null,"Yes","Yes",null,{"$f":"IF(AV48=\"\",$I$7,IF(VLOOKUP(AV48,Lookups!$A$32:$B$33,2,FALSE)<VLOOKUP(AT48,Lookups!$A$32:$B$33,2,FALSE),$I$8,IF(AND(VLOOKUP(AV48,Lookups!$A$32:$B$33,2,FALSE)>=VLOOKUP(AT48,Lookups!$A$32:$B$33,2,FALSE),VLOOKUP(AV48,Lookups!$A$32:$B$33,2,FALSE)<0.8*VLOOKUP(AU48,Lookups!$A$32:$B$33,2,FALSE)),$I$9,IF(AND(VLOOKUP(AV48,Lookups!$A$32:$B$33,2,FALSE)<=VLOOKUP(AU48,Lookups!$A$32:$B$33,2,FALSE),VLOOKUP(AV48,Lookups!$A$32:$B$33,2,FALSE)>=0.8*VLOOKUP(AU48,Lookups!$A$32:$B$33,2,FALSE)),$I$10,IF(VLOOKUP(AV48,Lookups!$A$32:$B$33,2,FALSE)>VLOOKUP(AU48,Lookups!$A$32:$B$33,2,FALSE),$I$11,\"\")))))","v":0}]
[null,null,"Contrast Ratio",{"v":0.01,"d":"1.0%"},null,"1000:1 to 3000:1","Greater than 3000:1",null,{"$f":"IF(H49=\"\",$I$7,IF(VLOOKUP(H49,Lookups!$A$92:$B$94,2,FALSE)<VLOOKUP(F49,Lookups!$A$92:$B$94,2,FALSE),$I$8,IF(AND(VLOOKUP(H49,Lookups!$A$92:$B$94,2,FALSE)>=VLOOKUP(F49,Lookups!$A$92:$B$94,2,FALSE),VLOOKUP(H49,Lookups!$A$92:$B$94,2,FALSE)<0.8*VLOOKUP(G49,Lookups!$A$92:$B$94,2,FALSE)),$I$9,IF(AND(VLOOKUP(H49,Lookups!$A$92:$B$94,2,FALSE)<=VLOOKUP(G49,Lookups!$A$92:$B$94,2,FALSE),VLOOKUP(H49,Lookups!$A$92:$B$94,2,FALSE)>=0.8*VLOOKUP(G49,Lookups!$A$92:$B$94,2,FALSE)),$I$10,IF(VLOOKUP(H49,Lookups!$A$92:$B$94,2,FALSE)>VLOOKUP(G49,Lookups!$A$92:$B$94,2,FALSE),$I$11,\"\")))))","v":0},null,"1000:1 to 3000:1","Greater than 3000:1",null,{"$f":"IF(M49=\"\",$I$7,IF(VLOOKUP(M49,Lookups!$A$92:$B$94,2,FALSE)<VLOOKUP(K49,Lookups!$A$92:$B$94,2,FALSE),$I$8,IF(AND(VLOOKUP(M49,Lookups!$A$92:$B$94,2,FALSE)>=VLOOKUP(K49,Lookups!$A$92:$B$94,2,FALSE),VLOOKUP(M49,Lookups!$A$92:$B$94,2,FALSE)<0.8*VLOOKUP(L49,Lookups!$A$92:$B$94,2,FALSE)),$I$9,IF(AND(VLOOKUP(M49,Lookups!$A$92:$B$94,2,FALSE)<=VLOOKUP(L49,Lookups!$A$92:$B$94,2,FALSE),VLOOKUP(M49,Lookups!$A$92:$B$94,2,FALSE)>=0.8*VLOOKUP(L49,Lookups!$A$92:$B$94,2,FALSE)),$I$10,IF(VLOOKUP(M49,Lookups!$A$92:$B$94,2,FALSE)>VLOOKUP(L49,Lookups!$A$92:$B$94,2,FALSE),$I$11,\"\")))))","v":0},null,"1000:1 to 3000:1","Greater than 3000:1",null,{"$f":"IF(R49=\"\",$I$7,IF(VLOOKUP(R49,Lookups!$A$92:$B$94,2,FALSE)<VLOOKUP(P49,Lookups!$A$92:$B$94,2,FALSE),$I$8,IF(AND(VLOOKUP(R49,Lookups!$A$92:$B$94,2,FALSE)>=VLOOKUP(P49,Lookups!$A$92:$B$94,2,FALSE),VLOOKUP(R49,Lookups!$A$92:$B$94,2,FALSE)<0.8*VLOOKUP(Q49,Lookups!$A$92:$B$94,2,FALSE)),$I$9,IF(AND(VLOOKUP(R49,Lookups!$A$92:$B$94,2,FALSE)<=VLOOKUP(Q49,Lookups!$A$92:$B$94,2,FALSE),VLOOKUP(R49,Lookups!$A$92:$B$94,2,FALSE)>=0.8*VLOOKUP(Q49,Lookups!$A$92:$B$94,2,FALSE)),$I$10,IF(VLOOKUP(R49,Lookups!$A$92:$B$94,2,FALSE)>VLOOKUP(Q49,Lookups!$A$92:$B$94,2,FALSE),$I$11,\"\")))))","v":0},null,"1000:1 to 3000:1","Greater than 3000:1",null,{"$f":"IF(W49=\"\",$I$7,IF(VLOOKUP(W49,Lookups!$A$92:$B$94,2,FALSE)<VLOOKUP(U49,Lookups!$A$92:$B$94,2,FALSE),$I$8,IF(AND(VLOOKUP(W49,Lookups!$A$92:$B$94,2,FALSE)>=VLOOKUP(U49,Lookups!$A$92:$B$94,2,FALSE),VLOOKUP(W49,Lookups!$A$92:$B$94,2,FALSE)<0.8*VLOOKUP(V49,Lookups!$A$92:$B$94,2,FALSE)),$I$9,IF(AND(VLOOKUP(W49,Lookups!$A$92:$B$94,2,FALSE)<=VLOOKUP(V49,Lookups!$A$92:$B$94,2,FALSE),VLOOKUP(W49,Lookups!$A$92:$B$94,2,FALSE)>=0.8*VLOOKUP(V49,Lookups!$A$92:$B$94,2,FALSE)),$I$10,IF(VLOOKUP(W49,Lookups!$A$92:$B$94,2,FALSE)>VLOOKUP(V49,Lookups!$A$92:$B$94,2,FALSE),$I$11,\"\")))))","v":0},null,"1000:1 to 3000:1","Greater than 3000:1",null,{"$f":"IF(AB49=\"\",$I$7,IF(VLOOKUP(AB49,Lookups!$A$92:$B$94,2,FALSE)<VLOOKUP(Z49,Lookups!$A$92:$B$94,2,FALSE),$I$8,IF(AND(VLOOKUP(AB49,Lookups!$A$92:$B$94,2,FALSE)>=VLOOKUP(Z49,Lookups!$A$92:$B$94,2,FALSE),VLOOKUP(AB49,Lookups!$A$92:$B$94,2,FALSE)<0.8*VLOOKUP(AA49,Lookups!$A$92:$B$94,2,FALSE)),$I$9,IF(AND(VLOOKUP(AB49,Lookups!$A$92:$B$94,2,FALSE)<=VLOOKUP(AA49,Lookups!$A$92:$B$94,2,FALSE),VLOOKUP(AB49,Lookups!$A$92:$B$94,2,FALSE)>=0.8*VLOOKUP(AA49,Lookups!$A$92:$B$94,2,FALSE)),$I$10,IF(VLOOKUP(AB49,Lookups!$A$92:$B$94,2,FALSE)>VLOOKUP(AA49,Lookups!$A$92:$B$94,2,FALSE),$I$11,\"\")))))","v":0},{"$nulls":3},"Contrast Ratio",{"v":0.01,"d":"1.0%"},null,"1000:1 to 3000:1","Greater than 3000:1",null,{"$f":"IF(AL49=\"\",$I$7,IF(VLOOKUP(AL49,Lookups!$A$92:$B$94,2,FALSE)<VLOOKUP(AJ49,Lookups!$A$92:$B$94,2,FALSE),$I$8,IF(AND(VLOOKUP(AL49,Lookups!$A$92:$B$94,2,FALSE)>=VLOOKUP(AJ49,Lookups!$A$92:$B$94,2,FALSE),VLOOKUP(AL49,Lookups!$A$92:$B$94,2,FALSE)<0.8*VLOOKUP(AK49,Lookups!$A$92:$B$94,2,FALSE)),$I$9,IF(AND(VLOOKUP(AL49,Lookups!$A$92:$B$94,2,FALSE)<=VLOOKUP(AK49,Lookups!$A$92:$B$94,2,FALSE),VLOOKUP(AL49,Lookups!$A$92:$B$94,2,FALSE)>=0.8*VLOOKUP(AK49,Lookups!$A$92:$B$94,2,FALSE)),$I$10,IF(VLOOKUP(AL49,Lookups!$A$92:$B$94,2,FALSE)>VLOOKUP(AK49,Lookups!$A$92:$B$94,2,FALSE),$I$11,\"\")))))","v":0},null,"1000:1 to 3000:1","Greater than 3000:1",null,{"$f":"IF(AQ49=\"\",$I$7,IF(VLOOKUP(AQ49,Lookups!$A$92:$B$94,2,FALSE)<VLOOKUP(AO49,Lookups!$A$92:$B$94,2,FALSE),$I$8,IF(AND(VLOOKUP(AQ49,Lookups!$A$92:$B$94,2,FALSE)>=VLOOKUP(AO49,Lookups!$A$92:$B$94,2,FALSE),VLOOKUP(AQ49,Lookups!$A$92:$B$94,2,FALSE)<0.8*VLOOKUP(AP49,Lookups!$A$92:$B$94,2,FALSE)),$I$9,IF(AND(VLOOKUP(AQ49,Lookups!$A$92:$B$94,2,FALSE)<=VLOOKUP(AP49,Lookups!$A$92:$B$94,2,FALSE),VLOOKUP(AQ49,Lookups!$A$92:$B$94,2,FALSE)>=0.8*VLOOKUP(AP49,Lookups!$A$92:$B$94,2,FALSE)),$I$10,IF(VLOOKUP(AQ49,Lookups!$A$92:$B$94,2,FALSE)>VLOOKUP(AP49,Lookups!$A$92:$B$94,2,FALSE),$I$11,\"\")))))","v":0},null,"1000:1 to 3000:1","Greater than 3000:1",null,{"$f":"IF(AV49=\"\",$I$7,IF(VLOOKUP(AV49,Lookups!$A$92:$B$94,2,FALSE)<VLOOKUP(AT49,Lookups!$A$92:$B$94,2,FALSE),$I$8,IF(AND(VLOOKUP(AV49,Lookups!$A$92:$B$94,2,FALSE)>=VLOOKUP(AT49,Lookups!$A$92:$B$94,2,FALSE),VLOOKUP(AV49,Lookups!$A$92:$B$94,2,FALSE)<0.8*VLOOKUP(AU49,Lookups!$A$92:$B$94,2,FALSE)),$I$9,IF(AND(VLOOKUP(AV49,Lookups!$A$92:$B$94,2,FALSE)<=VLOOKUP(AU49,Lookups!$A$92:$B$94,2,FALSE),VLOOKUP(AV49,Lookups!$A$92:$B$94,2,FALSE)>=0.8*VLOOKUP(AU49,Lookups!$A$92:$B$94,2,FALSE)),$I$10,IF(VLOOKUP(AV49,Lookups!$A$92:$B$94,2,FALSE)>VLOOKUP(AU49,Lookups!$A$92:$B$94,2,FALSE),$I$11,\"\")))))","v":0}]
[null,null,"Dynamic Range",{"v":0.01,"d":"1.0%"},null,"SDR","HDR",null,{"$f":"IF(H50=\"\",$I$7,IF(VLOOKUP(H50,Lookups!$A$97:$B$98,2,FALSE)<VLOOKUP(F50,Lookups!$A$97:$B$98,2,FALSE),$I$8,IF(AND(VLOOKUP(H50,Lookups!$A$97:$B$98,2,FALSE)>=VLOOKUP(F50,Lookups!$A$97:$B$98,2,FALSE),VLOOKUP(H50,Lookups!$A$97:$B$98,2,FALSE)<0.8*VLOOKUP(G50,Lookups!$A$97:$B$98,2,FALSE)),$I$9,IF(AND(VLOOKUP(H50,Lookups!$A$97:$B$98,2,FALSE)<=VLOOKUP(G50,Lookups!$A$97:$B$98,2,FALSE),VLOOKUP(H50,Lookups!$A$97:$B$98,2,FALSE)>=0.8*VLOOKUP(G50,Lookups!$A$97:$B$98,2,FALSE)),$I$10,IF(VLOOKUP(H50,Lookups!$A$97:$B$98,2,FALSE)>VLOOKUP(G50,Lookups!$A$97:$B$98,2,FALSE),$I$11,\"\")))))","v":0},null,"SDR","HDR",null,{"$f":"IF(M50=\"\",$I$7,IF(VLOOKUP(M50,Lookups!$A$97:$B$98,2,FALSE)<VLOOKUP(K50,Lookups!$A$97:$B$98,2,FALSE),$I$8,IF(AND(VLOOKUP(M50,Lookups!$A$97:$B$98,2,FALSE)>=VLOOKUP(K50,Lookups!$A$97:$B$98,2,FALSE),VLOOKUP(M50,Lookups!$A$97:$B$98,2,FALSE)<0.8*VLOOKUP(L50,Lookups!$A$97:$B$98,2,FALSE)),$I$9,IF(AND(VLOOKUP(M50,Lookups!$A$97:$B$98,2,FALSE)<=VLOOKUP(L50,Lookups!$A$97:$B$98,2,FALSE),VLOOKUP(M50,Lookups!$A$97:$B$98,2,FALSE)>=0.8*VLOOKUP(L50,Lookups!$A$97:$B$98,2,FALSE)),$I$10,IF(VLOOKUP(M50,Lookups!$A$97:$B$98,2,FALSE)>VLOOKUP(L50,Lookups!$A$97:$B$98,2,FALSE),$I$11,\"\")))))","v":0},null,"SDR","HDR",null,{"$f":"IF(R50=\"\",$I$7,IF(VLOOKUP(R50,Lookups!$A$97:$B$98,2,FALSE)<VLOOKUP(P50,Lookups!$A$97:$B$98,2,FALSE),$I$8,IF(AND(VLOOKUP(R50,Lookups!$A$97:$B$98,2,FALSE)>=VLOOKUP(P50,Lookups!$A$97:$B$98,2,FALSE),VLOOKUP(R50,Lookups!$A$97:$B$98,2,FALSE)<0.8*VLOOKUP(Q50,Lookups!$A$97:$B$98,2,FALSE)),$I$9,IF(AND(VLOOKUP(R50,Lookups!$A$97:$B$98,2,FALSE)<=VLOOKUP(Q50,Lookups!$A$97:$B$98,2,FALSE),VLOOKUP(R50,Lookups!$A$97:$B$98,2,FALSE)>=0.8*VLOOKUP(Q50,Lookups!$A$97:$B$98,2,FALSE)),$I$10,IF(VLOOKUP(R50,Lookups!$A$97:$B$98,2,FALSE)>VLOOKUP(Q50,Lookups!$A$97:$B$98,2,FALSE),$I$11,\"\")))))","v":0},null,"SDR","HDR",null,{"$f":"IF(W50=\"\",$I$7,IF(VLOOKUP(W50,Lookups!$A$97:$B$98,2,FALSE)<VLOOKUP(U50,Lookups!$A$97:$B$98,2,FALSE),$I$8,IF(AND(VLOOKUP(W50,Lookups!$A$97:$B$98,2,FALSE)>=VLOOKUP(U50,Lookups!$A$97:$B$98,2,FALSE),VLOOKUP(W50,Lookups!$A$97:$B$98,2,FALSE)<0.8*VLOOKUP(V50,Lookups!$A$97:$B$98,2,FALSE)),$I$9,IF(AND(VLOOKUP(W50,Lookups!$A$97:$B$98,2,FALSE)<=VLOOKUP(V50,Lookups!$A$97:$B$98,2,FALSE),VLOOKUP(W50,Lookups!$A$97:$B$98,2,FALSE)>=0.8*VLOOKUP(V50,Lookups!$A$97:$B$98,2,FALSE)),$I$10,IF(VLOOKUP(W50,Lookups!$A$97:$B$98,2,FALSE)>VLOOKUP(V50,Lookups!$A$97:$B$98,2,FALSE),$I$11,\"\")))))","v":0},null,"SDR","HDR",null,{"$f":"IF(AB50=\"\",$I$7,IF(VLOOKUP(AB50,Lookups!$A$97:$B$98,2,FALSE)<VLOOKUP(Z50,Lookups!$A$97:$B$98,2,FALSE),$I$8,IF(AND(VLOOKUP(AB50,Lookups!$A$97:$B$98,2,FALSE)>=VLOOKUP(Z50,Lookups!$A$97:$B$98,2,FALSE),VLOOKUP(AB50,Lookups!$A$97:$B$98,2,FALSE)<0.8*VLOOKUP(AA50,Lookups!$A$97:$B$98,2,FALSE)),$I$9,IF(AND(VLOOKUP(AB50,Lookups!$A$97:$B$98,2,FALSE)<=VLOOKUP(AA50,Lookups!$A$97:$B$98,2,FALSE),VLOOKUP(AB50,Lookups!$A$97:$B$98,2,FALSE)>=0.8*VLOOKUP(AA50,Lookups!$A$97:$B$98,2,FALSE)),$I$10,IF(VLOOKUP(AB50,Lookups!$A$97:$B$98,2,FALSE)>VLOOKUP(AA50,Lookups!$A$97:$B$98,2,FALSE),$I$11,\"\")))))","v":0},{"$nulls":3},"Dynamic Range",{"v":0.01,"d":"1.0%"},null,"SDR","HDR",null,{"$f":"IF(AL50=\"\",$I$7,IF(VLOOKUP(AL50,Lookups!$A$97:$B$98,2,FALSE)<VLOOKUP(AJ50,Lookups!$A$97:$B$98,2,FALSE),$I$8,IF(AND(VLOOKUP(AL50,Lookups!$A$97:$B$98,2,FALSE)>=VLOOKUP(AJ50,Lookups!$A$97:$B$98,2,FALSE),VLOOKUP(AL50,Lookups!$A$97:$B$98,2,FALSE)<0.8*VLOOKUP(AK50,Lookups!$A$97:$B$98,2,FALSE)),$I$9,IF(AND(VLOOKUP(AL50,Lookups!$A$97:$B$98,2,FALSE)<=VLOOKUP(AK50,Lookups!$A$97:$B$98,2,FALSE),VLOOKUP(AL50,Lookups!$A$97:$B$98,2,FALSE)>=0.8*VLOOKUP(AK50,Lookups!$A$97:$B$98,2,FALSE)),$I$10,IF(VLOOKUP(AL50,Lookups!$A$97:$B$98,2,FALSE)>VLOOKUP(AK50,Lookups!$A$97:$B$98,2,FALSE),$I$11,\"\")))))","v":0},null,"SDR","HDR",null,{"$f":"IF(AQ50=\"\",$I$7,IF(VLOOKUP(AQ50,Lookups!$A$97:$B$98,2,FALSE)<VLOOKUP(AO50,Lookups!$A$97:$B$98,2,FALSE),$I$8,IF(AND(VLOOKUP(AQ50,Lookups!$A$97:$B$98,2,FALSE)>=VLOOKUP(AO50,Lookups!$A$97:$B$98,2,FALSE),VLOOKUP(AQ50,Lookups!$A$97:$B$98,2,FALSE)<0.8*VLOOKUP(AP50,Lookups!$A$97:$B$98,2,FALSE)),$I$9,IF(AND(VLOOKUP(AQ50,Lookups!$A$97:$B$98,2,FALSE)<=VLOOKUP(AP50,Lookups!$A$97:$B$98,2,FALSE),VLOOKUP(AQ50,Lookups!$A$97:$B$98,2,FALSE)>=0.8*VLOOKUP(AP50,Lookups!$A$97:$B$98,2,FALSE)),$I$10,IF(VLOOKUP(AQ50,Lookups!$A$97:$B$98,2,FALSE)>VLOOKUP(AP50,Lookups!$A$97:$B$98,2,FALSE),$I$11,\"\")))))","v":0},null,"HDR","HDR",null,{"$f":"IF(AV50=\"\",$I$7,IF(VLOOKUP(AV50,Lookups!$A$97:$B$98,2,FALSE)<VLOOKUP(AT50,Lookups!$A$97:$B$98,2,FALSE),$I$8,IF(AND(VLOOKUP(AV50,Lookups!$A$97:$B$98,2,FALSE)>=VLOOKUP(AT50,Lookups!$A$97:$B$98,2,FALSE),VLOOKUP(AV50,Lookups!$A$97:$B$98,2,FALSE)<0.8*VLOOKUP(AU50,Lookups!$A$97:$B$98,2,FALSE)),$I$9,IF(AND(VLOOKUP(AV50,Lookups!$A$97:$B$98,2,FALSE)<=VLOOKUP(AU50,Lookups!$A$97:$B$98,2,FALSE),VLOOKUP(AV50,Lookups!$A$97:$B$98,2,FALSE)>=0.8*VLOOKUP(AU50,Lookups!$A$97:$B$98,2,FALSE)),$I$10,IF(VLOOKUP(AV50,Lookups!$A$97:$B$98,2,FALSE)>VLOOKUP(AU50,Lookups!$A$97:$B$98,2,FALSE),$I$11,\"\")))))","v":0}]
[null,null,"Display Screen/Panel Technology",{"v":0.02,"d":"2.0%"},null,"VA LCD","IPS LCD",null,{"$f":"IF(H51=\"\",$I$7,IF(VLOOKUP(H51,Lookups!$A$86:$B$89,2,FALSE)<VLOOKUP(F51,Lookups!$A$86:$B$89,2,FALSE),$I$8,IF(AND(VLOOKUP(H51,Lookups!$A$86:$B$89,2,FALSE)>=VLOOKUP(F51,Lookups!$A$86:$B$89,2,FALSE),VLOOKUP(H51,Lookups!$A$86:$B$89,2,FALSE)<0.8*VLOOKUP(G51,Lookups!$A$86:$B$89,2,FALSE)),$I$9,IF(AND(VLOOKUP(H51,Lookups!$A$86:$B$89,2,FALSE)<=VLOOKUP(G51,Lookups!$A$86:$B$89,2,FALSE),VLOOKUP(H51,Lookups!$A$86:$B$89,2,FALSE)>=0.8*VLOOKUP(G51,Lookups!$A$86:$B$89,2,FALSE)),$I$10,IF(VLOOKUP(H51,Lookups!$A$86:$B$89,2,FALSE)>VLOOKUP(G51,Lookups!$A$86:$B$89,2,FALSE),$I$11,\"\")))))","v":0},null,"VA LCD","IPS LCD",null,{"$f":"IF(M51=\"\",$I$7,IF(VLOOKUP(M51,Lookups!$A$86:$B$89,2,FALSE)<VLOOKUP(K51,Lookups!$A$86:$B$89,2,FALSE),$I$8,IF(AND(VLOOKUP(M51,Lookups!$A$86:$B$89,2,FALSE)>=VLOOKUP(K51,Lookups!$A$86:$B$89,2,FALSE),VLOOKUP(M51,Lookups!$A$86:$B$89,2,FALSE)<0.8*VLOOKUP(L51,Lookups!$A$86:$B$89,2,FALSE)),$I$9,IF(AND(VLOOKUP(M51,Lookups!$A$86:$B$89,2,FALSE)<=VLOOKUP(L51,Lookups!$A$86:$B$89,2,FALSE),VLOOKUP(M51,Lookups!$A$86:$B$89,2,FALSE)>=0.8*VLOOKUP(L51,Lookups!$A$86:$B$89,2,FALSE)),$I$10,IF(VLOOKUP(M51,Lookups!$A$86:$B$89,2,FALSE)>VLOOKUP(L51,Lookups!$A$86:$B$89,2,FALSE),$I$11,\"\")))))","v":0},null,"VA LCD","IPS LCD",null,{"$f":"IF(R51=\"\",$I$7,IF(VLOOKUP(R51,Lookups!$A$86:$B$89,2,FALSE)<VLOOKUP(P51,Lookups!$A$86:$B$89,2,FALSE),$I$8,IF(AND(VLOOKUP(R51,Lookups!$A$86:$B$89,2,FALSE)>=VLOOKUP(P51,Lookups!$A$86:$B$89,2,FALSE),VLOOKUP(R51,Lookups!$A$86:$B$89,2,FALSE)<0.8*VLOOKUP(Q51,Lookups!$A$86:$B$89,2,FALSE)),$I$9,IF(AND(VLOOKUP(R51,Lookups!$A$86:$B$89,2,FALSE)<=VLOOKUP(Q51,Lookups!$A$86:$B$89,2,FALSE),VLOOKUP(R51,Lookups!$A$86:$B$89,2,FALSE)>=0.8*VLOOKUP(Q51,Lookups!$A$86:$B$89,2,FALSE)),$I$10,IF(VLOOKUP(R51,Lookups!$A$86:$B$89,2,FALSE)>VLOOKUP(Q51,Lookups!$A$86:$B$89,2,FALSE),$I$11,\"\")))))","v":0},null,"VA LCD","IPS LCD",null,{"$f":"IF(W51=\"\",$I$7,IF(VLOOKUP(W51,Lookups!$A$86:$B$89,2,FALSE)<VLOOKUP(U51,Lookups!$A$86:$B$89,2,FALSE),$I$8,IF(AND(VLOOKUP(W51,Lookups!$A$86:$B$89,2,FALSE)>=VLOOKUP(U51,Lookups!$A$86:$B$89,2,FALSE),VLOOKUP(W51,Lookups!$A$86:$B$89,2,FALSE)<0.8*VLOOKUP(V51,Lookups!$A$86:$B$89,2,FALSE)),$I$9,IF(AND(VLOOKUP(W51,Lookups!$A$86:$B$89,2,FALSE)<=VLOOKUP(V51,Lookups!$A$86:$B$89,2,FALSE),VLOOKUP(W51,Lookups!$A$86:$B$89,2,FALSE)>=0.8*VLOOKUP(V51,Lookups!$A$86:$B$89,2,FALSE)),$I$10,IF(VLOOKUP(W51,Lookups!$A$86:$B$89,2,FALSE)>VLOOKUP(V51,Lookups!$A$86:$B$89,2,FALSE),$I$11,\"\")))))","v":0},null,"VA LCD","IPS LCD",null,{"$f":"IF(AB51=\"\",$I$7,IF(VLOOKUP(AB51,Lookups!$A$86:$B$89,2,FALSE)<VLOOKUP(Z51,Lookups!$A$86:$B$89,2,FALSE),$I$8,IF(AND(VLOOKUP(AB51,Lookups!$A$86:$B$89,2,FALSE)>=VLOOKUP(Z51,Lookups!$A$86:$B$89,2,FALSE),VLOOKUP(AB51,Lookups!$A$86:$B$89,2,FALSE)<0.8*VLOOKUP(AA51,Lookups!$A$86:$B$89,2,FALSE)),$I$9,IF(AND(VLOOKUP(AB51,Lookups!$A$86:$B$89,2,FALSE)<=VLOOKUP(AA51,Lookups!$A$86:$B$89,2,FALSE),VLOOKUP(AB51,Lookups!$A$86:$B$89,2,FALSE)>=0.8*VLOOKUP(AA51,Lookups!$A$86:$B$89,2,FALSE)),$I$10,IF(VLOOKUP(AB51,Lookups!$A$86:$B$89,2,FALSE)>VLOOKUP(AA51,Lookups!$A$86:$B$89,2,FALSE),$I$11,\"\")))))","v":0},{"$nulls":3},"Display Screen/Panel Technology",{"v":0.02,"d":"2.0%"},null,"VA LCD","IPS LCD",null,{"$f":"IF(AL51=\"\",$I$7,IF(VLOOKUP(AL51,Lookups!$A$86:$B$89,2,FALSE)<VLOOKUP(AJ51,Lookups!$A$86:$B$89,2,FALSE),$I$8,IF(AND(VLOOKUP(AL51,Lookups!$A$86:$B$89,2,FALSE)>=VLOOKUP(AJ51,Lookups!$A$86:$B$89,2,FALSE),VLOOKUP(AL51,Lookups!$A$86:$B$89,2,FALSE)<0.8*VLOOKUP(AK51,Lookups!$A$86:$B$89,2,FALSE)),$I$9,IF(AND(VLOOKUP(AL51,Lookups!$A$86:$B$89,2,FALSE)<=VLOOKUP(AK51,Lookups!$A$86:$B$89,2,FALSE),VLOOKUP(AL51,Lookups!$A$86:$B$89,2,FALSE)>=0.8*VLOOKUP(AK51,Lookups!$A$86:$B$89,2,FALSE)),$I$10,IF(VLOOKUP(AL51,Lookups!$A$86:$B$89,2,FALSE)>VLOOKUP(AK51,Lookups!$A$86:$B$89,2,FALSE),$I$11,\"\")))))","v":0},null,"VA LCD","IPS LCD",null,{"$f":"IF(AQ51=\"\",$I$7,IF(VLOOKUP(AQ51,Lookups!$A$86:$B$89,2,FALSE)<VLOOKUP(AO51,Lookups!$A$86:$B$89,2,FALSE),$I$8,IF(AND(VLOOKUP(AQ51,Lookups!$A$86:$B$89,2,FALSE)>=VLOOKUP(AO51,Lookups!$A$86:$B$89,2,FALSE),VLOOKUP(AQ51,Lookups!$A$86:$B$89,2,FALSE)<0.8*VLOOKUP(AP51,Lookups!$A$86:$B$89,2,FALSE)),$I$9,IF(AND(VLOOKUP(AQ51,Lookups!$A$86:$B$89,2,FALSE)<=VLOOKUP(AP51,Lookups!$A$86:$B$89,2,FALSE),VLOOKUP(AQ51,Lookups!$A$86:$B$89,2,FALSE)>=0.8*VLOOKUP(AP51,Lookups!$A$86:$B$89,2,FALSE)),$I$10,IF(VLOOKUP(AQ51,Lookups!$A$86:$B$89,2,FALSE)>VLOOKUP(AP51,Lookups!$A$86:$B$89,2,FALSE),$I$11,\"\")))))","v":0},null,"IPS LCD","IPS LCD",null,{"$f":"IF(AV51=\"\",$I$7,IF(VLOOKUP(AV51,Lookups!$A$86:$B$89,2,FALSE)<VLOOKUP(AT51,Lookups!$A$86:$B$89,2,FALSE),$I$8,IF(AND(VLOOKUP(AV51,Lookups!$A$86:$B$89,2,FALSE)>=VLOOKUP(AT51,Lookups!$A$86:$B$89,2,FALSE),VLOOKUP(AV51,Lookups!$A$86:$B$89,2,FALSE)<0.8*VLOOKUP(AU51,Lookups!$A$86:$B$89,2,FALSE)),$I$9,IF(AND(VLOOKUP(AV51,Lookups!$A$86:$B$89,2,FALSE)<=VLOOKUP(AU51,Lookups!$A$86:$B$89,2,FALSE),VLOOKUP(AV51,Lookups!$A$86:$B$89,2,FALSE)>=0.8*VLOOKUP(AU51,Lookups!$A$86:$B$89,2,FALSE)),$I$10,IF(VLOOKUP(AV51,Lookups!$A$86:$B$89,2,FALSE)>VLOOKUP(AU51,Lookups!$A$86:$B$89,2,FALSE),$I$11,\"\")))))","v":0}]
[null,null,"Touch Screen Capability and Type",{"v":0.01,"d":"1.0%"},null,"No","Yes - Capacitive Touch Display",null,{"$f":"IF(H52=\"\",$I$7,IF(VLOOKUP(H52,Lookups!$A$101:$B$103,2,FALSE)<VLOOKUP(F52,Lookups!$A$101:$B$103,2,FALSE),$I$8,IF(AND(VLOOKUP(H52,Lookups!$A$101:$B$103,2,FALSE)>=VLOOKUP(F52,Lookups!$A$101:$B$103,2,FALSE),VLOOKUP(H52,Lookups!$A$101:$B$103,2,FALSE)<0.8*VLOOKUP(G52,Lookups!$A$101:$B$103,2,FALSE)),$I$9,IF(AND(VLOOKUP(H52,Lookups!$A$101:$B$103,2,FALSE)<=VLOOKUP(G52,Lookups!$A$101:$B$103,2,FALSE),VLOOKUP(H52,Lookups!$A$101:$B$103,2,FALSE)>=0.8*VLOOKUP(G52,Lookups!$A$101:$B$103,2,FALSE)),$I$10,IF(VLOOKUP(H52,Lookups!$A$101:$B$103,2,FALSE)>VLOOKUP(G52,Lookups!$A$101:$B$103,2,FALSE),$I$11,\"\")))))","v":0},null,"No","No",null,{"$f":"IF(M52=\"\",$I$7,IF(VLOOKUP(M52,Lookups!$A$101:$B$103,2,FALSE)<VLOOKUP(K52,Lookups!$A$101:$B$103,2,FALSE),$I$8,IF(AND(VLOOKUP(M52,Lookups!$A$101:$B$103,2,FALSE)>=VLOOKUP(K52,Lookups!$A$101:$B$103,2,FALSE),VLOOKUP(M52,Lookups!$A$101:$B$103,2,FALSE)<0.8*VLOOKUP(L52,Lookups!$A$101:$B$103,2,FALSE)),$I$9,IF(AND(VLOOKUP(M52,Lookups!$A$101:$B$103,2,FALSE)<=VLOOKUP(L52,Lookups!$A$101:$B$103,2,FALSE),VLOOKUP(M52,Lookups!$A$101:$B$103,2,FALSE)>=0.8*VLOOKUP(L52,Lookups!$A$101:$B$103,2,FALSE)),$I$10,IF(VLOOKUP(M52,Lookups!$A$101:$B$103,2,FALSE)>VLOOKUP(L52,Lookups!$A$101:$B$103,2,FALSE),$I$11,\"\")))))","v":0},null,"No","Yes - Capacitive Touch Display",null,{"$f":"IF(R52=\"\",$I$7,IF(VLOOKUP(R52,Lookups!$A$101:$B$103,2,FALSE)<VLOOKUP(P52,Lookups!$A$101:$B$103,2,FALSE),$I$8,IF(AND(VLOOKUP(R52,Lookups!$A$101:$B$103,2,FALSE)>=VLOOKUP(P52,Lookups!$A$101:$B$103,2,FALSE),VLOOKUP(R52,Lookups!$A$101:$B$103,2,FALSE)<0.8*VLOOKUP(Q52,Lookups!$A$101:$B$103,2,FALSE)),$I$9,IF(AND(VLOOKUP(R52,Lookups!$A$101:$B$103,2,FALSE)<=VLOOKUP(Q52,Lookups!$A$101:$B$103,2,FALSE),VLOOKUP(R52,Lookups!$A$101:$B$103,2,FALSE)>=0.8*VLOOKUP(Q52,Lookups!$A$101:$B$103,2,FALSE)),$I$10,IF(VLOOKUP(R52,Lookups!$A$101:$B$103,2,FALSE)>VLOOKUP(Q52,Lookups!$A$101:$B$103,2,FALSE),$I$11,\"\")))))","v":0},null,"No","Yes - Capacitive Touch Display",null,{"$f":"IF(W52=\"\",$I$7,IF(VLOOKUP(W52,Lookups!$A$101:$B$103,2,FALSE)<VLOOKUP(U52,Lookups!$A$101:$B$103,2,FALSE),$I$8,IF(AND(VLOOKUP(W52,Lookups!$A$101:$B$103,2,FALSE)>=VLOOKUP(U52,Lookups!$A$101:$B$103,2,FALSE),VLOOKUP(W52,Lookups!$A$101:$B$103,2,FALSE)<0.8*VLOOKUP(V52,Lookups!$A$101:$B$103,2,FALSE)),$I$9,IF(AND(VLOOKUP(W52,Lookups!$A$101:$B$103,2,FALSE)<=VLOOKUP(V52,Lookups!$A$101:$B$103,2,FALSE),VLOOKUP(W52,Lookups!$A$101:$B$103,2,FALSE)>=0.8*VLOOKUP(V52,Lookups!$A$101:$B$103,2,FALSE)),$I$10,IF(VLOOKUP(W52,Lookups!$A$101:$B$103,2,FALSE)>VLOOKUP(V52,Lookups!$A$101:$B$103,2,FALSE),$I$11,\"\")))))","v":0},null,"No","Yes - Capacitive Touch Display",null,{"$f":"IF(AB52=\"\",$I$7,IF(VLOOKUP(AB52,Lookups!$A$101:$B$103,2,FALSE)<VLOOKUP(Z52,Lookups!$A$101:$B$103,2,FALSE),$I$8,IF(AND(VLOOKUP(AB52,Lookups!$A$101:$B$103,2,FALSE)>=VLOOKUP(Z52,Lookups!$A$101:$B$103,2,FALSE),VLOOKUP(AB52,Lookups!$A$101:$B$103,2,FALSE)<0.8*VLOOKUP(AA52,Lookups!$A$101:$B$103,2,FALSE)),$I$9,IF(AND(VLOOKUP(AB52,Lookups!$A$101:$B$103,2,FALSE)<=VLOOKUP(AA52,Lookups!$A$101:$B$103,2,FALSE),VLOOKUP(AB52,Lookups!$A$101:$B$103,2,FALSE)>=0.8*VLOOKUP(AA52,Lookups!$A$101:$B$103,2,FALSE)),$I$10,IF(VLOOKUP(AB52,Lookups!$A$101:$B$103,2,FALSE)>VLOOKUP(AA52,Lookups!$A$101:$B$103,2,FALSE),$I$11,\"\")))))","v":0},{"$nulls":3},"Touch Screen Capability and Type",{"v":0.01,"d":"1.0%"},null,"No","No",null,{"$f":"IF(AL52=\"\",$I$7,IF(VLOOKUP(AL52,Lookups!$A$101:$B$103,2,FALSE)<VLOOKUP(AJ52,Lookups!$A$101:$B$103,2,FALSE),$I$8,IF(AND(VLOOKUP(AL52,Lookups!$A$101:$B$103,2,FALSE)>=VLOOKUP(AJ52,Lookups!$A$101:$B$103,2,FALSE),VLOOKUP(AL52,Lookups!$A$101:$B$103,2,FALSE)<0.8*VLOOKUP(AK52,Lookups!$A$101:$B$103,2,FALSE)),$I$9,IF(AND(VLOOKUP(AL52,Lookups!$A$101:$B$103,2,FALSE)<=VLOOKUP(AK52,Lookups!$A$101:$B$103,2,FALSE),VLOOKUP(AL52,Lookups!$A$101:$B$103,2,FALSE)>=0.8*VLOOKUP(AK52,Lookups!$A$101:$B$103,2,FALSE)),$I$10,IF(VLOOKUP(AL52,Lookups!$A$101:$B$103,2,FALSE)>VLOOKUP(AK52,Lookups!$A$101:$B$103,2,FALSE),$I$11,\"\")))))","v":0},null,"No","No",null,{"$f":"IF(AQ52=\"\",$I$7,IF(VLOOKUP(AQ52,Lookups!$A$101:$B$103,2,FALSE)<VLOOKUP(AO52,Lookups!$A$101:$B$103,2,FALSE),$I$8,IF(AND(VLOOKUP(AQ52,Lookups!$A$101:$B$103,2,FALSE)>=VLOOKUP(AO52,Lookups!$A$101:$B$103,2,FALSE),VLOOKUP(AQ52,Lookups!$A$101:$B$103,2,FALSE)<0.8*VLOOKUP(AP52,Lookups!$A$101:$B$103,2,FALSE)),$I$9,IF(AND(VLOOKUP(AQ52,Lookups!$A$101:$B$103,2,FALSE)<=VLOOKUP(AP52,Lookups!$A$101:$B$103,2,FALSE),VLOOKUP(AQ52,Lookups!$A$101:$B$103,2,FALSE)>=0.8*VLOOKUP(AP52,Lookups!$A$101:$B$103,2,FALSE)),$I$10,IF(VLOOKUP(AQ52,Lookups!$A$101:$B$103,2,FALSE)>VLOOKUP(AP52,Lookups!$A$101:$B$103,2,FALSE),$I$11,\"\")))))","v":0},null,"No","No",null,{"$f":"IF(AV52=\"\",$I$7,IF(VLOOKUP(AV52,Lookups!$A$101:$B$103,2,FALSE)<VLOOKUP(AT52,Lookups!$A$101:$B$103,2,FALSE),$I$8,IF(AND(VLOOKUP(AV52,Lookups!$A$101:$B$103,2,FALSE)>=VLOOKUP(AT52,Lookups!$A$101:$B$103,2,FALSE),VLOOKUP(AV52,Lookups!$A$101:$B$103,2,FALSE)<0.8*VLOOKUP(AU52,Lookups!$A$101:$B$103,2,FALSE)),$I$9,IF(AND(VLOOKUP(AV52,Lookups!$A$101:$B$103,2,FALSE)<=VLOOKUP(AU52,Lookups!$A$101:$B$103,2,FALSE),VLOOKUP(AV52,Lookups!$A$101:$B$103,2,FALSE)>=0.8*VLOOKUP(AU52,Lookups!$A$101:$B$103,2,FALSE)),$I$10,IF(VLOOKUP(AV52,Lookups!$A$101:$B$103,2,FALSE)>VLOOKUP(AU52,Lookups!$A$101:$B$103,2,FALSE),$I$11,\"\")))))","v":0}]
[null,null,"Pen/Stylus capability",{"v":0.005,"d":"0.5%"},null,"No","Yes - Active",null,{"$f":"IF(H53=\"\",$I$7,IF(VLOOKUP(H53,Lookups!$A$21:$B$23,2,FALSE)<VLOOKUP(F53,Lookups!$A$21:$B$23,2,FALSE),$I$8,IF(AND(VLOOKUP(H53,Lookups!$A$21:$B$23,2,FALSE)>=VLOOKUP(F53,Lookups!$A$21:$B$23,2,FALSE),VLOOKUP(H53,Lookups!$A$21:$B$23,2,FALSE)<0.8*VLOOKUP(G53,Lookups!$A$21:$B$23,2,FALSE)),$I$9,IF(AND(VLOOKUP(H53,Lookups!$A$21:$B$23,2,FALSE)<=VLOOKUP(G53,Lookups!$A$21:$B$23,2,FALSE),VLOOKUP(H53,Lookups!$A$21:$B$23,2,FALSE)>=0.8*VLOOKUP(G53,Lookups!$A$21:$B$23,2,FALSE)),$I$10,IF(VLOOKUP(H53,Lookups!$A$21:$B$23,2,FALSE)>VLOOKUP(G53,Lookups!$A$21:$B$23,2,FALSE),$I$11,\"\")))))","v":0},null,"No","No",null,{"$f":"IF(M53=\"\",$I$7,IF(VLOOKUP(M53,Lookups!$A$21:$B$23,2,FALSE)<VLOOKUP(K53,Lookups!$A$21:$B$23,2,FALSE),$I$8,IF(AND(VLOOKUP(M53,Lookups!$A$21:$B$23,2,FALSE)>=VLOOKUP(K53,Lookups!$A$21:$B$23,2,FALSE),VLOOKUP(M53,Lookups!$A$21:$B$23,2,FALSE)<0.8*VLOOKUP(L53,Lookups!$A$21:$B$23,2,FALSE)),$I$9,IF(AND(VLOOKUP(M53,Lookups!$A$21:$B$23,2,FALSE)<=VLOOKUP(L53,Lookups!$A$21:$B$23,2,FALSE),VLOOKUP(M53,Lookups!$A$21:$B$23,2,FALSE)>=0.8*VLOOKUP(L53,Lookups!$A$21:$B$23,2,FALSE)),$I$10,IF(VLOOKUP(M53,Lookups!$A$21:$B$23,2,FALSE)>VLOOKUP(L53,Lookups!$A$21:$B$23,2,FALSE),$I$11,\"\")))))","v":0},null,"No","Yes - Active",null,{"$f":"IF(R53=\"\",$I$7,IF(VLOOKUP(R53,Lookups!$A$21:$B$23,2,FALSE)<VLOOKUP(P53,Lookups!$A$21:$B$23,2,FALSE),$I$8,IF(AND(VLOOKUP(R53,Lookups!$A$21:$B$23,2,FALSE)>=VLOOKUP(P53,Lookups!$A$21:$B$23,2,FALSE),VLOOKUP(R53,Lookups!$A$21:$B$23,2,FALSE)<0.8*VLOOKUP(Q53,Lookups!$A$21:$B$23,2,FALSE)),$I$9,IF(AND(VLOOKUP(R53,Lookups!$A$21:$B$23,2,FALSE)<=VLOOKUP(Q53,Lookups!$A$21:$B$23,2,FALSE),VLOOKUP(R53,Lookups!$A$21:$B$23,2,FALSE)>=0.8*VLOOKUP(Q53,Lookups!$A$21:$B$23,2,FALSE)),$I$10,IF(VLOOKUP(R53,Lookups!$A$21:$B$23,2,FALSE)>VLOOKUP(Q53,Lookups!$A$21:$B$23,2,FALSE),$I$11,\"\")))))","v":0},null,"No","Yes - Active",null,{"$f":"IF(W53=\"\",$I$7,IF(VLOOKUP(W53,Lookups!$A$21:$B$23,2,FALSE)<VLOOKUP(U53,Lookups!$A$21:$B$23,2,FALSE),$I$8,IF(AND(VLOOKUP(W53,Lookups!$A$21:$B$23,2,FALSE)>=VLOOKUP(U53,Lookups!$A$21:$B$23,2,FALSE),VLOOKUP(W53,Lookups!$A$21:$B$23,2,FALSE)<0.8*VLOOKUP(V53,Lookups!$A$21:$B$23,2,FALSE)),$I$9,IF(AND(VLOOKUP(W53,Lookups!$A$21:$B$23,2,FALSE)<=VLOOKUP(V53,Lookups!$A$21:$B$23,2,FALSE),VLOOKUP(W53,Lookups!$A$21:$B$23,2,FALSE)>=0.8*VLOOKUP(V53,Lookups!$A$21:$B$23,2,FALSE)),$I$10,IF(VLOOKUP(W53,Lookups!$A$21:$B$23,2,FALSE)>VLOOKUP(V53,Lookups!$A$21:$B$23,2,FALSE),$I$11,\"\")))))","v":0},null,"No","Yes - Active",null,{"$f":"IF(AB53=\"\",$I$7,IF(VLOOKUP(AB53,Lookups!$A$21:$B$23,2,FALSE)<VLOOKUP(Z53,Lookups!$A$21:$B$23,2,FALSE),$I$8,IF(AND(VLOOKUP(AB53,Lookups!$A$21:$B$23,2,FALSE)>=VLOOKUP(Z53,Lookups!$A$21:$B$23,2,FALSE),VLOOKUP(AB53,Lookups!$A$21:$B$23,2,FALSE)<0.8*VLOOKUP(AA53,Lookups!$A$21:$B$23,2,FALSE)),$I$9,IF(AND(VLOOKUP(AB53,Lookups!$A$21:$B$23,2,FALSE)<=VLOOKUP(AA53,Lookups!$A$21:$B$23,2,FALSE),VLOOKUP(AB53,Lookups!$A$21:$B$23,2,FALSE)>=0.8*VLOOKUP(AA53,Lookups!$A$21:$B$23,2,FALSE)),$I$10,IF(VLOOKUP(AB53,Lookups!$A$21:$B$23,2,FALSE)>VLOOKUP(AA53,Lookups!$A$21:$B$23,2,FALSE),$I$11,\"\")))))","v":0},{"$nulls":3},"Pen/Stylus capability",{"v":0.005,"d":"0.5%"},null,"No","No",null,{"$f":"IF(AL53=\"\",$I$7,IF(VLOOKUP(AL53,Lookups!$A$21:$B$23,2,FALSE)<VLOOKUP(AJ53,Lookups!$A$21:$B$23,2,FALSE),$I$8,IF(AND(VLOOKUP(AL53,Lookups!$A$21:$B$23,2,FALSE)>=VLOOKUP(AJ53,Lookups!$A$21:$B$23,2,FALSE),VLOOKUP(AL53,Lookups!$A$21:$B$23,2,FALSE)<0.8*VLOOKUP(AK53,Lookups!$A$21:$B$23,2,FALSE)),$I$9,IF(AND(VLOOKUP(AL53,Lookups!$A$21:$B$23,2,FALSE)<=VLOOKUP(AK53,Lookups!$A$21:$B$23,2,FALSE),VLOOKUP(AL53,Lookups!$A$21:$B$23,2,FALSE)>=0.8*VLOOKUP(AK53,Lookups!$A$21:$B$23,2,FALSE)),$I$10,IF(VLOOKUP(AL53,Lookups!$A$21:$B$23,2,FALSE)>VLOOKUP(AK53,Lookups!$A$21:$B$23,2,FALSE),$I$11,\"\")))))","v":0},null,"No","No",null,{"$f":"IF(AQ53=\"\",$I$7,IF(VLOOKUP(AQ53,Lookups!$A$21:$B$23,2,FALSE)<VLOOKUP(AO53,Lookups!$A$21:$B$23,2,FALSE),$I$8,IF(AND(VLOOKUP(AQ53,Lookups!$A$21:$B$23,2,FALSE)>=VLOOKUP(AO53,Lookups!$A$21:$B$23,2,FALSE),VLOOKUP(AQ53,Lookups!$A$21:$B$23,2,FALSE)<0.8*VLOOKUP(AP53,Lookups!$A$21:$B$23,2,FALSE)),$I$9,IF(AND(VLOOKUP(AQ53,Lookups!$A$21:$B$23,2,FALSE)<=VLOOKUP(AP53,Lookups!$A$21:$B$23,2,FALSE),VLOOKUP(AQ53,Lookups!$A$21:$B$23,2,FALSE)>=0.8*VLOOKUP(AP53,Lookups!$A$21:$B$23,2,FALSE)),$I$10,IF(VLOOKUP(AQ53,Lookups!$A$21:$B$23,2,FALSE)>VLOOKUP(AP53,Lookups!$A$21:$B$23,2,FALSE),$I$11,\"\")))))","v":0},null,"No","No",null,{"$f":"IF(AV53=\"\",$I$7,IF(VLOOKUP(AV53,Lookups!$A$21:$B$23,2,FALSE)<VLOOKUP(AT53,Lookups!$A$21:$B$23,2,FALSE),$I$8,IF(AND(VLOOKUP(AV53,Lookups!$A$21:$B$23,2,FALSE)>=VLOOKUP(AT53,Lookups!$A$21:$B$23,2,FALSE),VLOOKUP(AV53,Lookups!$A$21:$B$23,2,FALSE)<0.8*VLOOKUP(AU53,Lookups!$A$21:$B$23,2,FALSE)),$I$9,IF(AND(VLOOKUP(AV53,Lookups!$A$21:$B$23,2,FALSE)<=VLOOKUP(AU53,Lookups!$A$21:$B$23,2,FALSE),VLOOKUP(AV53,Lookups!$A$21:$B$23,2,FALSE)>=0.8*VLOOKUP(AU53,Lookups!$A$21:$B$23,2,FALSE)),$I$10,IF(VLOOKUP(AV53,Lookups!$A$21:$B$23,2,FALSE)>VLOOKUP(AU53,Lookups!$A$21:$B$23,2,FALSE),$I$11,\"\")))))","v":0}]
[null,null,"Pen/Stylus Included",{"v":0.005,"d":"0.5%"},null,"No","Yes - Active",null,{"$f":"IF(H54=\"\",$I$7,IF(VLOOKUP(H54,Lookups!$A$21:$B$23,2,FALSE)<VLOOKUP(F54,Lookups!$A$21:$B$23,2,FALSE),$I$8,IF(AND(VLOOKUP(H54,Lookups!$A$21:$B$23,2,FALSE)>=VLOOKUP(F54,Lookups!$A$21:$B$23,2,FALSE),VLOOKUP(H54,Lookups!$A$21:$B$23,2,FALSE)<0.8*VLOOKUP(G54,Lookups!$A$21:$B$23,2,FALSE)),$I$9,IF(AND(VLOOKUP(H54,Lookups!$A$21:$B$23,2,FALSE)<=VLOOKUP(G54,Lookups!$A$21:$B$23,2,FALSE),VLOOKUP(H54,Lookups!$A$21:$B$23,2,FALSE)>=0.8*VLOOKUP(G54,Lookups!$A$21:$B$23,2,FALSE)),$I$10,IF(VLOOKUP(H54,Lookups!$A$21:$B$23,2,FALSE)>VLOOKUP(G54,Lookups!$A$21:$B$23,2,FALSE),$I$11,\"\")))))","v":0},null,"No","No",null,{"$f":"IF(M54=\"\",$I$7,IF(VLOOKUP(M54,Lookups!$A$21:$B$23,2,FALSE)<VLOOKUP(K54,Lookups!$A$21:$B$23,2,FALSE),$I$8,IF(AND(VLOOKUP(M54,Lookups!$A$21:$B$23,2,FALSE)>=VLOOKUP(K54,Lookups!$A$21:$B$23,2,FALSE),VLOOKUP(M54,Lookups!$A$21:$B$23,2,FALSE)<0.8*VLOOKUP(L54,Lookups!$A$21:$B$23,2,FALSE)),$I$9,IF(AND(VLOOKUP(M54,Lookups!$A$21:$B$23,2,FALSE)<=VLOOKUP(L54,Lookups!$A$21:$B$23,2,FALSE),VLOOKUP(M54,Lookups!$A$21:$B$23,2,FALSE)>=0.8*VLOOKUP(L54,Lookups!$A$21:$B$23,2,FALSE)),$I$10,IF(VLOOKUP(M54,Lookups!$A$21:$B$23,2,FALSE)>VLOOKUP(L54,Lookups!$A$21:$B$23,2,FALSE),$I$11,\"\")))))","v":0},null,"No","Yes - Active",null,{"$f":"IF(R54=\"\",$I$7,IF(VLOOKUP(R54,Lookups!$A$21:$B$23,2,FALSE)<VLOOKUP(P54,Lookups!$A$21:$B$23,2,FALSE),$I$8,IF(AND(VLOOKUP(R54,Lookups!$A$21:$B$23,2,FALSE)>=VLOOKUP(P54,Lookups!$A$21:$B$23,2,FALSE),VLOOKUP(R54,Lookups!$A$21:$B$23,2,FALSE)<0.8*VLOOKUP(Q54,Lookups!$A$21:$B$23,2,FALSE)),$I$9,IF(AND(VLOOKUP(R54,Lookups!$A$21:$B$23,2,FALSE)<=VLOOKUP(Q54,Lookups!$A$21:$B$23,2,FALSE),VLOOKUP(R54,Lookups!$A$21:$B$23,2,FALSE)>=0.8*VLOOKUP(Q54,Lookups!$A$21:$B$23,2,FALSE)),$I$10,IF(VLOOKUP(R54,Lookups!$A$21:$B$23,2,FALSE)>VLOOKUP(Q54,Lookups!$A$21:$B$23,2,FALSE),$I$11,\"\")))))","v":0},null,"No","Yes - Active",null,{"$f":"IF(W54=\"\",$I$7,IF(VLOOKUP(W54,Lookups!$A$21:$B$23,2,FALSE)<VLOOKUP(U54,Lookups!$A$21:$B$23,2,FALSE),$I$8,IF(AND(VLOOKUP(W54,Lookups!$A$21:$B$23,2,FALSE)>=VLOOKUP(U54,Lookups!$A$21:$B$23,2,FALSE),VLOOKUP(W54,Lookups!$A$21:$B$23,2,FALSE)<0.8*VLOOKUP(V54,Lookups!$A$21:$B$23,2,FALSE)),$I$9,IF(AND(VLOOKUP(W54,Lookups!$A$21:$B$23,2,FALSE)<=VLOOKUP(V54,Lookups!$A$21:$B$23,2,FALSE),VLOOKUP(W54,Lookups!$A$21:$B$23,2,FALSE)>=0.8*VLOOKUP(V54,Lookups!$A$21:$B$23,2,FALSE)),$I$10,IF(VLOOKUP(W54,Lookups!$A$21:$B$23,2,FALSE)>VLOOKUP(V54,Lookups!$A$21:$B$23,2,FALSE),$I$11,\"\")))))","v":0},null,"No","Yes - Active",null,{"$f":"IF(AB54=\"\",$I$7,IF(VLOOKUP(AB54,Lookups!$A$21:$B$23,2,FALSE)<VLOOKUP(Z54,Lookups!$A$21:$B$23,2,FALSE),$I$8,IF(AND(VLOOKUP(AB54,Lookups!$A$21:$B$23,2,FALSE)>=VLOOKUP(Z54,Lookups!$A$21:$B$23,2,FALSE),VLOOKUP(AB54,Lookups!$A$21:$B$23,2,FALSE)<0.8*VLOOKUP(AA54,Lookups!$A$21:$B$23,2,FALSE)),$I$9,IF(AND(VLOOKUP(AB54,Lookups!$A$21:$B$23,2,FALSE)<=VLOOKUP(AA54,Lookups!$A$21:$B$23,2,FALSE),VLOOKUP(AB54,Lookups!$A$21:$B$23,2,FALSE)>=0.8*VLOOKUP(AA54,Lookups!$A$21:$B$23,2,FALSE)),$I$10,IF(VLOOKUP(AB54,Lookups!$A$21:$B$23,2,FALSE)>VLOOKUP(AA54,Lookups!$A$21:$B$23,2,FALSE),$I$11,\"\")))))","v":0},{"$nulls":3},"Pen/Stylus Included",{"v":0.005,"d":"0.5%"},null,"No","No",null,{"$f":"IF(AL54=\"\",$I$7,IF(VLOOKUP(AL54,Lookups!$A$21:$B$23,2,FALSE)<VLOOKUP(AJ54,Lookups!$A$21:$B$23,2,FALSE),$I$8,IF(AND(VLOOKUP(AL54,Lookups!$A$21:$B$23,2,FALSE)>=VLOOKUP(AJ54,Lookups!$A$21:$B$23,2,FALSE),VLOOKUP(AL54,Lookups!$A$21:$B$23,2,FALSE)<0.8*VLOOKUP(AK54,Lookups!$A$21:$B$23,2,FALSE)),$I$9,IF(AND(VLOOKUP(AL54,Lookups!$A$21:$B$23,2,FALSE)<=VLOOKUP(AK54,Lookups!$A$21:$B$23,2,FALSE),VLOOKUP(AL54,Lookups!$A$21:$B$23,2,FALSE)>=0.8*VLOOKUP(AK54,Lookups!$A$21:$B$23,2,FALSE)),$I$10,IF(VLOOKUP(AL54,Lookups!$A$21:$B$23,2,FALSE)>VLOOKUP(AK54,Lookups!$A$21:$B$23,2,FALSE),$I$11,\"\")))))","v":0},null,"No","No",null,{"$f":"IF(AQ54=\"\",$I$7,IF(VLOOKUP(AQ54,Lookups!$A$21:$B$23,2,FALSE)<VLOOKUP(AO54,Lookups!$A$21:$B$23,2,FALSE),$I$8,IF(AND(VLOOKUP(AQ54,Lookups!$A$21:$B$23,2,FALSE)>=VLOOKUP(AO54,Lookups!$A$21:$B$23,2,FALSE),VLOOKUP(AQ54,Lookups!$A$21:$B$23,2,FALSE)<0.8*VLOOKUP(AP54,Lookups!$A$21:$B$23,2,FALSE)),$I$9,IF(AND(VLOOKUP(AQ54,Lookups!$A$21:$B$23,2,FALSE)<=VLOOKUP(AP54,Lookups!$A$21:$B$23,2,FALSE),VLOOKUP(AQ54,Lookups!$A$21:$B$23,2,FALSE)>=0.8*VLOOKUP(AP54,Lookups!$A$21:$B$23,2,FALSE)),$I$10,IF(VLOOKUP(AQ54,Lookups!$A$21:$B$23,2,FALSE)>VLOOKUP(AP54,Lookups!$A$21:$B$23,2,FALSE),$I$11,\"\")))))","v":0},null,"No","No",null,{"$f":"IF(AV54=\"\",$I$7,IF(VLOOKUP(AV54,Lookups!$A$21:$B$23,2,FALSE)<VLOOKUP(AT54,Lookups!$A$21:$B$23,2,FALSE),$I$8,IF(AND(VLOOKUP(AV54,Lookups!$A$21:$B$23,2,FALSE)>=VLOOKUP(AT54,Lookups!$A$21:$B$23,2,FALSE),VLOOKUP(AV54,Lookups!$A$21:$B$23,2,FALSE)<0.8*VLOOKUP(AU54,Lookups!$A$21:$B$23,2,FALSE)),$I$9,IF(AND(VLOOKUP(AV54,Lookups!$A$21:$B$23,2,FALSE)<=VLOOKUP(AU54,Lookups!$A$21:$B$23,2,FALSE),VLOOKUP(AV54,Lookups!$A$21:$B$23,2,FALSE)>=0.8*VLOOKUP(AU54,Lookups!$A$21:$B$23,2,FALSE)),$I$10,IF(VLOOKUP(AV54,Lookups!$A$21:$B$23,2,FALSE)>VLOOKUP(AU54,Lookups!$A$21:$B$23,2,FALSE),$I$11,\"\")))))","v":0}]
[{"$f":"SUM(D55:D57)","v":{"v":0.04,"d":"4%"}},"Video Out ","HDMI 2",{"v":0.02,"d":"2.0%"},null,1,1,null,{"$f":"IF(H55=\"\",$I$7,IF(H55<F55,$I$8,IF(AND(H55>=F55,OR(G55=\"\",H55<G55)),$I$9,IF(H55=G55,$I$10,IF(H55>G55,$I$11,\"\")))))","v":0},null,1,1,null,{"$f":"IF(M55=\"\",$I$7,IF(M55<K55,$I$8,IF(AND(M55>=K55,OR(L55=\"\",M55<L55)),$I$9,IF(M55=L55,$I$10,IF(M55>L55,$I$11,\"\")))))","v":0},null,1,1,null,{"$f":"IF(R55=\"\",$I$7,IF(R55<P55,$I$8,IF(AND(R55>=P55,OR(Q55=\"\",R55<Q55)),$I$9,IF(R55=Q55,$I$10,IF(R55>Q55,$I$11,\"\")))))","v":0},null,1,1,null,{"$f":"IF(W55=\"\",$I$7,IF(W55<U55,$I$8,IF(AND(W55>=U55,OR(V55=\"\",W55<V55)),$I$9,IF(W55=V55,$I$10,IF(W55>V55,$I$11,\"\")))))","v":0},null,1,1,null,{"$f":"IF(AB55=\"\",$I$7,IF(AB55<Z55,$I$8,IF(AND(AB55>=Z55,OR(AA55=\"\",AB55<AA55)),$I$9,IF(AB55=AA55,$I$10,IF(AB55>AA55,$I$11,\"\")))))","v":0},null,{"$f":"SUM(AH55:AH57)","v":{"v":0.04,"d":"4%"}},"Video Out ","HDMI 2",{"v":0.02,"d":"2.0%"},null,2,4,null,{"$f":"IF(AL55=\"\",$I$7,IF(AL55<AJ55,$I$8,IF(AND(AL55>=AJ55,OR(AK55=\"\",AL55<AK55)),$I$9,IF(AL55=AK55,$I$10,IF(AL55>AK55,$I$11,\"\")))))","v":0},null,2,4,null,{"$f":"IF(AQ55=\"\",$I$7,IF(AQ55<AO55,$I$8,IF(AND(AQ55>=AO55,OR(AP55=\"\",AQ55<AP55)),$I$9,IF(AQ55=AP55,$I$10,IF(AQ55>AP55,$I$11,\"\")))))","v":0},null,4,6,null,{"$f":"IF(AV55=\"\",$I$7,IF(AV55<AT55,$I$8,IF(AND(AV55>=AT55,OR(AU55=\"\",AV55<AU55)),$I$9,IF(AV55=AU55,$I$10,IF(AV55>AU55,$I$11,\"\")))))","v":0}]
[null,"Internal or via included adapter","DisplayPort 1.4 (mini or std)",{"v":0.015,"d":"1.5%"},null,null,1,null,0,null,null,1,null,0,null,null,1,null,0,null,null,1,null,0,null,null,1,null,0,null,null,"Internal or via included adapter","DisplayPort 1.4 (mini or std)",{"v":0.015,"d":"1.5%"},null,null,1,null,0,null,null,1,null,0,null,2,4,null,0]
[null,null,"VGA",{"v":0.005,"d":"0.5%"},null,1,1,null,0,null,1,1,null,0,null,1,1,null,0,null,1,1,null,0,null,1,1,null,0,{"$nulls":3},"VGA",{"v":0.005,"d":"0.5%"},{"$nulls":4},0,{"$nulls":4},0,{"$nulls":4},0]
[{"$f":"SUM(D58:D60)","v":{"v":0.04,"d":"4%"}},"Number of USB Ports","USB 2",{"v":0,"d":"0.0%"},{"$nulls":4},0,{"$nulls":4},0,{"$nulls":4},0,{"$nulls":4},0,{"$nulls":4},0,null,{"$f":"SUM(AH58:AH60)","v":{"v":0.04,"d":"4%"}},"Number of USB Ports","USB 2",{"v":0,"d":"0.0%"},{"$nulls":4},0,{"$nulls":4},0,{"$nulls":4},0]
[null,null,"USB 3 Gen 1 and 2",{"v":0.02,"d":"2.0%"},null,1,2,null,0,null,1,2,null,0,null,2,3,null,0,null,1,2,null,0,null,1,2,null,0,{"$nulls":3},"USB 3 Gen 1 and 2",{"v":0.02,"d":"2.0%"},null,2,4,null,0,null,4,6,null,0,null,6,10,null,0]
[null,null,"USB type C",{"v":0.02,"d":"2.0%"},null,null,1,null,0,null,null,1,null,0,null,1,2,null,0,null,null,1,null,0,null,null,1,null,0,{"$nulls":3},"USB type C",{"v":0.02,"d":"2.0%"},null,1,2,null,0,null,1,2,null,0,null,2,4,null,0]
[{"$f":"SUM(D61:D66)","v":{"v":0.08000000000000002,"d":"8%"}},"Connectivity","Line in/out/mic/headphone",{"v":0.01,"d":"1.0%"},null,"Yes","Yes",null,{"$f":"IF(H61=\"\",$I$7,IF(VLOOKUP(H61,Lookups!$A$31:$B$33,2,FALSE)<VLOOKUP(F61,Lookups!$A$31:$B$33,2,FALSE),$I$8,IF(AND(VLOOKUP(H61,Lookups!$A$31:$B$33,2,FALSE)>=VLOOKUP(F61,Lookups!$A$31:$B$33,2,FALSE),VLOOKUP(H61,Lookups!$A$31:$B$33,2,FALSE)<0.8*VLOOKUP(G61,Lookups!$A$31:$B$33,2,FALSE)),$I$9,IF(AND(VLOOKUP(H61,Lookups!$A$31:$B$33,2,FALSE)<=VLOOKUP(G61,Lookups!$A$31:$B$33,2,FALSE),VLOOKUP(H61,Lookups!$A$31:$B$33,2,FALSE)>=0.8*VLOOKUP(G61,Lookups!$A$31:$B$33,2,FALSE)),$I$10,IF(VLOOKUP(H61,Lookups!$A$31:$B$33,2,FALSE)>VLOOKUP(G61,Lookups!$A$31:$B$33,2,FALSE),$I$11,\"\")))))","v":0},null,"Yes","Yes",null,{"$f":"IF(M61=\"\",$I$7,IF(VLOOKUP(M61,Lookups!$A$31:$B$33,2,FALSE)<VLOOKUP(K61,Lookups!$A$31:$B$33,2,FALSE),$I$8,IF(AND(VLOOKUP(M61,Lookups!$A$31:$B$33,2,FALSE)>=VLOOKUP(K61,Lookups!$A$31:$B$33,2,FALSE),VLOOKUP(M61,Lookups!$A$31:$B$33,2,FALSE)<0.8*VLOOKUP(L61,Lookups!$A$31:$B$33,2,FALSE)),$I$9,IF(AND(VLOOKUP(M61,Lookups!$A$31:$B$33,2,FALSE)<=VLOOKUP(L61,Lookups!$A$31:$B$33,2,FALSE),VLOOKUP(M61,Lookups!$A$31:$B$33,2,FALSE)>=0.8*VLOOKUP(L61,Lookups!$A$31:$B$33,2,FALSE)),$I$10,IF(VLOOKUP(M61,Lookups!$A$31:$B$33,2,FALSE)>VLOOKUP(L61,Lookups!$A$31:$B$33,2,FALSE),$I$11,\"\")))))","v":0},null,"Yes","Yes",null,{"$f":"IF(R61=\"\",$I$7,IF(VLOOKUP(R61,Lookups!$A$31:$B$33,2,FALSE)<VLOOKUP(P61,Lookups!$A$31:$B$33,2,FALSE),$I$8,IF(AND(VLOOKUP(R61,Lookups!$A$31:$B$33,2,FALSE)>=VLOOKUP(P61,Lookups!$A$31:$B$33,2,FALSE),VLOOKUP(R61,Lookups!$A$31:$B$33,2,FALSE)<0.8*VLOOKUP(Q61,Lookups!$A$31:$B$33,2,FALSE)),$I$9,IF(AND(VLOOKUP(R61,Lookups!$A$31:$B$33,2,FALSE)<=VLOOKUP(Q61,Lookups!$A$31:$B$33,2,FALSE),VLOOKUP(R61,Lookups!$A$31:$B$33,2,FALSE)>=0.8*VLOOKUP(Q61,Lookups!$A$31:$B$33,2,FALSE)),$I$10,IF(VLOOKUP(R61,Lookups!$A$31:$B$33,2,FALSE)>VLOOKUP(Q61,Lookups!$A$31:$B$33,2,FALSE),$I$11,\"\")))))","v":0},null,"Yes","Yes",null,{"$f":"IF(W61=\"\",$I$7,IF(VLOOKUP(W61,Lookups!$A$31:$B$33,2,FALSE)<VLOOKUP(U61,Lookups!$A$31:$B$33,2,FALSE),$I$8,IF(AND(VLOOKUP(W61,Lookups!$A$31:$B$33,2,FALSE)>=VLOOKUP(U61,Lookups!$A$31:$B$33,2,FALSE),VLOOKUP(W61,Lookups!$A$31:$B$33,2,FALSE)<0.8*VLOOKUP(V61,Lookups!$A$31:$B$33,2,FALSE)),$I$9,IF(AND(VLOOKUP(W61,Lookups!$A$31:$B$33,2,FALSE)<=VLOOKUP(V61,Lookups!$A$31:$B$33,2,FALSE),VLOOKUP(W61,Lookups!$A$31:$B$33,2,FALSE)>=0.8*VLOOKUP(V61,Lookups!$A$31:$B$33,2,FALSE)),$I$10,IF(VLOOKUP(W61,Lookups!$A$31:$B$33,2,FALSE)>VLOOKUP(V61,Lookups!$A$31:$B$33,2,FALSE),$I$11,\"\")))))","v":0},null,"Yes","Yes",null,{"$f":"IF(AB61=\"\",$I$7,IF(VLOOKUP(AB61,Lookups!$A$31:$B$33,2,FALSE)<VLOOKUP(Z61,Lookups!$A$31:$B$33,2,FALSE),$I$8,IF(AND(VLOOKUP(AB61,Lookups!$A$31:$B$33,2,FALSE)>=VLOOKUP(Z61,Lookups!$A$31:$B$33,2,FALSE),VLOOKUP(AB61,Lookups!$A$31:$B$33,2,FALSE)<0.8*VLOOKUP(AA61,Lookups!$A$31:$B$33,2,FALSE)),$I$9,IF(AND(VLOOKUP(AB61,Lookups!$A$31:$B$33,2,FALSE)<=VLOOKUP(AA61,Lookups!$A$31:$B$33,2,FALSE),VLOOKUP(AB61,Lookups!$A$31:$B$33,2,FALSE)>=0.8*VLOOKUP(AA61,Lookups!$A$31:$B$33,2,FALSE)),$I$10,IF(VLOOKUP(AB61,Lookups!$A$31:$B$33,2,FALSE)>VLOOKUP(AA61,Lookups!$A$31:$B$33,2,FALSE),$I$11,\"\")))))","v":0},null,{"$f":"SUM(AH61:AH66)","v":{"v":0.08,"d":"8%"}},"Connectivity","Line in/out/mic/headphone",{"v":0.01,"d":"1.0%"},null,"Yes","Yes",null,{"$f":"IF(AL61=\"\",$I$7,IF(VLOOKUP(AL61,Lookups!$A$31:$B$33,2,FALSE)<VLOOKUP(AJ61,Lookups!$A$31:$B$33,2,FALSE),$I$8,IF(AND(VLOOKUP(AL61,Lookups!$A$31:$B$33,2,FALSE)>=VLOOKUP(AJ61,Lookups!$A$31:$B$33,2,FALSE),VLOOKUP(AL61,Lookups!$A$31:$B$33,2,FALSE)<0.8*VLOOKUP(AK61,Lookups!$A$31:$B$33,2,FALSE)),$I$9,IF(AND(VLOOKUP(AL61,Lookups!$A$31:$B$33,2,FALSE)<=VLOOKUP(AK61,Lookups!$A$31:$B$33,2,FALSE),VLOOKUP(AL61,Lookups!$A$31:$B$33,2,FALSE)>=0.8*VLOOKUP(AK61,Lookups!$A$31:$B$33,2,FALSE)),$I$10,IF(VLOOKUP(AL61,Lookups!$A$31:$B$33,2,FALSE)>VLOOKUP(AK61,Lookups!$A$31:$B$33,2,FALSE),$I$11,\"\")))))","v":0},null,"Yes","Yes",null,{"$f":"IF(AQ61=\"\",$I$7,IF(VLOOKUP(AQ61,Lookups!$A$31:$B$33,2,FALSE)<VLOOKUP(AO61,Lookups!$A$31:$B$33,2,FALSE),$I$8,IF(AND(VLOOKUP(AQ61,Lookups!$A$31:$B$33,2,FALSE)>=VLOOKUP(AO61,Lookups!$A$31:$B$33,2,FALSE),VLOOKUP(AQ61,Lookups!$A$31:$B$33,2,FALSE)<0.8*VLOOKUP(AP61,Lookups!$A$31:$B$33,2,FALSE)),$I$9,IF(AND(VLOOKUP(AQ61,Lookups!$A$31:$B$33,2,FALSE)<=VLOOKUP(AP61,Lookups!$A$31:$B$33,2,FALSE),VLOOKUP(AQ61,Lookups!$A$31:$B$33,2,FALSE)>=0.8*VLOOKUP(AP61,Lookups!$A$31:$B$33,2,FALSE)),$I$10,IF(VLOOKUP(AQ61,Lookups!$A$31:$B$33,2,FALSE)>VLOOKUP(AP61,Lookups!$A$31:$B$33,2,FALSE),$I$11,\"\")))))","v":0},null,"Yes","Yes",null,{"$f":"IF(AV61=\"\",$I$7,IF(VLOOKUP(AV61,Lookups!$A$31:$B$33,2,FALSE)<VLOOKUP(AT61,Lookups!$A$31:$B$33,2,FALSE),$I$8,IF(AND(VLOOKUP(AV61,Lookups!$A$31:$B$33,2,FALSE)>=VLOOKUP(AT61,Lookups!$A$31:$B$33,2,FALSE),VLOOKUP(AV61,Lookups!$A$31:$B$33,2,FALSE)<0.8*VLOOKUP(AU61,Lookups!$A$31:$B$33,2,FALSE)),$I$9,IF(AND(VLOOKUP(AV61,Lookups!$A$31:$B$33,2,FALSE)<=VLOOKUP(AU61,Lookups!$A$31:$B$33,2,FALSE),VLOOKUP(AV61,Lookups!$A$31:$B$33,2,FALSE)>=0.8*VLOOKUP(AU61,Lookups!$A$31:$B$33,2,FALSE)),$I$10,IF(VLOOKUP(AV61,Lookups!$A$31:$B$33,2,FALSE)>VLOOKUP(AU61,Lookups!$A$31:$B$33,2,FALSE),$I$11,\"\")))))","v":0}]
[null,null,"Full/mini/micro-SD Card slot",{"v":0.005,"d":"0.5%"},null,"No","Yes",null,{"$f":"IF(H62=\"\",$I$7,IF(VLOOKUP(H62,Lookups!$A$31:$B$33,2,FALSE)<VLOOKUP(F62,Lookups!$A$31:$B$33,2,FALSE),$I$8,IF(AND(VLOOKUP(H62,Lookups!$A$31:$B$33,2,FALSE)>=VLOOKUP(F62,Lookups!$A$31:$B$33,2,FALSE),VLOOKUP(H62,Lookups!$A$31:$B$33,2,FALSE)<0.8*VLOOKUP(G62,Lookups!$A$31:$B$33,2,FALSE)),$I$9,IF(AND(VLOOKUP(H62,Lookups!$A$31:$B$33,2,FALSE)<=VLOOKUP(G62,Lookups!$A$31:$B$33,2,FALSE),VLOOKUP(H62,Lookups!$A$31:$B$33,2,FALSE)>=0.8*VLOOKUP(G62,Lookups!$A$31:$B$33,2,FALSE)),$I$10,IF(VLOOKUP(H62,Lookups!$A$31:$B$33,2,FALSE)>VLOOKUP(G62,Lookups!$A$31:$B$33,2,FALSE),$I$11,\"\")))))","v":0},null,"No","Yes",null,{"$f":"IF(M62=\"\",$I$7,IF(VLOOKUP(M62,Lookups!$A$31:$B$33,2,FALSE)<VLOOKUP(K62,Lookups!$A$31:$B$33,2,FALSE),$I$8,IF(AND(VLOOKUP(M62,Lookups!$A$31:$B$33,2,FALSE)>=VLOOKUP(K62,Lookups!$A$31:$B$33,2,FALSE),VLOOKUP(M62,Lookups!$A$31:$B$33,2,FALSE)<0.8*VLOOKUP(L62,Lookups!$A$31:$B$33,2,FALSE)),$I$9,IF(AND(VLOOKUP(M62,Lookups!$A$31:$B$33,2,FALSE)<=VLOOKUP(L62,Lookups!$A$31:$B$33,2,FALSE),VLOOKUP(M62,Lookups!$A$31:$B$33,2,FALSE)>=0.8*VLOOKUP(L62,Lookups!$A$31:$B$33,2,FALSE)),$I$10,IF(VLOOKUP(M62,Lookups!$A$31:$B$33,2,FALSE)>VLOOKUP(L62,Lookups!$A$31:$B$33,2,FALSE),$I$11,\"\")))))","v":0},null,"No","Yes",null,{"$f":"IF(R62=\"\",$I$7,IF(VLOOKUP(R62,Lookups!$A$31:$B$33,2,FALSE)<VLOOKUP(P62,Lookups!$A$31:$B$33,2,FALSE),$I$8,IF(AND(VLOOKUP(R62,Lookups!$A$31:$B$33,2,FALSE)>=VLOOKUP(P62,Lookups!$A$31:$B$33,2,FALSE),VLOOKUP(R62,Lookups!$A$31:$B$33,2,FALSE)<0.8*VLOOKUP(Q62,Lookups!$A$31:$B$33,2,FALSE)),$I$9,IF(AND(VLOOKUP(R62,Lookups!$A$31:$B$33,2,FALSE)<=VLOOKUP(Q62,Lookups!$A$31:$B$33,2,FALSE),VLOOKUP(R62,Lookups!$A$31:$B$33,2,FALSE)>=0.8*VLOOKUP(Q62,Lookups!$A$31:$B$33,2,FALSE)),$I$10,IF(VLOOKUP(R62,Lookups!$A$31:$B$33,2,FALSE)>VLOOKUP(Q62,Lookups!$A$31:$B$33,2,FALSE),$I$11,\"\")))))","v":0},null,"No","Yes",null,{"$f":"IF(W62=\"\",$I$7,IF(VLOOKUP(W62,Lookups!$A$31:$B$33,2,FALSE)<VLOOKUP(U62,Lookups!$A$31:$B$33,2,FALSE),$I$8,IF(AND(VLOOKUP(W62,Lookups!$A$31:$B$33,2,FALSE)>=VLOOKUP(U62,Lookups!$A$31:$B$33,2,FALSE),VLOOKUP(W62,Lookups!$A$31:$B$33,2,FALSE)<0.8*VLOOKUP(V62,Lookups!$A$31:$B$33,2,FALSE)),$I$9,IF(AND(VLOOKUP(W62,Lookups!$A$31:$B$33,2,FALSE)<=VLOOKUP(V62,Lookups!$A$31:$B$33,2,FALSE),VLOOKUP(W62,Lookups!$A$31:$B$33,2,FALSE)>=0.8*VLOOKUP(V62,Lookups!$A$31:$B$33,2,FALSE)),$I$10,IF(VLOOKUP(W62,Lookups!$A$31:$B$33,2,FALSE)>VLOOKUP(V62,Lookups!$A$31:$B$33,2,FALSE),$I$11,\"\")))))","v":0},null,"No","Yes",null,{"$f":"IF(AB62=\"\",$I$7,IF(VLOOKUP(AB62,Lookups!$A$31:$B$33,2,FALSE)<VLOOKUP(Z62,Lookups!$A$31:$B$33,2,FALSE),$I$8,IF(AND(VLOOKUP(AB62,Lookups!$A$31:$B$33,2,FALSE)>=VLOOKUP(Z62,Lookups!$A$31:$B$33,2,FALSE),VLOOKUP(AB62,Lookups!$A$31:$B$33,2,FALSE)<0.8*VLOOKUP(AA62,Lookups!$A$31:$B$33,2,FALSE)),$I$9,IF(AND(VLOOKUP(AB62,Lookups!$A$31:$B$33,2,FALSE)<=VLOOKUP(AA62,Lookups!$A$31:$B$33,2,FALSE),VLOOKUP(AB62,Lookups!$A$31:$B$33,2,FALSE)>=0.8*VLOOKUP(AA62,Lookups!$A$31:$B$33,2,FALSE)),$I$10,IF(VLOOKUP(AB62,Lookups!$A$31:$B$33,2,FALSE)>VLOOKUP(AA62,Lookups!$A$31:$B$33,2,FALSE),$I$11,\"\")))))","v":0},{"$nulls":3},"Full/mini/micro-SD Card slot",{"v":0.005,"d":"0.5%"},null,"No","No",null,{"$f":"IF(AL62=\"\",$I$7,IF(VLOOKUP(AL62,Lookups!$A$31:$B$33,2,FALSE)<VLOOKUP(AJ62,Lookups!$A$31:$B$33,2,FALSE),$I$8,IF(AND(VLOOKUP(AL62,Lookups!$A$31:$B$33,2,FALSE)>=VLOOKUP(AJ62,Lookups!$A$31:$B$33,2,FALSE),VLOOKUP(AL62,Lookups!$A$31:$B$33,2,FALSE)<0.8*VLOOKUP(AK62,Lookups!$A$31:$B$33,2,FALSE)),$I$9,IF(AND(VLOOKUP(AL62,Lookups!$A$31:$B$33,2,FALSE)<=VLOOKUP(AK62,Lookups!$A$31:$B$33,2,FALSE),VLOOKUP(AL62,Lookups!$A$31:$B$33,2,FALSE)>=0.8*VLOOKUP(AK62,Lookups!$A$31:$B$33,2,FALSE)),$I$10,IF(VLOOKUP(AL62,Lookups!$A$31:$B$33,2,FALSE)>VLOOKUP(AK62,Lookups!$A$31:$B$33,2,FALSE),$I$11,\"\")))))","v":0},null,"No","Yes",null,{"$f":"IF(AQ62=\"\",$I$7,IF(VLOOKUP(AQ62,Lookups!$A$31:$B$33,2,FALSE)<VLOOKUP(AO62,Lookups!$A$31:$B$33,2,FALSE),$I$8,IF(AND(VLOOKUP(AQ62,Lookups!$A$31:$B$33,2,FALSE)>=VLOOKUP(AO62,Lookups!$A$31:$B$33,2,FALSE),VLOOKUP(AQ62,Lookups!$A$31:$B$33,2,FALSE)<0.8*VLOOKUP(AP62,Lookups!$A$31:$B$33,2,FALSE)),$I$9,IF(AND(VLOOKUP(AQ62,Lookups!$A$31:$B$33,2,FALSE)<=VLOOKUP(AP62,Lookups!$A$31:$B$33,2,FALSE),VLOOKUP(AQ62,Lookups!$A$31:$B$33,2,FALSE)>=0.8*VLOOKUP(AP62,Lookups!$A$31:$B$33,2,FALSE)),$I$10,IF(VLOOKUP(AQ62,Lookups!$A$31:$B$33,2,FALSE)>VLOOKUP(AP62,Lookups!$A$31:$B$33,2,FALSE),$I$11,\"\")))))","v":0},null,"Yes","Yes",null,{"$f":"IF(AV62=\"\",$I$7,IF(VLOOKUP(AV62,Lookups!$A$31:$B$33,2,FALSE)<VLOOKUP(AT62,Lookups!$A$31:$B$33,2,FALSE),$I$8,IF(AND(VLOOKUP(AV62,Lookups!$A$31:$B$33,2,FALSE)>=VLOOKUP(AT62,Lookups!$A$31:$B$33,2,FALSE),VLOOKUP(AV62,Lookups!$A$31:$B$33,2,FALSE)<0.8*VLOOKUP(AU62,Lookups!$A$31:$B$33,2,FALSE)),$I$9,IF(AND(VLOOKUP(AV62,Lookups!$A$31:$B$33,2,FALSE)<=VLOOKUP(AU62,Lookups!$A$31:$B$33,2,FALSE),VLOOKUP(AV62,Lookups!$A$31:$B$33,2,FALSE)>=0.8*VLOOKUP(AU62,Lookups!$A$31:$B$33,2,FALSE)),$I$10,IF(VLOOKUP(AV62,Lookups!$A$31:$B$33,2,FALSE)>VLOOKUP(AU62,Lookups!$A$31:$B$33,2,FALSE),$I$11,\"\")))))","v":0}]
[null,null,"RJ45 Gigabit LAN (built-in or via an adapter)",{"v":0.02,"d":"2.0%"},null,"Yes","Yes",null,{"$f":"IF(H63=\"\",$I$7,IF(VLOOKUP(H63,Lookups!$A$31:$B$33,2,FALSE)<VLOOKUP(F63,Lookups!$A$31:$B$33,2,FALSE),$I$8,IF(AND(VLOOKUP(H63,Lookups!$A$31:$B$33,2,FALSE)>=VLOOKUP(F63,Lookups!$A$31:$B$33,2,FALSE),VLOOKUP(H63,Lookups!$A$31:$B$33,2,FALSE)<0.8*VLOOKUP(G63,Lookups!$A$31:$B$33,2,FALSE)),$I$9,IF(AND(VLOOKUP(H63,Lookups!$A$31:$B$33,2,FALSE)<=VLOOKUP(G63,Lookups!$A$31:$B$33,2,FALSE),VLOOKUP(H63,Lookups!$A$31:$B$33,2,FALSE)>=0.8*VLOOKUP(G63,Lookups!$A$31:$B$33,2,FALSE)),$I$10,IF(VLOOKUP(H63,Lookups!$A$31:$B$33,2,FALSE)>VLOOKUP(G63,Lookups!$A$31:$B$33,2,FALSE),$I$11,\"\")))))","v":0},null,"Yes","Yes",null,{"$f":"IF(M63=\"\",$I$7,IF(VLOOKUP(M63,Lookups!$A$31:$B$33,2,FALSE)<VLOOKUP(K63,Lookups!$A$31:$B$33,2,FALSE),$I$8,IF(AND(VLOOKUP(M63,Lookups!$A$31:$B$33,2,FALSE)>=VLOOKUP(K63,Lookups!$A$31:$B$33,2,FALSE),VLOOKUP(M63,Lookups!$A$31:$B$33,2,FALSE)<0.8*VLOOKUP(L63,Lookups!$A$31:$B$33,2,FALSE)),$I$9,IF(AND(VLOOKUP(M63,Lookups!$A$31:$B$33,2,FALSE)<=VLOOKUP(L63,Lookups!$A$31:$B$33,2,FALSE),VLOOKUP(M63,Lookups!$A$31:$B$33,2,FALSE)>=0.8*VLOOKUP(L63,Lookups!$A$31:$B$33,2,FALSE)),$I$10,IF(VLOOKUP(M63,Lookups!$A$31:$B$33,2,FALSE)>VLOOKUP(L63,Lookups!$A$31:$B$33,2,FALSE),$I$11,\"\")))))","v":0},null,"Yes","Yes",null,{"$f":"IF(R63=\"\",$I$7,IF(VLOOKUP(R63,Lookups!$A$31:$B$33,2,FALSE)<VLOOKUP(P63,Lookups!$A$31:$B$33,2,FALSE),$I$8,IF(AND(VLOOKUP(R63,Lookups!$A$31:$B$33,2,FALSE)>=VLOOKUP(P63,Lookups!$A$31:$B$33,2,FALSE),VLOOKUP(R63,Lookups!$A$31:$B$33,2,FALSE)<0.8*VLOOKUP(Q63,Lookups!$A$31:$B$33,2,FALSE)),$I$9,IF(AND(VLOOKUP(R63,Lookups!$A$31:$B$33,2,FALSE)<=VLOOKUP(Q63,Lookups!$A$31:$B$33,2,FALSE),VLOOKUP(R63,Lookups!$A$31:$B$33,2,FALSE)>=0.8*VLOOKUP(Q63,Lookups!$A$31:$B$33,2,FALSE)),$I$10,IF(VLOOKUP(R63,Lookups!$A$31:$B$33,2,FALSE)>VLOOKUP(Q63,Lookups!$A$31:$B$33,2,FALSE),$I$11,\"\")))))","v":0},null,"Yes","Yes",null,{"$f":"IF(W63=\"\",$I$7,IF(VLOOKUP(W63,Lookups!$A$31:$B$33,2,FALSE)<VLOOKUP(U63,Lookups!$A$31:$B$33,2,FALSE),$I$8,IF(AND(VLOOKUP(W63,Lookups!$A$31:$B$33,2,FALSE)>=VLOOKUP(U63,Lookups!$A$31:$B$33,2,FALSE),VLOOKUP(W63,Lookups!$A$31:$B$33,2,FALSE)<0.8*VLOOKUP(V63,Lookups!$A$31:$B$33,2,FALSE)),$I$9,IF(AND(VLOOKUP(W63,Lookups!$A$31:$B$33,2,FALSE)<=VLOOKUP(V63,Lookups!$A$31:$B$33,2,FALSE),VLOOKUP(W63,Lookups!$A$31:$B$33,2,FALSE)>=0.8*VLOOKUP(V63,Lookups!$A$31:$B$33,2,FALSE)),$I$10,IF(VLOOKUP(W63,Lookups!$A$31:$B$33,2,FALSE)>VLOOKUP(V63,Lookups!$A$31:$B$33,2,FALSE),$I$11,\"\")))))","v":0},null,"Yes","Yes",null,{"$f":"IF(AB63=\"\",$I$7,IF(VLOOKUP(AB63,Lookups!$A$31:$B$33,2,FALSE)<VLOOKUP(Z63,Lookups!$A$31:$B$33,2,FALSE),$I$8,IF(AND(VLOOKUP(AB63,Lookups!$A$31:$B$33,2,FALSE)>=VLOOKUP(Z63,Lookups!$A$31:$B$33,2,FALSE),VLOOKUP(AB63,Lookups!$A$31:$B$33,2,FALSE)<0.8*VLOOKUP(AA63,Lookups!$A$31:$B$33,2,FALSE)),$I$9,IF(AND(VLOOKUP(AB63,Lookups!$A$31:$B$33,2,FALSE)<=VLOOKUP(AA63,Lookups!$A$31:$B$33,2,FALSE),VLOOKUP(AB63,Lookups!$A$31:$B$33,2,FALSE)>=0.8*VLOOKUP(AA63,Lookups!$A$31:$B$33,2,FALSE)),$I$10,IF(VLOOKUP(AB63,Lookups!$A$31:$B$33,2,FALSE)>VLOOKUP(AA63,Lookups!$A$31:$B$33,2,FALSE),$I$11,\"\")))))","v":0},{"$nulls":3},"RJ45 Gigabit LAN (built-in or via an adapter)",{"v":0.02,"d":"2.0%"},null,"Yes","Yes",null,{"$f":"IF(AL63=\"\",$I$7,IF(VLOOKUP(AL63,Lookups!$A$31:$B$33,2,FALSE)<VLOOKUP(AJ63,Lookups!$A$31:$B$33,2,FALSE),$I$8,IF(AND(VLOOKUP(AL63,Lookups!$A$31:$B$33,2,FALSE)>=VLOOKUP(AJ63,Lookups!$A$31:$B$33,2,FALSE),VLOOKUP(AL63,Lookups!$A$31:$B$33,2,FALSE)<0.8*VLOOKUP(AK63,Lookups!$A$31:$B$33,2,FALSE)),$I$9,IF(AND(VLOOKUP(AL63,Lookups!$A$31:$B$33,2,FALSE)<=VLOOKUP(AK63,Lookups!$A$31:$B$33,2,FALSE),VLOOKUP(AL63,Lookups!$A$31:$B$33,2,FALSE)>=0.8*VLOOKUP(AK63,Lookups!$A$31:$B$33,2,FALSE)),$I$10,IF(VLOOKUP(AL63,Lookups!$A$31:$B$33,2,FALSE)>VLOOKUP(AK63,Lookups!$A$31:$B$33,2,FALSE),$I$11,\"\")))))","v":0},null,"Yes","Yes",null,{"$f":"IF(AQ63=\"\",$I$7,IF(VLOOKUP(AQ63,Lookups!$A$31:$B$33,2,FALSE)<VLOOKUP(AO63,Lookups!$A$31:$B$33,2,FALSE),$I$8,IF(AND(VLOOKUP(AQ63,Lookups!$A$31:$B$33,2,FALSE)>=VLOOKUP(AO63,Lookups!$A$31:$B$33,2,FALSE),VLOOKUP(AQ63,Lookups!$A$31:$B$33,2,FALSE)<0.8*VLOOKUP(AP63,Lookups!$A$31:$B$33,2,FALSE)),$I$9,IF(AND(VLOOKUP(AQ63,Lookups!$A$31:$B$33,2,FALSE)<=VLOOKUP(AP63,Lookups!$A$31:$B$33,2,FALSE),VLOOKUP(AQ63,Lookups!$A$31:$B$33,2,FALSE)>=0.8*VLOOKUP(AP63,Lookups!$A$31:$B$33,2,FALSE)),$I$10,IF(VLOOKUP(AQ63,Lookups!$A$31:$B$33,2,FALSE)>VLOOKUP(AP63,Lookups!$A$31:$B$33,2,FALSE),$I$11,\"\")))))","v":0},null,"Yes","Yes",null,{"$f":"IF(AV63=\"\",$I$7,IF(VLOOKUP(AV63,Lookups!$A$31:$B$33,2,FALSE)<VLOOKUP(AT63,Lookups!$A$31:$B$33,2,FALSE),$I$8,IF(AND(VLOOKUP(AV63,Lookups!$A$31:$B$33,2,FALSE)>=VLOOKUP(AT63,Lookups!$A$31:$B$33,2,FALSE),VLOOKUP(AV63,Lookups!$A$31:$B$33,2,FALSE)<0.8*VLOOKUP(AU63,Lookups!$A$31:$B$33,2,FALSE)),$I$9,IF(AND(VLOOKUP(AV63,Lookups!$A$31:$B$33,2,FALSE)<=VLOOKUP(AU63,Lookups!$A$31:$B$33,2,FALSE),VLOOKUP(AV63,Lookups!$A$31:$B$33,2,FALSE)>=0.8*VLOOKUP(AU63,Lookups!$A$31:$B$33,2,FALSE)),$I$10,IF(VLOOKUP(AV63,Lookups!$A$31:$B$33,2,FALSE)>VLOOKUP(AU63,Lookups!$A$31:$B$33,2,FALSE),$I$11,\"\")))))","v":0}]
[null,null,"WiFi Generation",{"v":0.02,"d":"2.0%"},null,"Gen 5","Gen 6",null,{"$f":"IF(H64=\"\",$I$7,IF(VLOOKUP(H64,Lookups!$A$106:$B$110,2,FALSE)<VLOOKUP(F64,Lookups!$A$106:$B$110,2,FALSE),$I$8,IF(AND(VLOOKUP(H64,Lookups!$A$106:$B$110,2,FALSE)>=VLOOKUP(F64,Lookups!$A$106:$B$110,2,FALSE),VLOOKUP(H64,Lookups!$A$106:$B$110,2,FALSE)<0.8*VLOOKUP(G64,Lookups!$A$106:$B$110,2,FALSE)),$I$9,IF(AND(VLOOKUP(H64,Lookups!$A$106:$B$110,2,FALSE)<=VLOOKUP(G64,Lookups!$A$106:$B$110,2,FALSE),VLOOKUP(H64,Lookups!$A$106:$B$110,2,FALSE)>=0.8*VLOOKUP(G64,Lookups!$A$106:$B$110,2,FALSE)),$I$10,IF(VLOOKUP(H64,Lookups!$A$106:$B$110,2,FALSE)>VLOOKUP(G64,Lookups!$A$106:$B$110,2,FALSE),$I$11,\"\")))))","v":0},null,"Gen 5","Gen 6",null,{"$f":"IF(M64=\"\",$I$7,IF(VLOOKUP(M64,Lookups!$A$106:$B$110,2,FALSE)<VLOOKUP(K64,Lookups!$A$106:$B$110,2,FALSE),$I$8,IF(AND(VLOOKUP(M64,Lookups!$A$106:$B$110,2,FALSE)>=VLOOKUP(K64,Lookups!$A$106:$B$110,2,FALSE),VLOOKUP(M64,Lookups!$A$106:$B$110,2,FALSE)<0.8*VLOOKUP(L64,Lookups!$A$106:$B$110,2,FALSE)),$I$9,IF(AND(VLOOKUP(M64,Lookups!$A$106:$B$110,2,FALSE)<=VLOOKUP(L64,Lookups!$A$106:$B$110,2,FALSE),VLOOKUP(M64,Lookups!$A$106:$B$110,2,FALSE)>=0.8*VLOOKUP(L64,Lookups!$A$106:$B$110,2,FALSE)),$I$10,IF(VLOOKUP(M64,Lookups!$A$106:$B$110,2,FALSE)>VLOOKUP(L64,Lookups!$A$106:$B$110,2,FALSE),$I$11,\"\")))))","v":0},null,"Gen 5","Gen 6",null,{"$f":"IF(R64=\"\",$I$7,IF(VLOOKUP(R64,Lookups!$A$106:$B$110,2,FALSE)<VLOOKUP(P64,Lookups!$A$106:$B$110,2,FALSE),$I$8,IF(AND(VLOOKUP(R64,Lookups!$A$106:$B$110,2,FALSE)>=VLOOKUP(P64,Lookups!$A$106:$B$110,2,FALSE),VLOOKUP(R64,Lookups!$A$106:$B$110,2,FALSE)<0.8*VLOOKUP(Q64,Lookups!$A$106:$B$110,2,FALSE)),$I$9,IF(AND(VLOOKUP(R64,Lookups!$A$106:$B$110,2,FALSE)<=VLOOKUP(Q64,Lookups!$A$106:$B$110,2,FALSE),VLOOKUP(R64,Lookups!$A$106:$B$110,2,FALSE)>=0.8*VLOOKUP(Q64,Lookups!$A$106:$B$110,2,FALSE)),$I$10,IF(VLOOKUP(R64,Lookups!$A$106:$B$110,2,FALSE)>VLOOKUP(Q64,Lookups!$A$106:$B$110,2,FALSE),$I$11,\"\")))))","v":0},null,"Gen 5","Gen 6",null,{"$f":"IF(W64=\"\",$I$7,IF(VLOOKUP(W64,Lookups!$A$106:$B$110,2,FALSE)<VLOOKUP(U64,Lookups!$A$106:$B$110,2,FALSE),$I$8,IF(AND(VLOOKUP(W64,Lookups!$A$106:$B$110,2,FALSE)>=VLOOKUP(U64,Lookups!$A$106:$B$110,2,FALSE),VLOOKUP(W64,Lookups!$A$106:$B$110,2,FALSE)<0.8*VLOOKUP(V64,Lookups!$A$106:$B$110,2,FALSE)),$I$9,IF(AND(VLOOKUP(W64,Lookups!$A$106:$B$110,2,FALSE)<=VLOOKUP(V64,Lookups!$A$106:$B$110,2,FALSE),VLOOKUP(W64,Lookups!$A$106:$B$110,2,FALSE)>=0.8*VLOOKUP(V64,Lookups!$A$106:$B$110,2,FALSE)),$I$10,IF(VLOOKUP(W64,Lookups!$A$106:$B$110,2,FALSE)>VLOOKUP(V64,Lookups!$A$106:$B$110,2,FALSE),$I$11,\"\")))))","v":0},null,"Gen 5","Gen 6",null,{"$f":"IF(AB64=\"\",$I$7,IF(VLOOKUP(AB64,Lookups!$A$106:$B$110,2,FALSE)<VLOOKUP(Z64,Lookups!$A$106:$B$110,2,FALSE),$I$8,IF(AND(VLOOKUP(AB64,Lookups!$A$106:$B$110,2,FALSE)>=VLOOKUP(Z64,Lookups!$A$106:$B$110,2,FALSE),VLOOKUP(AB64,Lookups!$A$106:$B$110,2,FALSE)<0.8*VLOOKUP(AA64,Lookups!$A$106:$B$110,2,FALSE)),$I$9,IF(AND(VLOOKUP(AB64,Lookups!$A$106:$B$110,2,FALSE)<=VLOOKUP(AA64,Lookups!$A$106:$B$110,2,FALSE),VLOOKUP(AB64,Lookups!$A$106:$B$110,2,FALSE)>=0.8*VLOOKUP(AA64,Lookups!$A$106:$B$110,2,FALSE)),$I$10,IF(VLOOKUP(AB64,Lookups!$A$106:$B$110,2,FALSE)>VLOOKUP(AA64,Lookups!$A$106:$B$110,2,FALSE),$I$11,\"\")))))","v":0},{"$nulls":3},"WiFi Generation",{"v":0.025,"d":"2.5%"},null,"Gen 5","Gen 6",null,{"$f":"IF(AL64=\"\",$I$7,IF(VLOOKUP(AL64,Lookups!$A$106:$B$110,2,FALSE)<VLOOKUP(AJ64,Lookups!$A$106:$B$110,2,FALSE),$I$8,IF(AND(VLOOKUP(AL64,Lookups!$A$106:$B$110,2,FALSE)>=VLOOKUP(AJ64,Lookups!$A$106:$B$110,2,FALSE),VLOOKUP(AL64,Lookups!$A$106:$B$110,2,FALSE)<0.8*VLOOKUP(AK64,Lookups!$A$106:$B$110,2,FALSE)),$I$9,IF(AND(VLOOKUP(AL64,Lookups!$A$106:$B$110,2,FALSE)<=VLOOKUP(AK64,Lookups!$A$106:$B$110,2,FALSE),VLOOKUP(AL64,Lookups!$A$106:$B$110,2,FALSE)>=0.8*VLOOKUP(AK64,Lookups!$A$106:$B$110,2,FALSE)),$I$10,IF(VLOOKUP(AL64,Lookups!$A$106:$B$110,2,FALSE)>VLOOKUP(AK64,Lookups!$A$106:$B$110,2,FALSE),$I$11,\"\")))))","v":0},null,"Gen 5","Gen 6",null,{"$f":"IF(AQ64=\"\",$I$7,IF(VLOOKUP(AQ64,Lookups!$A$106:$B$110,2,FALSE)<VLOOKUP(AO64,Lookups!$A$106:$B$110,2,FALSE),$I$8,IF(AND(VLOOKUP(AQ64,Lookups!$A$106:$B$110,2,FALSE)>=VLOOKUP(AO64,Lookups!$A$106:$B$110,2,FALSE),VLOOKUP(AQ64,Lookups!$A$106:$B$110,2,FALSE)<0.8*VLOOKUP(AP64,Lookups!$A$106:$B$110,2,FALSE)),$I$9,IF(AND(VLOOKUP(AQ64,Lookups!$A$106:$B$110,2,FALSE)<=VLOOKUP(AP64,Lookups!$A$106:$B$110,2,FALSE),VLOOKUP(AQ64,Lookups!$A$106:$B$110,2,FALSE)>=0.8*VLOOKUP(AP64,Lookups!$A$106:$B$110,2,FALSE)),$I$10,IF(VLOOKUP(AQ64,Lookups!$A$106:$B$110,2,FALSE)>VLOOKUP(AP64,Lookups!$A$106:$B$110,2,FALSE),$I$11,\"\")))))","v":0},null,"Gen 5","Gen 6",null,{"$f":"IF(AV64=\"\",$I$7,IF(VLOOKUP(AV64,Lookups!$A$106:$B$110,2,FALSE)<VLOOKUP(AT64,Lookups!$A$106:$B$110,2,FALSE),$I$8,IF(AND(VLOOKUP(AV64,Lookups!$A$106:$B$110,2,FALSE)>=VLOOKUP(AT64,Lookups!$A$106:$B$110,2,FALSE),VLOOKUP(AV64,Lookups!$A$106:$B$110,2,FALSE)<0.8*VLOOKUP(AU64,Lookups!$A$106:$B$110,2,FALSE)),$I$9,IF(AND(VLOOKUP(AV64,Lookups!$A$106:$B$110,2,FALSE)<=VLOOKUP(AU64,Lookups!$A$106:$B$110,2,FALSE),VLOOKUP(AV64,Lookups!$A$106:$B$110,2,FALSE)>=0.8*VLOOKUP(AU64,Lookups!$A$106:$B$110,2,FALSE)),$I$10,IF(VLOOKUP(AV64,Lookups!$A$106:$B$110,2,FALSE)>VLOOKUP(AU64,Lookups!$A$106:$B$110,2,FALSE),$I$11,\"\")))))","v":0}]
[null,null,"Bluetooth 5.1",{"v":0.02,"d":"2.0%"},null,5,5.1,null,{"$f":"IF(H65=\"\",$I$7,IF(VLOOKUP(H65,Lookups!$A$113:$B$120,2,FALSE)<VLOOKUP(F65,Lookups!$A$113:$B$120,2,FALSE),$I$8,IF(AND(VLOOKUP(H65,Lookups!$A$113:$B$120,2,FALSE)>=VLOOKUP(F65,Lookups!$A$113:$B$120,2,FALSE),VLOOKUP(H65,Lookups!$A$113:$B$120,2,FALSE)<0.8*VLOOKUP(G65,Lookups!$A$113:$B$120,2,FALSE)),$I$9,IF(AND(VLOOKUP(H65,Lookups!$A$113:$B$120,2,FALSE)<=VLOOKUP(G65,Lookups!$A$113:$B$120,2,FALSE),VLOOKUP(H65,Lookups!$A$113:$B$120,2,FALSE)>=0.8*VLOOKUP(G65,Lookups!$A$113:$B$120,2,FALSE)),$I$10,IF(VLOOKUP(H65,Lookups!$A$113:$B$120,2,FALSE)>VLOOKUP(G65,Lookups!$A$113:$B$120,2,FALSE),$I$11,\"\")))))","v":0},null,5,5.1,null,{"$f":"IF(M65=\"\",$I$7,IF(VLOOKUP(M65,Lookups!$A$113:$B$120,2,FALSE)<VLOOKUP(K65,Lookups!$A$113:$B$120,2,FALSE),$I$8,IF(AND(VLOOKUP(M65,Lookups!$A$113:$B$120,2,FALSE)>=VLOOKUP(K65,Lookups!$A$113:$B$120,2,FALSE),VLOOKUP(M65,Lookups!$A$113:$B$120,2,FALSE)<0.8*VLOOKUP(L65,Lookups!$A$113:$B$120,2,FALSE)),$I$9,IF(AND(VLOOKUP(M65,Lookups!$A$113:$B$120,2,FALSE)<=VLOOKUP(L65,Lookups!$A$113:$B$120,2,FALSE),VLOOKUP(M65,Lookups!$A$113:$B$120,2,FALSE)>=0.8*VLOOKUP(L65,Lookups!$A$113:$B$120,2,FALSE)),$I$10,IF(VLOOKUP(M65,Lookups!$A$113:$B$120,2,FALSE)>VLOOKUP(L65,Lookups!$A$113:$B$120,2,FALSE),$I$11,\"\")))))","v":0},null,5.1,5.2,null,{"$f":"IF(R65=\"\",$I$7,IF(VLOOKUP(R65,Lookups!$A$113:$B$120,2,FALSE)<VLOOKUP(P65,Lookups!$A$113:$B$120,2,FALSE),$I$8,IF(AND(VLOOKUP(R65,Lookups!$A$113:$B$120,2,FALSE)>=VLOOKUP(P65,Lookups!$A$113:$B$120,2,FALSE),VLOOKUP(R65,Lookups!$A$113:$B$120,2,FALSE)<0.8*VLOOKUP(Q65,Lookups!$A$113:$B$120,2,FALSE)),$I$9,IF(AND(VLOOKUP(R65,Lookups!$A$113:$B$120,2,FALSE)<=VLOOKUP(Q65,Lookups!$A$113:$B$120,2,FALSE),VLOOKUP(R65,Lookups!$A$113:$B$120,2,FALSE)>=0.8*VLOOKUP(Q65,Lookups!$A$113:$B$120,2,FALSE)),$I$10,IF(VLOOKUP(R65,Lookups!$A$113:$B$120,2,FALSE)>VLOOKUP(Q65,Lookups!$A$113:$B$120,2,FALSE),$I$11,\"\")))))","v":0},null,5,5.1,null,{"$f":"IF(W65=\"\",$I$7,IF(VLOOKUP(W65,Lookups!$A$113:$B$120,2,FALSE)<VLOOKUP(U65,Lookups!$A$113:$B$120,2,FALSE),$I$8,IF(AND(VLOOKUP(W65,Lookups!$A$113:$B$120,2,FALSE)>=VLOOKUP(U65,Lookups!$A$113:$B$120,2,FALSE),VLOOKUP(W65,Lookups!$A$113:$B$120,2,FALSE)<0.8*VLOOKUP(V65,Lookups!$A$113:$B$120,2,FALSE)),$I$9,IF(AND(VLOOKUP(W65,Lookups!$A$113:$B$120,2,FALSE)<=VLOOKUP(V65,Lookups!$A$113:$B$120,2,FALSE),VLOOKUP(W65,Lookups!$A$113:$B$120,2,FALSE)>=0.8*VLOOKUP(V65,Lookups!$A$113:$B$120,2,FALSE)),$I$10,IF(VLOOKUP(W65,Lookups!$A$113:$B$120,2,FALSE)>VLOOKUP(V65,Lookups!$A$113:$B$120,2,FALSE),$I$11,\"\")))))","v":0},null,5,5.1,null,{"$f":"IF(AB65=\"\",$I$7,IF(VLOOKUP(AB65,Lookups!$A$113:$B$120,2,FALSE)<VLOOKUP(Z65,Lookups!$A$113:$B$120,2,FALSE),$I$8,IF(AND(VLOOKUP(AB65,Lookups!$A$113:$B$120,2,FALSE)>=VLOOKUP(Z65,Lookups!$A$113:$B$120,2,FALSE),VLOOKUP(AB65,Lookups!$A$113:$B$120,2,FALSE)<0.8*VLOOKUP(AA65,Lookups!$A$113:$B$120,2,FALSE)),$I$9,IF(AND(VLOOKUP(AB65,Lookups!$A$113:$B$120,2,FALSE)<=VLOOKUP(AA65,Lookups!$A$113:$B$120,2,FALSE),VLOOKUP(AB65,Lookups!$A$113:$B$120,2,FALSE)>=0.8*VLOOKUP(AA65,Lookups!$A$113:$B$120,2,FALSE)),$I$10,IF(VLOOKUP(AB65,Lookups!$A$113:$B$120,2,FALSE)>VLOOKUP(AA65,Lookups!$A$113:$B$120,2,FALSE),$I$11,\"\")))))","v":0},{"$nulls":3},"Bluetooth 5.1",{"v":0.02,"d":"2.0%"},null,5,5.1,null,{"$f":"IF(AL65=\"\",$I$7,IF(VLOOKUP(AL65,Lookups!$A$113:$B$120,2,FALSE)<VLOOKUP(AJ65,Lookups!$A$113:$B$120,2,FALSE),$I$8,IF(AND(VLOOKUP(AL65,Lookups!$A$113:$B$120,2,FALSE)>=VLOOKUP(AJ65,Lookups!$A$113:$B$120,2,FALSE),VLOOKUP(AL65,Lookups!$A$113:$B$120,2,FALSE)<0.8*VLOOKUP(AK65,Lookups!$A$113:$B$120,2,FALSE)),$I$9,IF(AND(VLOOKUP(AL65,Lookups!$A$113:$B$120,2,FALSE)<=VLOOKUP(AK65,Lookups!$A$113:$B$120,2,FALSE),VLOOKUP(AL65,Lookups!$A$113:$B$120,2,FALSE)>=0.8*VLOOKUP(AK65,Lookups!$A$113:$B$120,2,FALSE)),$I$10,IF(VLOOKUP(AL65,Lookups!$A$113:$B$120,2,FALSE)>VLOOKUP(AK65,Lookups!$A$113:$B$120,2,FALSE),$I$11,\"\")))))","v":0},null,5.1,5.2,null,{"$f":"IF(AQ65=\"\",$I$7,IF(VLOOKUP(AQ65,Lookups!$A$113:$B$120,2,FALSE)<VLOOKUP(AO65,Lookups!$A$113:$B$120,2,FALSE),$I$8,IF(AND(VLOOKUP(AQ65,Lookups!$A$113:$B$120,2,FALSE)>=VLOOKUP(AO65,Lookups!$A$113:$B$120,2,FALSE),VLOOKUP(AQ65,Lookups!$A$113:$B$120,2,FALSE)<0.8*VLOOKUP(AP65,Lookups!$A$113:$B$120,2,FALSE)),$I$9,IF(AND(VLOOKUP(AQ65,Lookups!$A$113:$B$120,2,FALSE)<=VLOOKUP(AP65,Lookups!$A$113:$B$120,2,FALSE),VLOOKUP(AQ65,Lookups!$A$113:$B$120,2,FALSE)>=0.8*VLOOKUP(AP65,Lookups!$A$113:$B$120,2,FALSE)),$I$10,IF(VLOOKUP(AQ65,Lookups!$A$113:$B$120,2,FALSE)>VLOOKUP(AP65,Lookups!$A$113:$B$120,2,FALSE),$I$11,\"\")))))","v":0},null,5.1,5.2,null,{"$f":"IF(AV65=\"\",$I$7,IF(VLOOKUP(AV65,Lookups!$A$113:$B$120,2,FALSE)<VLOOKUP(AT65,Lookups!$A$113:$B$120,2,FALSE),$I$8,IF(AND(VLOOKUP(AV65,Lookups!$A$113:$B$120,2,FALSE)>=VLOOKUP(AT65,Lookups!$A$113:$B$120,2,FALSE),VLOOKUP(AV65,Lookups!$A$113:$B$120,2,FALSE)<0.8*VLOOKUP(AU65,Lookups!$A$113:$B$120,2,FALSE)),$I$9,IF(AND(VLOOKUP(AV65,Lookups!$A$113:$B$120,2,FALSE)<=VLOOKUP(AU65,Lookups!$A$113:$B$120,2,FALSE),VLOOKUP(AV65,Lookups!$A$113:$B$120,2,FALSE)>=0.8*VLOOKUP(AU65,Lookups!$A$113:$B$120,2,FALSE)),$I$10,IF(VLOOKUP(AV65,Lookups!$A$113:$B$120,2,FALSE)>VLOOKUP(AU65,Lookups!$A$113:$B$120,2,FALSE),$I$11,\"\")))))","v":0}]
[null,null,"4G/5G",{"v":0.005,"d":"0.5%"},null,"Not included","5G",null,{"$f":"IF(H66=\"\",$I$7,IF(VLOOKUP(H66,Lookups!$A$123:$B$126,2,FALSE)<VLOOKUP(F66,Lookups!$A$123:$B$126,2,FALSE),$I$8,IF(AND(VLOOKUP(H66,Lookups!$A$123:$B$126,2,FALSE)>=VLOOKUP(F66,Lookups!$A$123:$B$126,2,FALSE),VLOOKUP(H66,Lookups!$A$123:$B$126,2,FALSE)<0.8*VLOOKUP(G66,Lookups!$A$123:$B$126,2,FALSE)),$I$9,IF(AND(VLOOKUP(H66,Lookups!$A$123:$B$126,2,FALSE)<=VLOOKUP(G66,Lookups!$A$123:$B$126,2,FALSE),VLOOKUP(H66,Lookups!$A$123:$B$126,2,FALSE)>=0.8*VLOOKUP(G66,Lookups!$A$123:$B$126,2,FALSE)),$I$10,IF(VLOOKUP(H66,Lookups!$A$123:$B$126,2,FALSE)>VLOOKUP(G66,Lookups!$A$123:$B$126,2,FALSE),$I$11,\"\")))))","v":0},null,"Not included","Not included",null,{"$f":"IF(M66=\"\",$I$7,IF(VLOOKUP(M66,Lookups!$A$123:$B$126,2,FALSE)<VLOOKUP(K66,Lookups!$A$123:$B$126,2,FALSE),$I$8,IF(AND(VLOOKUP(M66,Lookups!$A$123:$B$126,2,FALSE)>=VLOOKUP(K66,Lookups!$A$123:$B$126,2,FALSE),VLOOKUP(M66,Lookups!$A$123:$B$126,2,FALSE)<0.8*VLOOKUP(L66,Lookups!$A$123:$B$126,2,FALSE)),$I$9,IF(AND(VLOOKUP(M66,Lookups!$A$123:$B$126,2,FALSE)<=VLOOKUP(L66,Lookups!$A$123:$B$126,2,FALSE),VLOOKUP(M66,Lookups!$A$123:$B$126,2,FALSE)>=0.8*VLOOKUP(L66,Lookups!$A$123:$B$126,2,FALSE)),$I$10,IF(VLOOKUP(M66,Lookups!$A$123:$B$126,2,FALSE)>VLOOKUP(L66,Lookups!$A$123:$B$126,2,FALSE),$I$11,\"\")))))","v":0},null,"Not included","5G",null,{"$f":"IF(R66=\"\",$I$7,IF(VLOOKUP(R66,Lookups!$A$123:$B$126,2,FALSE)<VLOOKUP(P66,Lookups!$A$123:$B$126,2,FALSE),$I$8,IF(AND(VLOOKUP(R66,Lookups!$A$123:$B$126,2,FALSE)>=VLOOKUP(P66,Lookups!$A$123:$B$126,2,FALSE),VLOOKUP(R66,Lookups!$A$123:$B$126,2,FALSE)<0.8*VLOOKUP(Q66,Lookups!$A$123:$B$126,2,FALSE)),$I$9,IF(AND(VLOOKUP(R66,Lookups!$A$123:$B$126,2,FALSE)<=VLOOKUP(Q66,Lookups!$A$123:$B$126,2,FALSE),VLOOKUP(R66,Lookups!$A$123:$B$126,2,FALSE)>=0.8*VLOOKUP(Q66,Lookups!$A$123:$B$126,2,FALSE)),$I$10,IF(VLOOKUP(R66,Lookups!$A$123:$B$126,2,FALSE)>VLOOKUP(Q66,Lookups!$A$123:$B$126,2,FALSE),$I$11,\"\")))))","v":0},null,"Not included","5G",null,{"$f":"IF(W66=\"\",$I$7,IF(VLOOKUP(W66,Lookups!$A$123:$B$126,2,FALSE)<VLOOKUP(U66,Lookups!$A$123:$B$126,2,FALSE),$I$8,IF(AND(VLOOKUP(W66,Lookups!$A$123:$B$126,2,FALSE)>=VLOOKUP(U66,Lookups!$A$123:$B$126,2,FALSE),VLOOKUP(W66,Lookups!$A$123:$B$126,2,FALSE)<0.8*VLOOKUP(V66,Lookups!$A$123:$B$126,2,FALSE)),$I$9,IF(AND(VLOOKUP(W66,Lookups!$A$123:$B$126,2,FALSE)<=VLOOKUP(V66,Lookups!$A$123:$B$126,2,FALSE),VLOOKUP(W66,Lookups!$A$123:$B$126,2,FALSE)>=0.8*VLOOKUP(V66,Lookups!$A$123:$B$126,2,FALSE)),$I$10,IF(VLOOKUP(W66,Lookups!$A$123:$B$126,2,FALSE)>VLOOKUP(V66,Lookups!$A$123:$B$126,2,FALSE),$I$11,\"\")))))","v":0},null,"Not included","5G",null,{"$f":"IF(AB66=\"\",$I$7,IF(VLOOKUP(AB66,Lookups!$A$123:$B$126,2,FALSE)<VLOOKUP(Z66,Lookups!$A$123:$B$126,2,FALSE),$I$8,IF(AND(VLOOKUP(AB66,Lookups!$A$123:$B$126,2,FALSE)>=VLOOKUP(Z66,Lookups!$A$123:$B$126,2,FALSE),VLOOKUP(AB66,Lookups!$A$123:$B$126,2,FALSE)<0.8*VLOOKUP(AA66,Lookups!$A$123:$B$126,2,FALSE)),$I$9,IF(AND(VLOOKUP(AB66,Lookups!$A$123:$B$126,2,FALSE)<=VLOOKUP(AA66,Lookups!$A$123:$B$126,2,FALSE),VLOOKUP(AB66,Lookups!$A$123:$B$126,2,FALSE)>=0.8*VLOOKUP(AA66,Lookups!$A$123:$B$126,2,FALSE)),$I$10,IF(VLOOKUP(AB66,Lookups!$A$123:$B$126,2,FALSE)>VLOOKUP(AA66,Lookups!$A$123:$B$126,2,FALSE),$I$11,\"\")))))","v":0},{"$nulls":3},"4G/5G",{"v":0,"d":"0.0%"},{"$nulls":4},{"$f":"IF(AL66=\"\",$I$7,IF(VLOOKUP(AL66,Lookups!$A$123:$B$126,2,FALSE)<VLOOKUP(AJ66,Lookups!$A$123:$B$126,2,FALSE),$I$8,IF(AND(VLOOKUP(AL66,Lookups!$A$123:$B$126,2,FALSE)>=VLOOKUP(AJ66,Lookups!$A$123:$B$126,2,FALSE),VLOOKUP(AL66,Lookups!$A$123:$B$126,2,FALSE)<0.8*VLOOKUP(AK66,Lookups!$A$123:$B$126,2,FALSE)),$I$9,IF(AND(VLOOKUP(AL66,Lookups!$A$123:$B$126,2,FALSE)<=VLOOKUP(AK66,Lookups!$A$123:$B$126,2,FALSE),VLOOKUP(AL66,Lookups!$A$123:$B$126,2,FALSE)>=0.8*VLOOKUP(AK66,Lookups!$A$123:$B$126,2,FALSE)),$I$10,IF(VLOOKUP(AL66,Lookups!$A$123:$B$126,2,FALSE)>VLOOKUP(AK66,Lookups!$A$123:$B$126,2,FALSE),$I$11,\"\")))))","v":0},{"$nulls":4},{"$f":"IF(AQ66=\"\",$I$7,IF(VLOOKUP(AQ66,Lookups!$A$123:$B$126,2,FALSE)<VLOOKUP(AO66,Lookups!$A$123:$B$126,2,FALSE),$I$8,IF(AND(VLOOKUP(AQ66,Lookups!$A$123:$B$126,2,FALSE)>=VLOOKUP(AO66,Lookups!$A$123:$B$126,2,FALSE),VLOOKUP(AQ66,Lookups!$A$123:$B$126,2,FALSE)<0.8*VLOOKUP(AP66,Lookups!$A$123:$B$126,2,FALSE)),$I$9,IF(AND(VLOOKUP(AQ66,Lookups!$A$123:$B$126,2,FALSE)<=VLOOKUP(AP66,Lookups!$A$123:$B$126,2,FALSE),VLOOKUP(AQ66,Lookups!$A$123:$B$126,2,FALSE)>=0.8*VLOOKUP(AP66,Lookups!$A$123:$B$126,2,FALSE)),$I$10,IF(VLOOKUP(AQ66,Lookups!$A$123:$B$126,2,FALSE)>VLOOKUP(AP66,Lookups!$A$123:$B$126,2,FALSE),$I$11,\"\")))))","v":0},{"$nulls":4},{"$f":"IF(AV66=\"\",$I$7,IF(VLOOKUP(AV66,Lookups!$A$123:$B$126,2,FALSE)<VLOOKUP(AT66,Lookups!$A$123:$B$126,2,FALSE),$I$8,IF(AND(VLOOKUP(AV66,Lookups!$A$123:$B$126,2,FALSE)>=VLOOKUP(AT66,Lookups!$A$123:$B$126,2,FALSE),VLOOKUP(AV66,Lookups!$A$123:$B$126,2,FALSE)<0.8*VLOOKUP(AU66,Lookups!$A$123:$B$126,2,FALSE)),$I$9,IF(AND(VLOOKUP(AV66,Lookups!$A$123:$B$126,2,FALSE)<=VLOOKUP(AU66,Lookups!$A$123:$B$126,2,FALSE),VLOOKUP(AV66,Lookups!$A$123:$B$126,2,FALSE)>=0.8*VLOOKUP(AU66,Lookups!$A$123:$B$126,2,FALSE)),$I$10,IF(VLOOKUP(AV66,Lookups!$A$123:$B$126,2,FALSE)>VLOOKUP(AU66,Lookups!$A$123:$B$126,2,FALSE),$I$11,\"\")))))","v":0}]
[{"$f":"SUM(D67:D72)","v":{"v":0.01,"d":"1%"}},"Keyboard","USA QWERTY layout",{"v":0,"d":"0.0%"},null,"Yes","Yes",null,{"$f":"IF(H67=\"\",$I$7,IF(VLOOKUP(H67,Lookups!$A$31:$B$33,2,FALSE)<VLOOKUP(F67,Lookups!$A$31:$B$33,2,FALSE),$I$8,IF(AND(VLOOKUP(H67,Lookups!$A$31:$B$33,2,FALSE)>=VLOOKUP(F67,Lookups!$A$31:$B$33,2,FALSE),VLOOKUP(H67,Lookups!$A$31:$B$33,2,FALSE)<0.8*VLOOKUP(G67,Lookups!$A$31:$B$33,2,FALSE)),$I$9,IF(AND(VLOOKUP(H67,Lookups!$A$31:$B$33,2,FALSE)<=VLOOKUP(G67,Lookups!$A$31:$B$33,2,FALSE),VLOOKUP(H67,Lookups!$A$31:$B$33,2,FALSE)>=0.8*VLOOKUP(G67,Lookups!$A$31:$B$33,2,FALSE)),$I$10,IF(VLOOKUP(H67,Lookups!$A$31:$B$33,2,FALSE)>VLOOKUP(G67,Lookups!$A$31:$B$33,2,FALSE),$I$11,\"\")))))","v":0},null,"Yes","Yes",null,{"$f":"IF(M67=\"\",$I$7,IF(VLOOKUP(M67,Lookups!$A$31:$B$33,2,FALSE)<VLOOKUP(K67,Lookups!$A$31:$B$33,2,FALSE),$I$8,IF(AND(VLOOKUP(M67,Lookups!$A$31:$B$33,2,FALSE)>=VLOOKUP(K67,Lookups!$A$31:$B$33,2,FALSE),VLOOKUP(M67,Lookups!$A$31:$B$33,2,FALSE)<0.8*VLOOKUP(L67,Lookups!$A$31:$B$33,2,FALSE)),$I$9,IF(AND(VLOOKUP(M67,Lookups!$A$31:$B$33,2,FALSE)<=VLOOKUP(L67,Lookups!$A$31:$B$33,2,FALSE),VLOOKUP(M67,Lookups!$A$31:$B$33,2,FALSE)>=0.8*VLOOKUP(L67,Lookups!$A$31:$B$33,2,FALSE)),$I$10,IF(VLOOKUP(M67,Lookups!$A$31:$B$33,2,FALSE)>VLOOKUP(L67,Lookups!$A$31:$B$33,2,FALSE),$I$11,\"\")))))","v":0},null,"Yes","Yes",null,{"$f":"IF(R67=\"\",$I$7,IF(VLOOKUP(R67,Lookups!$A$31:$B$33,2,FALSE)<VLOOKUP(P67,Lookups!$A$31:$B$33,2,FALSE),$I$8,IF(AND(VLOOKUP(R67,Lookups!$A$31:$B$33,2,FALSE)>=VLOOKUP(P67,Lookups!$A$31:$B$33,2,FALSE),VLOOKUP(R67,Lookups!$A$31:$B$33,2,FALSE)<0.8*VLOOKUP(Q67,Lookups!$A$31:$B$33,2,FALSE)),$I$9,IF(AND(VLOOKUP(R67,Lookups!$A$31:$B$33,2,FALSE)<=VLOOKUP(Q67,Lookups!$A$31:$B$33,2,FALSE),VLOOKUP(R67,Lookups!$A$31:$B$33,2,FALSE)>=0.8*VLOOKUP(Q67,Lookups!$A$31:$B$33,2,FALSE)),$I$10,IF(VLOOKUP(R67,Lookups!$A$31:$B$33,2,FALSE)>VLOOKUP(Q67,Lookups!$A$31:$B$33,2,FALSE),$I$11,\"\")))))","v":0},null,"Yes","Yes",null,{"$f":"IF(W67=\"\",$I$7,IF(VLOOKUP(W67,Lookups!$A$31:$B$33,2,FALSE)<VLOOKUP(U67,Lookups!$A$31:$B$33,2,FALSE),$I$8,IF(AND(VLOOKUP(W67,Lookups!$A$31:$B$33,2,FALSE)>=VLOOKUP(U67,Lookups!$A$31:$B$33,2,FALSE),VLOOKUP(W67,Lookups!$A$31:$B$33,2,FALSE)<0.8*VLOOKUP(V67,Lookups!$A$31:$B$33,2,FALSE)),$I$9,IF(AND(VLOOKUP(W67,Lookups!$A$31:$B$33,2,FALSE)<=VLOOKUP(V67,Lookups!$A$31:$B$33,2,FALSE),VLOOKUP(W67,Lookups!$A$31:$B$33,2,FALSE)>=0.8*VLOOKUP(V67,Lookups!$A$31:$B$33,2,FALSE)),$I$10,IF(VLOOKUP(W67,Lookups!$A$31:$B$33,2,FALSE)>VLOOKUP(V67,Lookups!$A$31:$B$33,2,FALSE),$I$11,\"\")))))","v":0},null,"Yes","Yes",null,{"$f":"IF(AB67=\"\",$I$7,IF(VLOOKUP(AB67,Lookups!$A$31:$B$33,2,FALSE)<VLOOKUP(Z67,Lookups!$A$31:$B$33,2,FALSE),$I$8,IF(AND(VLOOKUP(AB67,Lookups!$A$31:$B$33,2,FALSE)>=VLOOKUP(Z67,Lookups!$A$31:$B$33,2,FALSE),VLOOKUP(AB67,Lookups!$A$31:$B$33,2,FALSE)<0.8*VLOOKUP(AA67,Lookups!$A$31:$B$33,2,FALSE)),$I$9,IF(AND(VLOOKUP(AB67,Lookups!$A$31:$B$33,2,FALSE)<=VLOOKUP(AA67,Lookups!$A$31:$B$33,2,FALSE),VLOOKUP(AB67,Lookups!$A$31:$B$33,2,FALSE)>=0.8*VLOOKUP(AA67,Lookups!$A$31:$B$33,2,FALSE)),$I$10,IF(VLOOKUP(AB67,Lookups!$A$31:$B$33,2,FALSE)>VLOOKUP(AA67,Lookups!$A$31:$B$33,2,FALSE),$I$11,\"\")))))","v":0},null,{"$f":"SUM(AH67:AH72)","v":{"v":0.030000000000000002,"d":"3%"}},"Keyboard","USA QWERTY layout",{"v":0.005,"d":"0.5%"},null,"Yes","Yes",null,{"$f":"IF(AL67=\"\",$I$7,IF(VLOOKUP(AL67,Lookups!$A$31:$B$33,2,FALSE)<VLOOKUP(AJ67,Lookups!$A$31:$B$33,2,FALSE),$I$8,IF(AND(VLOOKUP(AL67,Lookups!$A$31:$B$33,2,FALSE)>=VLOOKUP(AJ67,Lookups!$A$31:$B$33,2,FALSE),VLOOKUP(AL67,Lookups!$A$31:$B$33,2,FALSE)<0.8*VLOOKUP(AK67,Lookups!$A$31:$B$33,2,FALSE)),$I$9,IF(AND(VLOOKUP(AL67,Lookups!$A$31:$B$33,2,FALSE)<=VLOOKUP(AK67,Lookups!$A$31:$B$33,2,FALSE),VLOOKUP(AL67,Lookups!$A$31:$B$33,2,FALSE)>=0.8*VLOOKUP(AK67,Lookups!$A$31:$B$33,2,FALSE)),$I$10,IF(VLOOKUP(AL67,Lookups!$A$31:$B$33,2,FALSE)>VLOOKUP(AK67,Lookups!$A$31:$B$33,2,FALSE),$I$11,\"\")))))","v":0},null,"Yes","Yes",null,{"$f":"IF(AQ67=\"\",$I$7,IF(VLOOKUP(AQ67,Lookups!$A$31:$B$33,2,FALSE)<VLOOKUP(AO67,Lookups!$A$31:$B$33,2,FALSE),$I$8,IF(AND(VLOOKUP(AQ67,Lookups!$A$31:$B$33,2,FALSE)>=VLOOKUP(AO67,Lookups!$A$31:$B$33,2,FALSE),VLOOKUP(AQ67,Lookups!$A$31:$B$33,2,FALSE)<0.8*VLOOKUP(AP67,Lookups!$A$31:$B$33,2,FALSE)),$I$9,IF(AND(VLOOKUP(AQ67,Lookups!$A$31:$B$33,2,FALSE)<=VLOOKUP(AP67,Lookups!$A$31:$B$33,2,FALSE),VLOOKUP(AQ67,Lookups!$A$31:$B$33,2,FALSE)>=0.8*VLOOKUP(AP67,Lookups!$A$31:$B$33,2,FALSE)),$I$10,IF(VLOOKUP(AQ67,Lookups!$A$31:$B$33,2,FALSE)>VLOOKUP(AP67,Lookups!$A$31:$B$33,2,FALSE),$I$11,\"\")))))","v":0},null,"Yes","Yes",null,{"$f":"IF(AV67=\"\",$I$7,IF(VLOOKUP(AV67,Lookups!$A$31:$B$33,2,FALSE)<VLOOKUP(AT67,Lookups!$A$31:$B$33,2,FALSE),$I$8,IF(AND(VLOOKUP(AV67,Lookups!$A$31:$B$33,2,FALSE)>=VLOOKUP(AT67,Lookups!$A$31:$B$33,2,FALSE),VLOOKUP(AV67,Lookups!$A$31:$B$33,2,FALSE)<0.8*VLOOKUP(AU67,Lookups!$A$31:$B$33,2,FALSE)),$I$9,IF(AND(VLOOKUP(AV67,Lookups!$A$31:$B$33,2,FALSE)<=VLOOKUP(AU67,Lookups!$A$31:$B$33,2,FALSE),VLOOKUP(AV67,Lookups!$A$31:$B$33,2,FALSE)>=0.8*VLOOKUP(AU67,Lookups!$A$31:$B$33,2,FALSE)),$I$10,IF(VLOOKUP(AV67,Lookups!$A$31:$B$33,2,FALSE)>VLOOKUP(AU67,Lookups!$A$31:$B$33,2,FALSE),$I$11,\"\")))))","v":0}]
[null,null,"Laptop-like keys",{"v":0,"d":"0.0%"},null,"Yes","Yes",null,{"$f":"IF(H68=\"\",$I$7,IF(VLOOKUP(H68,Lookups!$A$31:$B$33,2,FALSE)<VLOOKUP(F68,Lookups!$A$31:$B$33,2,FALSE),$I$8,IF(AND(VLOOKUP(H68,Lookups!$A$31:$B$33,2,FALSE)>=VLOOKUP(F68,Lookups!$A$31:$B$33,2,FALSE),VLOOKUP(H68,Lookups!$A$31:$B$33,2,FALSE)<0.8*VLOOKUP(G68,Lookups!$A$31:$B$33,2,FALSE)),$I$9,IF(AND(VLOOKUP(H68,Lookups!$A$31:$B$33,2,FALSE)<=VLOOKUP(G68,Lookups!$A$31:$B$33,2,FALSE),VLOOKUP(H68,Lookups!$A$31:$B$33,2,FALSE)>=0.8*VLOOKUP(G68,Lookups!$A$31:$B$33,2,FALSE)),$I$10,IF(VLOOKUP(H68,Lookups!$A$31:$B$33,2,FALSE)>VLOOKUP(G68,Lookups!$A$31:$B$33,2,FALSE),$I$11,\"\")))))","v":0},null,"Yes","Yes",null,{"$f":"IF(M68=\"\",$I$7,IF(VLOOKUP(M68,Lookups!$A$31:$B$33,2,FALSE)<VLOOKUP(K68,Lookups!$A$31:$B$33,2,FALSE),$I$8,IF(AND(VLOOKUP(M68,Lookups!$A$31:$B$33,2,FALSE)>=VLOOKUP(K68,Lookups!$A$31:$B$33,2,FALSE),VLOOKUP(M68,Lookups!$A$31:$B$33,2,FALSE)<0.8*VLOOKUP(L68,Lookups!$A$31:$B$33,2,FALSE)),$I$9,IF(AND(VLOOKUP(M68,Lookups!$A$31:$B$33,2,FALSE)<=VLOOKUP(L68,Lookups!$A$31:$B$33,2,FALSE),VLOOKUP(M68,Lookups!$A$31:$B$33,2,FALSE)>=0.8*VLOOKUP(L68,Lookups!$A$31:$B$33,2,FALSE)),$I$10,IF(VLOOKUP(M68,Lookups!$A$31:$B$33,2,FALSE)>VLOOKUP(L68,Lookups!$A$31:$B$33,2,FALSE),$I$11,\"\")))))","v":0},null,"Yes","Yes",null,{"$f":"IF(R68=\"\",$I$7,IF(VLOOKUP(R68,Lookups!$A$31:$B$33,2,FALSE)<VLOOKUP(P68,Lookups!$A$31:$B$33,2,FALSE),$I$8,IF(AND(VLOOKUP(R68,Lookups!$A$31:$B$33,2,FALSE)>=VLOOKUP(P68,Lookups!$A$31:$B$33,2,FALSE),VLOOKUP(R68,Lookups!$A$31:$B$33,2,FALSE)<0.8*VLOOKUP(Q68,Lookups!$A$31:$B$33,2,FALSE)),$I$9,IF(AND(VLOOKUP(R68,Lookups!$A$31:$B$33,2,FALSE)<=VLOOKUP(Q68,Lookups!$A$31:$B$33,2,FALSE),VLOOKUP(R68,Lookups!$A$31:$B$33,2,FALSE)>=0.8*VLOOKUP(Q68,Lookups!$A$31:$B$33,2,FALSE)),$I$10,IF(VLOOKUP(R68,Lookups!$A$31:$B$33,2,FALSE)>VLOOKUP(Q68,Lookups!$A$31:$B$33,2,FALSE),$I$11,\"\")))))","v":0},null,"Yes","Yes",null,{"$f":"IF(W68=\"\",$I$7,IF(VLOOKUP(W68,Lookups!$A$31:$B$33,2,FALSE)<VLOOKUP(U68,Lookups!$A$31:$B$33,2,FALSE),$I$8,IF(AND(VLOOKUP(W68,Lookups!$A$31:$B$33,2,FALSE)>=VLOOKUP(U68,Lookups!$A$31:$B$33,2,FALSE),VLOOKUP(W68,Lookups!$A$31:$B$33,2,FALSE)<0.8*VLOOKUP(V68,Lookups!$A$31:$B$33,2,FALSE)),$I$9,IF(AND(VLOOKUP(W68,Lookups!$A$31:$B$33,2,FALSE)<=VLOOKUP(V68,Lookups!$A$31:$B$33,2,FALSE),VLOOKUP(W68,Lookups!$A$31:$B$33,2,FALSE)>=0.8*VLOOKUP(V68,Lookups!$A$31:$B$33,2,FALSE)),$I$10,IF(VLOOKUP(W68,Lookups!$A$31:$B$33,2,FALSE)>VLOOKUP(V68,Lookups!$A$31:$B$33,2,FALSE),$I$11,\"\")))))","v":0},null,"Yes","Yes",null,{"$f":"IF(AB68=\"\",$I$7,IF(VLOOKUP(AB68,Lookups!$A$31:$B$33,2,FALSE)<VLOOKUP(Z68,Lookups!$A$31:$B$33,2,FALSE),$I$8,IF(AND(VLOOKUP(AB68,Lookups!$A$31:$B$33,2,FALSE)>=VLOOKUP(Z68,Lookups!$A$31:$B$33,2,FALSE),VLOOKUP(AB68,Lookups!$A$31:$B$33,2,FALSE)<0.8*VLOOKUP(AA68,Lookups!$A$31:$B$33,2,FALSE)),$I$9,IF(AND(VLOOKUP(AB68,Lookups!$A$31:$B$33,2,FALSE)<=VLOOKUP(AA68,Lookups!$A$31:$B$33,2,FALSE),VLOOKUP(AB68,Lookups!$A$31:$B$33,2,FALSE)>=0.8*VLOOKUP(AA68,Lookups!$A$31:$B$33,2,FALSE)),$I$10,IF(VLOOKUP(AB68,Lookups!$A$31:$B$33,2,FALSE)>VLOOKUP(AA68,Lookups!$A$31:$B$33,2,FALSE),$I$11,\"\")))))","v":0},{"$nulls":3},"Laptop-like keys",{"v":0.005,"d":"0.5%"},null,"Yes","Yes",null,{"$f":"IF(AL68=\"\",$I$7,IF(VLOOKUP(AL68,Lookups!$A$31:$B$33,2,FALSE)<VLOOKUP(AJ68,Lookups!$A$31:$B$33,2,FALSE),$I$8,IF(AND(VLOOKUP(AL68,Lookups!$A$31:$B$33,2,FALSE)>=VLOOKUP(AJ68,Lookups!$A$31:$B$33,2,FALSE),VLOOKUP(AL68,Lookups!$A$31:$B$33,2,FALSE)<0.8*VLOOKUP(AK68,Lookups!$A$31:$B$33,2,FALSE)),$I$9,IF(AND(VLOOKUP(AL68,Lookups!$A$31:$B$33,2,FALSE)<=VLOOKUP(AK68,Lookups!$A$31:$B$33,2,FALSE),VLOOKUP(AL68,Lookups!$A$31:$B$33,2,FALSE)>=0.8*VLOOKUP(AK68,Lookups!$A$31:$B$33,2,FALSE)),$I$10,IF(VLOOKUP(AL68,Lookups!$A$31:$B$33,2,FALSE)>VLOOKUP(AK68,Lookups!$A$31:$B$33,2,FALSE),$I$11,\"\")))))","v":0},null,"Yes","Yes",null,{"$f":"IF(AQ68=\"\",$I$7,IF(VLOOKUP(AQ68,Lookups!$A$31:$B$33,2,FALSE)<VLOOKUP(AO68,Lookups!$A$31:$B$33,2,FALSE),$I$8,IF(AND(VLOOKUP(AQ68,Lookups!$A$31:$B$33,2,FALSE)>=VLOOKUP(AO68,Lookups!$A$31:$B$33,2,FALSE),VLOOKUP(AQ68,Lookups!$A$31:$B$33,2,FALSE)<0.8*VLOOKUP(AP68,Lookups!$A$31:$B$33,2,FALSE)),$I$9,IF(AND(VLOOKUP(AQ68,Lookups!$A$31:$B$33,2,FALSE)<=VLOOKUP(AP68,Lookups!$A$31:$B$33,2,FALSE),VLOOKUP(AQ68,Lookups!$A$31:$B$33,2,FALSE)>=0.8*VLOOKUP(AP68,Lookups!$A$31:$B$33,2,FALSE)),$I$10,IF(VLOOKUP(AQ68,Lookups!$A$31:$B$33,2,FALSE)>VLOOKUP(AP68,Lookups!$A$31:$B$33,2,FALSE),$I$11,\"\")))))","v":0},null,"Yes","Yes",null,{"$f":"IF(AV68=\"\",$I$7,IF(VLOOKUP(AV68,Lookups!$A$31:$B$33,2,FALSE)<VLOOKUP(AT68,Lookups!$A$31:$B$33,2,FALSE),$I$8,IF(AND(VLOOKUP(AV68,Lookups!$A$31:$B$33,2,FALSE)>=VLOOKUP(AT68,Lookups!$A$31:$B$33,2,FALSE),VLOOKUP(AV68,Lookups!$A$31:$B$33,2,FALSE)<0.8*VLOOKUP(AU68,Lookups!$A$31:$B$33,2,FALSE)),$I$9,IF(AND(VLOOKUP(AV68,Lookups!$A$31:$B$33,2,FALSE)<=VLOOKUP(AU68,Lookups!$A$31:$B$33,2,FALSE),VLOOKUP(AV68,Lookups!$A$31:$B$33,2,FALSE)>=0.8*VLOOKUP(AU68,Lookups!$A$31:$B$33,2,FALSE)),$I$10,IF(VLOOKUP(AV68,Lookups!$A$31:$B$33,2,FALSE)>VLOOKUP(AU68,Lookups!$A$31:$B$33,2,FALSE),$I$11,\"\")))))","v":0}]
[null,null,"Backlit keys",{"v":0.005,"d":"0.5%"},null,"Yes","Yes",null,{"$f":"IF(H69=\"\",$I$7,IF(VLOOKUP(H69,Lookups!$A$31:$B$33,2,FALSE)<VLOOKUP(F69,Lookups!$A$31:$B$33,2,FALSE),$I$8,IF(AND(VLOOKUP(H69,Lookups!$A$31:$B$33,2,FALSE)>=VLOOKUP(F69,Lookups!$A$31:$B$33,2,FALSE),VLOOKUP(H69,Lookups!$A$31:$B$33,2,FALSE)<0.8*VLOOKUP(G69,Lookups!$A$31:$B$33,2,FALSE)),$I$9,IF(AND(VLOOKUP(H69,Lookups!$A$31:$B$33,2,FALSE)<=VLOOKUP(G69,Lookups!$A$31:$B$33,2,FALSE),VLOOKUP(H69,Lookups!$A$31:$B$33,2,FALSE)>=0.8*VLOOKUP(G69,Lookups!$A$31:$B$33,2,FALSE)),$I$10,IF(VLOOKUP(H69,Lookups!$A$31:$B$33,2,FALSE)>VLOOKUP(G69,Lookups!$A$31:$B$33,2,FALSE),$I$11,\"\")))))","v":0},null,"Yes","Yes",null,{"$f":"IF(M69=\"\",$I$7,IF(VLOOKUP(M69,Lookups!$A$31:$B$33,2,FALSE)<VLOOKUP(K69,Lookups!$A$31:$B$33,2,FALSE),$I$8,IF(AND(VLOOKUP(M69,Lookups!$A$31:$B$33,2,FALSE)>=VLOOKUP(K69,Lookups!$A$31:$B$33,2,FALSE),VLOOKUP(M69,Lookups!$A$31:$B$33,2,FALSE)<0.8*VLOOKUP(L69,Lookups!$A$31:$B$33,2,FALSE)),$I$9,IF(AND(VLOOKUP(M69,Lookups!$A$31:$B$33,2,FALSE)<=VLOOKUP(L69,Lookups!$A$31:$B$33,2,FALSE),VLOOKUP(M69,Lookups!$A$31:$B$33,2,FALSE)>=0.8*VLOOKUP(L69,Lookups!$A$31:$B$33,2,FALSE)),$I$10,IF(VLOOKUP(M69,Lookups!$A$31:$B$33,2,FALSE)>VLOOKUP(L69,Lookups!$A$31:$B$33,2,FALSE),$I$11,\"\")))))","v":0},null,"Yes","Yes",null,{"$f":"IF(R69=\"\",$I$7,IF(VLOOKUP(R69,Lookups!$A$31:$B$33,2,FALSE)<VLOOKUP(P69,Lookups!$A$31:$B$33,2,FALSE),$I$8,IF(AND(VLOOKUP(R69,Lookups!$A$31:$B$33,2,FALSE)>=VLOOKUP(P69,Lookups!$A$31:$B$33,2,FALSE),VLOOKUP(R69,Lookups!$A$31:$B$33,2,FALSE)<0.8*VLOOKUP(Q69,Lookups!$A$31:$B$33,2,FALSE)),$I$9,IF(AND(VLOOKUP(R69,Lookups!$A$31:$B$33,2,FALSE)<=VLOOKUP(Q69,Lookups!$A$31:$B$33,2,FALSE),VLOOKUP(R69,Lookups!$A$31:$B$33,2,FALSE)>=0.8*VLOOKUP(Q69,Lookups!$A$31:$B$33,2,FALSE)),$I$10,IF(VLOOKUP(R69,Lookups!$A$31:$B$33,2,FALSE)>VLOOKUP(Q69,Lookups!$A$31:$B$33,2,FALSE),$I$11,\"\")))))","v":0},null,"Yes","Yes",null,{"$f":"IF(W69=\"\",$I$7,IF(VLOOKUP(W69,Lookups!$A$31:$B$33,2,FALSE)<VLOOKUP(U69,Lookups!$A$31:$B$33,2,FALSE),$I$8,IF(AND(VLOOKUP(W69,Lookups!$A$31:$B$33,2,FALSE)>=VLOOKUP(U69,Lookups!$A$31:$B$33,2,FALSE),VLOOKUP(W69,Lookups!$A$31:$B$33,2,FALSE)<0.8*VLOOKUP(V69,Lookups!$A$31:$B$33,2,FALSE)),$I$9,IF(AND(VLOOKUP(W69,Lookups!$A$31:$B$33,2,FALSE)<=VLOOKUP(V69,Lookups!$A$31:$B$33,2,FALSE),VLOOKUP(W69,Lookups!$A$31:$B$33,2,FALSE)>=0.8*VLOOKUP(V69,Lookups!$A$31:$B$33,2,FALSE)),$I$10,IF(VLOOKUP(W69,Lookups!$A$31:$B$33,2,FALSE)>VLOOKUP(V69,Lookups!$A$31:$B$33,2,FALSE),$I$11,\"\")))))","v":0},null,"Yes","Yes",null,{"$f":"IF(AB69=\"\",$I$7,IF(VLOOKUP(AB69,Lookups!$A$31:$B$33,2,FALSE)<VLOOKUP(Z69,Lookups!$A$31:$B$33,2,FALSE),$I$8,IF(AND(VLOOKUP(AB69,Lookups!$A$31:$B$33,2,FALSE)>=VLOOKUP(Z69,Lookups!$A$31:$B$33,2,FALSE),VLOOKUP(AB69,Lookups!$A$31:$B$33,2,FALSE)<0.8*VLOOKUP(AA69,Lookups!$A$31:$B$33,2,FALSE)),$I$9,IF(AND(VLOOKUP(AB69,Lookups!$A$31:$B$33,2,FALSE)<=VLOOKUP(AA69,Lookups!$A$31:$B$33,2,FALSE),VLOOKUP(AB69,Lookups!$A$31:$B$33,2,FALSE)>=0.8*VLOOKUP(AA69,Lookups!$A$31:$B$33,2,FALSE)),$I$10,IF(VLOOKUP(AB69,Lookups!$A$31:$B$33,2,FALSE)>VLOOKUP(AA69,Lookups!$A$31:$B$33,2,FALSE),$I$11,\"\")))))","v":0},{"$nulls":3},"Backlit keys",{"v":0.005,"d":"0.5%"},null,"Yes","Yes",null,{"$f":"IF(AL69=\"\",$I$7,IF(VLOOKUP(AL69,Lookups!$A$31:$B$33,2,FALSE)<VLOOKUP(AJ69,Lookups!$A$31:$B$33,2,FALSE),$I$8,IF(AND(VLOOKUP(AL69,Lookups!$A$31:$B$33,2,FALSE)>=VLOOKUP(AJ69,Lookups!$A$31:$B$33,2,FALSE),VLOOKUP(AL69,Lookups!$A$31:$B$33,2,FALSE)<0.8*VLOOKUP(AK69,Lookups!$A$31:$B$33,2,FALSE)),$I$9,IF(AND(VLOOKUP(AL69,Lookups!$A$31:$B$33,2,FALSE)<=VLOOKUP(AK69,Lookups!$A$31:$B$33,2,FALSE),VLOOKUP(AL69,Lookups!$A$31:$B$33,2,FALSE)>=0.8*VLOOKUP(AK69,Lookups!$A$31:$B$33,2,FALSE)),$I$10,IF(VLOOKUP(AL69,Lookups!$A$31:$B$33,2,FALSE)>VLOOKUP(AK69,Lookups!$A$31:$B$33,2,FALSE),$I$11,\"\")))))","v":0},null,"Yes","Yes",null,{"$f":"IF(AQ69=\"\",$I$7,IF(VLOOKUP(AQ69,Lookups!$A$31:$B$33,2,FALSE)<VLOOKUP(AO69,Lookups!$A$31:$B$33,2,FALSE),$I$8,IF(AND(VLOOKUP(AQ69,Lookups!$A$31:$B$33,2,FALSE)>=VLOOKUP(AO69,Lookups!$A$31:$B$33,2,FALSE),VLOOKUP(AQ69,Lookups!$A$31:$B$33,2,FALSE)<0.8*VLOOKUP(AP69,Lookups!$A$31:$B$33,2,FALSE)),$I$9,IF(AND(VLOOKUP(AQ69,Lookups!$A$31:$B$33,2,FALSE)<=VLOOKUP(AP69,Lookups!$A$31:$B$33,2,FALSE),VLOOKUP(AQ69,Lookups!$A$31:$B$33,2,FALSE)>=0.8*VLOOKUP(AP69,Lookups!$A$31:$B$33,2,FALSE)),$I$10,IF(VLOOKUP(AQ69,Lookups!$A$31:$B$33,2,FALSE)>VLOOKUP(AP69,Lookups!$A$31:$B$33,2,FALSE),$I$11,\"\")))))","v":0},null,"Yes","Yes",null,{"$f":"IF(AV69=\"\",$I$7,IF(VLOOKUP(AV69,Lookups!$A$31:$B$33,2,FALSE)<VLOOKUP(AT69,Lookups!$A$31:$B$33,2,FALSE),$I$8,IF(AND(VLOOKUP(AV69,Lookups!$A$31:$B$33,2,FALSE)>=VLOOKUP(AT69,Lookups!$A$31:$B$33,2,FALSE),VLOOKUP(AV69,Lookups!$A$31:$B$33,2,FALSE)<0.8*VLOOKUP(AU69,Lookups!$A$31:$B$33,2,FALSE)),$I$9,IF(AND(VLOOKUP(AV69,Lookups!$A$31:$B$33,2,FALSE)<=VLOOKUP(AU69,Lookups!$A$31:$B$33,2,FALSE),VLOOKUP(AV69,Lookups!$A$31:$B$33,2,FALSE)>=0.8*VLOOKUP(AU69,Lookups!$A$31:$B$33,2,FALSE)),$I$10,IF(VLOOKUP(AV69,Lookups!$A$31:$B$33,2,FALSE)>VLOOKUP(AU69,Lookups!$A$31:$B$33,2,FALSE),$I$11,\"\")))))","v":0}]
[null,null,"Keyboard size",{"v":0.005,"d":"0.5%"},null,"Compact","Compact with numpad",null,{"$f":"IF(H70=\"\",$I$7,IF(VLOOKUP(H70,Lookups!$A$36:$B$39,2,FALSE)<VLOOKUP(F70,Lookups!$A$36:$B$39,2,FALSE),$I$8,IF(AND(VLOOKUP(H70,Lookups!$A$36:$B$39,2,FALSE)>=VLOOKUP(F70,Lookups!$A$36:$B$39,2,FALSE),VLOOKUP(H70,Lookups!$A$36:$B$39,2,FALSE)<0.8*VLOOKUP(G70,Lookups!$A$36:$B$39,2,FALSE)),$I$9,IF(AND(VLOOKUP(H70,Lookups!$A$36:$B$39,2,FALSE)<=VLOOKUP(G70,Lookups!$A$36:$B$39,2,FALSE),VLOOKUP(H70,Lookups!$A$36:$B$39,2,FALSE)>=0.8*VLOOKUP(G70,Lookups!$A$36:$B$39,2,FALSE)),$I$10,IF(VLOOKUP(H70,Lookups!$A$36:$B$39,2,FALSE)>VLOOKUP(G70,Lookups!$A$36:$B$39,2,FALSE),$I$11,\"\")))))","v":0},null,"Compact with numpad","Compact with numpad",null,{"$f":"IF(M70=\"\",$I$7,IF(VLOOKUP(M70,Lookups!$A$36:$B$39,2,FALSE)<VLOOKUP(K70,Lookups!$A$36:$B$39,2,FALSE),$I$8,IF(AND(VLOOKUP(M70,Lookups!$A$36:$B$39,2,FALSE)>=VLOOKUP(K70,Lookups!$A$36:$B$39,2,FALSE),VLOOKUP(M70,Lookups!$A$36:$B$39,2,FALSE)<0.8*VLOOKUP(L70,Lookups!$A$36:$B$39,2,FALSE)),$I$9,IF(AND(VLOOKUP(M70,Lookups!$A$36:$B$39,2,FALSE)<=VLOOKUP(L70,Lookups!$A$36:$B$39,2,FALSE),VLOOKUP(M70,Lookups!$A$36:$B$39,2,FALSE)>=0.8*VLOOKUP(L70,Lookups!$A$36:$B$39,2,FALSE)),$I$10,IF(VLOOKUP(M70,Lookups!$A$36:$B$39,2,FALSE)>VLOOKUP(L70,Lookups!$A$36:$B$39,2,FALSE),$I$11,\"\")))))","v":0},null,"Compact with numpad","Compact with numpad",null,{"$f":"IF(R70=\"\",$I$7,IF(VLOOKUP(R70,Lookups!$A$36:$B$39,2,FALSE)<VLOOKUP(P70,Lookups!$A$36:$B$39,2,FALSE),$I$8,IF(AND(VLOOKUP(R70,Lookups!$A$36:$B$39,2,FALSE)>=VLOOKUP(P70,Lookups!$A$36:$B$39,2,FALSE),VLOOKUP(R70,Lookups!$A$36:$B$39,2,FALSE)<0.8*VLOOKUP(Q70,Lookups!$A$36:$B$39,2,FALSE)),$I$9,IF(AND(VLOOKUP(R70,Lookups!$A$36:$B$39,2,FALSE)<=VLOOKUP(Q70,Lookups!$A$36:$B$39,2,FALSE),VLOOKUP(R70,Lookups!$A$36:$B$39,2,FALSE)>=0.8*VLOOKUP(Q70,Lookups!$A$36:$B$39,2,FALSE)),$I$10,IF(VLOOKUP(R70,Lookups!$A$36:$B$39,2,FALSE)>VLOOKUP(Q70,Lookups!$A$36:$B$39,2,FALSE),$I$11,\"\")))))","v":0},null,"Compact","Compact with numpad",null,{"$f":"IF(W70=\"\",$I$7,IF(VLOOKUP(W70,Lookups!$A$36:$B$39,2,FALSE)<VLOOKUP(U70,Lookups!$A$36:$B$39,2,FALSE),$I$8,IF(AND(VLOOKUP(W70,Lookups!$A$36:$B$39,2,FALSE)>=VLOOKUP(U70,Lookups!$A$36:$B$39,2,FALSE),VLOOKUP(W70,Lookups!$A$36:$B$39,2,FALSE)<0.8*VLOOKUP(V70,Lookups!$A$36:$B$39,2,FALSE)),$I$9,IF(AND(VLOOKUP(W70,Lookups!$A$36:$B$39,2,FALSE)<=VLOOKUP(V70,Lookups!$A$36:$B$39,2,FALSE),VLOOKUP(W70,Lookups!$A$36:$B$39,2,FALSE)>=0.8*VLOOKUP(V70,Lookups!$A$36:$B$39,2,FALSE)),$I$10,IF(VLOOKUP(W70,Lookups!$A$36:$B$39,2,FALSE)>VLOOKUP(V70,Lookups!$A$36:$B$39,2,FALSE),$I$11,\"\")))))","v":0},null,"Compact","Compact with numpad",null,{"$f":"IF(AB70=\"\",$I$7,IF(VLOOKUP(AB70,Lookups!$A$36:$B$39,2,FALSE)<VLOOKUP(Z70,Lookups!$A$36:$B$39,2,FALSE),$I$8,IF(AND(VLOOKUP(AB70,Lookups!$A$36:$B$39,2,FALSE)>=VLOOKUP(Z70,Lookups!$A$36:$B$39,2,FALSE),VLOOKUP(AB70,Lookups!$A$36:$B$39,2,FALSE)<0.8*VLOOKUP(AA70,Lookups!$A$36:$B$39,2,FALSE)),$I$9,IF(AND(VLOOKUP(AB70,Lookups!$A$36:$B$39,2,FALSE)<=VLOOKUP(AA70,Lookups!$A$36:$B$39,2,FALSE),VLOOKUP(AB70,Lookups!$A$36:$B$39,2,FALSE)>=0.8*VLOOKUP(AA70,Lookups!$A$36:$B$39,2,FALSE)),$I$10,IF(VLOOKUP(AB70,Lookups!$A$36:$B$39,2,FALSE)>VLOOKUP(AA70,Lookups!$A$36:$B$39,2,FALSE),$I$11,\"\")))))","v":0},{"$nulls":3},"Keyboard size",{"v":0.005,"d":"0.5%"},null,"Full with numpad","Full with numpad",null,{"$f":"IF(AL70=\"\",$I$7,IF(VLOOKUP(AL70,Lookups!$A$36:$B$39,2,FALSE)<VLOOKUP(AJ70,Lookups!$A$36:$B$39,2,FALSE),$I$8,IF(AND(VLOOKUP(AL70,Lookups!$A$36:$B$39,2,FALSE)>=VLOOKUP(AJ70,Lookups!$A$36:$B$39,2,FALSE),VLOOKUP(AL70,Lookups!$A$36:$B$39,2,FALSE)<0.8*VLOOKUP(AK70,Lookups!$A$36:$B$39,2,FALSE)),$I$9,IF(AND(VLOOKUP(AL70,Lookups!$A$36:$B$39,2,FALSE)<=VLOOKUP(AK70,Lookups!$A$36:$B$39,2,FALSE),VLOOKUP(AL70,Lookups!$A$36:$B$39,2,FALSE)>=0.8*VLOOKUP(AK70,Lookups!$A$36:$B$39,2,FALSE)),$I$10,IF(VLOOKUP(AL70,Lookups!$A$36:$B$39,2,FALSE)>VLOOKUP(AK70,Lookups!$A$36:$B$39,2,FALSE),$I$11,\"\")))))","v":0},null,"Full with numpad","Full with numpad",null,{"$f":"IF(AQ70=\"\",$I$7,IF(VLOOKUP(AQ70,Lookups!$A$36:$B$39,2,FALSE)<VLOOKUP(AO70,Lookups!$A$36:$B$39,2,FALSE),$I$8,IF(AND(VLOOKUP(AQ70,Lookups!$A$36:$B$39,2,FALSE)>=VLOOKUP(AO70,Lookups!$A$36:$B$39,2,FALSE),VLOOKUP(AQ70,Lookups!$A$36:$B$39,2,FALSE)<0.8*VLOOKUP(AP70,Lookups!$A$36:$B$39,2,FALSE)),$I$9,IF(AND(VLOOKUP(AQ70,Lookups!$A$36:$B$39,2,FALSE)<=VLOOKUP(AP70,Lookups!$A$36:$B$39,2,FALSE),VLOOKUP(AQ70,Lookups!$A$36:$B$39,2,FALSE)>=0.8*VLOOKUP(AP70,Lookups!$A$36:$B$39,2,FALSE)),$I$10,IF(VLOOKUP(AQ70,Lookups!$A$36:$B$39,2,FALSE)>VLOOKUP(AP70,Lookups!$A$36:$B$39,2,FALSE),$I$11,\"\")))))","v":0},null,"Full with numpad","Full with numpad",null,{"$f":"IF(AV70=\"\",$I$7,IF(VLOOKUP(AV70,Lookups!$A$36:$B$39,2,FALSE)<VLOOKUP(AT70,Lookups!$A$36:$B$39,2,FALSE),$I$8,IF(AND(VLOOKUP(AV70,Lookups!$A$36:$B$39,2,FALSE)>=VLOOKUP(AT70,Lookups!$A$36:$B$39,2,FALSE),VLOOKUP(AV70,Lookups!$A$36:$B$39,2,FALSE)<0.8*VLOOKUP(AU70,Lookups!$A$36:$B$39,2,FALSE)),$I$9,IF(AND(VLOOKUP(AV70,Lookups!$A$36:$B$39,2,FALSE)<=VLOOKUP(AU70,Lookups!$A$36:$B$39,2,FALSE),VLOOKUP(AV70,Lookups!$A$36:$B$39,2,FALSE)>=0.8*VLOOKUP(AU70,Lookups!$A$36:$B$39,2,FALSE)),$I$10,IF(VLOOKUP(AV70,Lookups!$A$36:$B$39,2,FALSE)>VLOOKUP(AU70,Lookups!$A$36:$B$39,2,FALSE),$I$11,\"\")))))","v":0}]
[null,null,"Connectivity",{"v":0,"d":"0.0%"},null,"Built-in","Built-in",null,{"$f":"IF(H71=\"\",$I$7,IF(VLOOKUP(H71,Lookups!$A$42:$B$47,2,FALSE)<VLOOKUP(F71,Lookups!$A$42:$B$47,2,FALSE),$I$8,IF(AND(VLOOKUP(H71,Lookups!$A$42:$B$47,2,FALSE)>=VLOOKUP(F71,Lookups!$A$42:$B$47,2,FALSE),VLOOKUP(H71,Lookups!$A$42:$B$47,2,FALSE)<0.8*VLOOKUP(G71,Lookups!$A$42:$B$47,2,FALSE)),$I$9,IF(AND(VLOOKUP(H71,Lookups!$A$42:$B$47,2,FALSE)<=VLOOKUP(G71,Lookups!$A$42:$B$47,2,FALSE),VLOOKUP(H71,Lookups!$A$42:$B$47,2,FALSE)>=0.8*VLOOKUP(G71,Lookups!$A$42:$B$47,2,FALSE)),$I$10,IF(VLOOKUP(H71,Lookups!$A$42:$B$47,2,FALSE)>VLOOKUP(G71,Lookups!$A$42:$B$47,2,FALSE),$I$11,\"\")))))","v":0},null,"Built-in","Built-in",null,{"$f":"IF(M71=\"\",$I$7,IF(VLOOKUP(M71,Lookups!$A$42:$B$47,2,FALSE)<VLOOKUP(K71,Lookups!$A$42:$B$47,2,FALSE),$I$8,IF(AND(VLOOKUP(M71,Lookups!$A$42:$B$47,2,FALSE)>=VLOOKUP(K71,Lookups!$A$42:$B$47,2,FALSE),VLOOKUP(M71,Lookups!$A$42:$B$47,2,FALSE)<0.8*VLOOKUP(L71,Lookups!$A$42:$B$47,2,FALSE)),$I$9,IF(AND(VLOOKUP(M71,Lookups!$A$42:$B$47,2,FALSE)<=VLOOKUP(L71,Lookups!$A$42:$B$47,2,FALSE),VLOOKUP(M71,Lookups!$A$42:$B$47,2,FALSE)>=0.8*VLOOKUP(L71,Lookups!$A$42:$B$47,2,FALSE)),$I$10,IF(VLOOKUP(M71,Lookups!$A$42:$B$47,2,FALSE)>VLOOKUP(L71,Lookups!$A$42:$B$47,2,FALSE),$I$11,\"\")))))","v":0},null,"Built-in","Built-in",null,{"$f":"IF(R71=\"\",$I$7,IF(VLOOKUP(R71,Lookups!$A$42:$B$47,2,FALSE)<VLOOKUP(P71,Lookups!$A$42:$B$47,2,FALSE),$I$8,IF(AND(VLOOKUP(R71,Lookups!$A$42:$B$47,2,FALSE)>=VLOOKUP(P71,Lookups!$A$42:$B$47,2,FALSE),VLOOKUP(R71,Lookups!$A$42:$B$47,2,FALSE)<0.8*VLOOKUP(Q71,Lookups!$A$42:$B$47,2,FALSE)),$I$9,IF(AND(VLOOKUP(R71,Lookups!$A$42:$B$47,2,FALSE)<=VLOOKUP(Q71,Lookups!$A$42:$B$47,2,FALSE),VLOOKUP(R71,Lookups!$A$42:$B$47,2,FALSE)>=0.8*VLOOKUP(Q71,Lookups!$A$42:$B$47,2,FALSE)),$I$10,IF(VLOOKUP(R71,Lookups!$A$42:$B$47,2,FALSE)>VLOOKUP(Q71,Lookups!$A$42:$B$47,2,FALSE),$I$11,\"\")))))","v":0},null,"Built-in","Built-in",null,{"$f":"IF(W71=\"\",$I$7,IF(VLOOKUP(W71,Lookups!$A$42:$B$47,2,FALSE)<VLOOKUP(U71,Lookups!$A$42:$B$47,2,FALSE),$I$8,IF(AND(VLOOKUP(W71,Lookups!$A$42:$B$47,2,FALSE)>=VLOOKUP(U71,Lookups!$A$42:$B$47,2,FALSE),VLOOKUP(W71,Lookups!$A$42:$B$47,2,FALSE)<0.8*VLOOKUP(V71,Lookups!$A$42:$B$47,2,FALSE)),$I$9,IF(AND(VLOOKUP(W71,Lookups!$A$42:$B$47,2,FALSE)<=VLOOKUP(V71,Lookups!$A$42:$B$47,2,FALSE),VLOOKUP(W71,Lookups!$A$42:$B$47,2,FALSE)>=0.8*VLOOKUP(V71,Lookups!$A$42:$B$47,2,FALSE)),$I$10,IF(VLOOKUP(W71,Lookups!$A$42:$B$47,2,FALSE)>VLOOKUP(V71,Lookups!$A$42:$B$47,2,FALSE),$I$11,\"\")))))","v":0},null,"Built-in","Built-in",null,{"$f":"IF(AB71=\"\",$I$7,IF(VLOOKUP(AB71,Lookups!$A$42:$B$47,2,FALSE)<VLOOKUP(Z71,Lookups!$A$42:$B$47,2,FALSE),$I$8,IF(AND(VLOOKUP(AB71,Lookups!$A$42:$B$47,2,FALSE)>=VLOOKUP(Z71,Lookups!$A$42:$B$47,2,FALSE),VLOOKUP(AB71,Lookups!$A$42:$B$47,2,FALSE)<0.8*VLOOKUP(AA71,Lookups!$A$42:$B$47,2,FALSE)),$I$9,IF(AND(VLOOKUP(AB71,Lookups!$A$42:$B$47,2,FALSE)<=VLOOKUP(AA71,Lookups!$A$42:$B$47,2,FALSE),VLOOKUP(AB71,Lookups!$A$42:$B$47,2,FALSE)>=0.8*VLOOKUP(AA71,Lookups!$A$42:$B$47,2,FALSE)),$I$10,IF(VLOOKUP(AB71,Lookups!$A$42:$B$47,2,FALSE)>VLOOKUP(AA71,Lookups!$A$42:$B$47,2,FALSE),$I$11,\"\")))))","v":0},{"$nulls":3},"Connectivity",{"v":0.005,"d":"0.5%"},null,"Wired (USB)","Wireless (BT) ",null,{"$f":"IF(AL71=\"\",$I$7,IF(VLOOKUP(AL71,Lookups!$A$42:$B$47,2,FALSE)<VLOOKUP(AJ71,Lookups!$A$42:$B$47,2,FALSE),$I$8,IF(AND(VLOOKUP(AL71,Lookups!$A$42:$B$47,2,FALSE)>=VLOOKUP(AJ71,Lookups!$A$42:$B$47,2,FALSE),VLOOKUP(AL71,Lookups!$A$42:$B$47,2,FALSE)<0.8*VLOOKUP(AK71,Lookups!$A$42:$B$47,2,FALSE)),$I$9,IF(AND(VLOOKUP(AL71,Lookups!$A$42:$B$47,2,FALSE)<=VLOOKUP(AK71,Lookups!$A$42:$B$47,2,FALSE),VLOOKUP(AL71,Lookups!$A$42:$B$47,2,FALSE)>=0.8*VLOOKUP(AK71,Lookups!$A$42:$B$47,2,FALSE)),$I$10,IF(VLOOKUP(AL71,Lookups!$A$42:$B$47,2,FALSE)>VLOOKUP(AK71,Lookups!$A$42:$B$47,2,FALSE),$I$11,\"\")))))","v":0},null,"Wired (USB)","Wireless (BT) ",null,{"$f":"IF(AQ71=\"\",$I$7,IF(VLOOKUP(AQ71,Lookups!$A$42:$B$47,2,FALSE)<VLOOKUP(AO71,Lookups!$A$42:$B$47,2,FALSE),$I$8,IF(AND(VLOOKUP(AQ71,Lookups!$A$42:$B$47,2,FALSE)>=VLOOKUP(AO71,Lookups!$A$42:$B$47,2,FALSE),VLOOKUP(AQ71,Lookups!$A$42:$B$47,2,FALSE)<0.8*VLOOKUP(AP71,Lookups!$A$42:$B$47,2,FALSE)),$I$9,IF(AND(VLOOKUP(AQ71,Lookups!$A$42:$B$47,2,FALSE)<=VLOOKUP(AP71,Lookups!$A$42:$B$47,2,FALSE),VLOOKUP(AQ71,Lookups!$A$42:$B$47,2,FALSE)>=0.8*VLOOKUP(AP71,Lookups!$A$42:$B$47,2,FALSE)),$I$10,IF(VLOOKUP(AQ71,Lookups!$A$42:$B$47,2,FALSE)>VLOOKUP(AP71,Lookups!$A$42:$B$47,2,FALSE),$I$11,\"\")))))","v":0},null,"Wireless (USB Shared)","Wireless (BT) ",null,{"$f":"IF(AV71=\"\",$I$7,IF(VLOOKUP(AV71,Lookups!$A$42:$B$47,2,FALSE)<VLOOKUP(AT71,Lookups!$A$42:$B$47,2,FALSE),$I$8,IF(AND(VLOOKUP(AV71,Lookups!$A$42:$B$47,2,FALSE)>=VLOOKUP(AT71,Lookups!$A$42:$B$47,2,FALSE),VLOOKUP(AV71,Lookups!$A$42:$B$47,2,FALSE)<0.8*VLOOKUP(AU71,Lookups!$A$42:$B$47,2,FALSE)),$I$9,IF(AND(VLOOKUP(AV71,Lookups!$A$42:$B$47,2,FALSE)<=VLOOKUP(AU71,Lookups!$A$42:$B$47,2,FALSE),VLOOKUP(AV71,Lookups!$A$42:$B$47,2,FALSE)>=0.8*VLOOKUP(AU71,Lookups!$A$42:$B$47,2,FALSE)),$I$10,IF(VLOOKUP(AV71,Lookups!$A$42:$B$47,2,FALSE)>VLOOKUP(AU71,Lookups!$A$42:$B$47,2,FALSE),$I$11,\"\")))))","v":0}]
[null,null,"Power Source",{"v":0,"d":"0.0%"},null,"Device","Device",null,{"$f":"IF(H72=\"\",$I$7,IF(VLOOKUP(H72,Lookups!$A$50:$B$52,2,FALSE)<VLOOKUP(F72,Lookups!$A$50:$B$52,2,FALSE),$I$8,IF(AND(VLOOKUP(H72,Lookups!$A$50:$B$52,2,FALSE)>=VLOOKUP(F72,Lookups!$A$50:$B$52,2,FALSE),VLOOKUP(H72,Lookups!$A$50:$B$52,2,FALSE)<0.8*VLOOKUP(G72,Lookups!$A$50:$B$52,2,FALSE)),$I$9,IF(AND(VLOOKUP(H72,Lookups!$A$50:$B$52,2,FALSE)<=VLOOKUP(G72,Lookups!$A$50:$B$52,2,FALSE),VLOOKUP(H72,Lookups!$A$50:$B$52,2,FALSE)>=0.8*VLOOKUP(G72,Lookups!$A$50:$B$52,2,FALSE)),$I$10,IF(VLOOKUP(H72,Lookups!$A$50:$B$52,2,FALSE)>VLOOKUP(G72,Lookups!$A$50:$B$52,2,FALSE),$I$11,\"\")))))","v":0},null,"Device","Device",null,{"$f":"IF(M72=\"\",$I$7,IF(VLOOKUP(M72,Lookups!$A$50:$B$52,2,FALSE)<VLOOKUP(K72,Lookups!$A$50:$B$52,2,FALSE),$I$8,IF(AND(VLOOKUP(M72,Lookups!$A$50:$B$52,2,FALSE)>=VLOOKUP(K72,Lookups!$A$50:$B$52,2,FALSE),VLOOKUP(M72,Lookups!$A$50:$B$52,2,FALSE)<0.8*VLOOKUP(L72,Lookups!$A$50:$B$52,2,FALSE)),$I$9,IF(AND(VLOOKUP(M72,Lookups!$A$50:$B$52,2,FALSE)<=VLOOKUP(L72,Lookups!$A$50:$B$52,2,FALSE),VLOOKUP(M72,Lookups!$A$50:$B$52,2,FALSE)>=0.8*VLOOKUP(L72,Lookups!$A$50:$B$52,2,FALSE)),$I$10,IF(VLOOKUP(M72,Lookups!$A$50:$B$52,2,FALSE)>VLOOKUP(L72,Lookups!$A$50:$B$52,2,FALSE),$I$11,\"\")))))","v":0},null,"Device","Device",null,{"$f":"IF(R72=\"\",$I$7,IF(VLOOKUP(R72,Lookups!$A$50:$B$52,2,FALSE)<VLOOKUP(P72,Lookups!$A$50:$B$52,2,FALSE),$I$8,IF(AND(VLOOKUP(R72,Lookups!$A$50:$B$52,2,FALSE)>=VLOOKUP(P72,Lookups!$A$50:$B$52,2,FALSE),VLOOKUP(R72,Lookups!$A$50:$B$52,2,FALSE)<0.8*VLOOKUP(Q72,Lookups!$A$50:$B$52,2,FALSE)),$I$9,IF(AND(VLOOKUP(R72,Lookups!$A$50:$B$52,2,FALSE)<=VLOOKUP(Q72,Lookups!$A$50:$B$52,2,FALSE),VLOOKUP(R72,Lookups!$A$50:$B$52,2,FALSE)>=0.8*VLOOKUP(Q72,Lookups!$A$50:$B$52,2,FALSE)),$I$10,IF(VLOOKUP(R72,Lookups!$A$50:$B$52,2,FALSE)>VLOOKUP(Q72,Lookups!$A$50:$B$52,2,FALSE),$I$11,\"\")))))","v":0},null,"Device","Device",null,{"$f":"IF(W72=\"\",$I$7,IF(VLOOKUP(W72,Lookups!$A$50:$B$52,2,FALSE)<VLOOKUP(U72,Lookups!$A$50:$B$52,2,FALSE),$I$8,IF(AND(VLOOKUP(W72,Lookups!$A$50:$B$52,2,FALSE)>=VLOOKUP(U72,Lookups!$A$50:$B$52,2,FALSE),VLOOKUP(W72,Lookups!$A$50:$B$52,2,FALSE)<0.8*VLOOKUP(V72,Lookups!$A$50:$B$52,2,FALSE)),$I$9,IF(AND(VLOOKUP(W72,Lookups!$A$50:$B$52,2,FALSE)<=VLOOKUP(V72,Lookups!$A$50:$B$52,2,FALSE),VLOOKUP(W72,Lookups!$A$50:$B$52,2,FALSE)>=0.8*VLOOKUP(V72,Lookups!$A$50:$B$52,2,FALSE)),$I$10,IF(VLOOKUP(W72,Lookups!$A$50:$B$52,2,FALSE)>VLOOKUP(V72,Lookups!$A$50:$B$52,2,FALSE),$I$11,\"\")))))","v":0},null,"Device","Device",null,{"$f":"IF(AB72=\"\",$I$7,IF(VLOOKUP(AB72,Lookups!$A$50:$B$52,2,FALSE)<VLOOKUP(Z72,Lookups!$A$50:$B$52,2,FALSE),$I$8,IF(AND(VLOOKUP(AB72,Lookups!$A$50:$B$52,2,FALSE)>=VLOOKUP(Z72,Lookups!$A$50:$B$52,2,FALSE),VLOOKUP(AB72,Lookups!$A$50:$B$52,2,FALSE)<0.8*VLOOKUP(AA72,Lookups!$A$50:$B$52,2,FALSE)),$I$9,IF(AND(VLOOKUP(AB72,Lookups!$A$50:$B$52,2,FALSE)<=VLOOKUP(AA72,Lookups!$A$50:$B$52,2,FALSE),VLOOKUP(AB72,Lookups!$A$50:$B$52,2,FALSE)>=0.8*VLOOKUP(AA72,Lookups!$A$50:$B$52,2,FALSE)),$I$10,IF(VLOOKUP(AB72,Lookups!$A$50:$B$52,2,FALSE)>VLOOKUP(AA72,Lookups!$A$50:$B$52,2,FALSE),$I$11,\"\")))))","v":0},{"$nulls":3},"Power Source",{"v":0.005,"d":"0.5%"},null,"Device","Batteries",null,{"$f":"IF(AL72=\"\",$I$7,IF(VLOOKUP(AL72,Lookups!$A$50:$B$52,2,FALSE)<VLOOKUP(AJ72,Lookups!$A$50:$B$52,2,FALSE),$I$8,IF(AND(VLOOKUP(AL72,Lookups!$A$50:$B$52,2,FALSE)>=VLOOKUP(AJ72,Lookups!$A$50:$B$52,2,FALSE),VLOOKUP(AL72,Lookups!$A$50:$B$52,2,FALSE)<0.8*VLOOKUP(AK72,Lookups!$A$50:$B$52,2,FALSE)),$I$9,IF(AND(VLOOKUP(AL72,Lookups!$A$50:$B$52,2,FALSE)<=VLOOKUP(AK72,Lookups!$A$50:$B$52,2,FALSE),VLOOKUP(AL72,Lookups!$A$50:$B$52,2,FALSE)>=0.8*VLOOKUP(AK72,Lookups!$A$50:$B$52,2,FALSE)),$I$10,IF(VLOOKUP(AL72,Lookups!$A$50:$B$52,2,FALSE)>VLOOKUP(AK72,Lookups!$A$50:$B$52,2,FALSE),$I$11,\"\")))))","v":0},null,"Device","Rechareable batteries",null,{"$f":"IF(AQ72=\"\",$I$7,IF(VLOOKUP(AQ72,Lookups!$A$50:$B$52,2,FALSE)<VLOOKUP(AO72,Lookups!$A$50:$B$52,2,FALSE),$I$8,IF(AND(VLOOKUP(AQ72,Lookups!$A$50:$B$52,2,FALSE)>=VLOOKUP(AO72,Lookups!$A$50:$B$52,2,FALSE),VLOOKUP(AQ72,Lookups!$A$50:$B$52,2,FALSE)<0.8*VLOOKUP(AP72,Lookups!$A$50:$B$52,2,FALSE)),$I$9,IF(AND(VLOOKUP(AQ72,Lookups!$A$50:$B$52,2,FALSE)<=VLOOKUP(AP72,Lookups!$A$50:$B$52,2,FALSE),VLOOKUP(AQ72,Lookups!$A$50:$B$52,2,FALSE)>=0.8*VLOOKUP(AP72,Lookups!$A$50:$B$52,2,FALSE)),$I$10,IF(VLOOKUP(AQ72,Lookups!$A$50:$B$52,2,FALSE)>VLOOKUP(AP72,Lookups!$A$50:$B$52,2,FALSE),$I$11,\"\")))))","v":0},null,"Rechareable batteries","Rechareable batteries",null,{"$f":"IF(AV72=\"\",$I$7,IF(VLOOKUP(AV72,Lookups!$A$50:$B$52,2,FALSE)<VLOOKUP(AT72,Lookups!$A$50:$B$52,2,FALSE),$I$8,IF(AND(VLOOKUP(AV72,Lookups!$A$50:$B$52,2,FALSE)>=VLOOKUP(AT72,Lookups!$A$50:$B$52,2,FALSE),VLOOKUP(AV72,Lookups!$A$50:$B$52,2,FALSE)<0.8*VLOOKUP(AU72,Lookups!$A$50:$B$52,2,FALSE)),$I$9,IF(AND(VLOOKUP(AV72,Lookups!$A$50:$B$52,2,FALSE)<=VLOOKUP(AU72,Lookups!$A$50:$B$52,2,FALSE),VLOOKUP(AV72,Lookups!$A$50:$B$52,2,FALSE)>=0.8*VLOOKUP(AU72,Lookups!$A$50:$B$52,2,FALSE)),$I$10,IF(VLOOKUP(AV72,Lookups!$A$50:$B$52,2,FALSE)>VLOOKUP(AU72,Lookups!$A$50:$B$52,2,FALSE),$I$11,\"\")))))","v":0}]
[{"$f":"SUM(D73:D77)","v":{"v":0.02,"d":"2%"}},"Pointing device","Type",{"v":0.02,"d":"2.0%"},null,"Trackpad","Trackpad",null,{"$f":"IF(H73=\"\",$I$7,IF(VLOOKUP(H73,Lookups!$A$80:$B$82,2,FALSE)<VLOOKUP(F73,Lookups!$A$80:$B$82,2,FALSE),$I$8,IF(AND(VLOOKUP(H73,Lookups!$A$80:$B$82,2,FALSE)>=VLOOKUP(F73,Lookups!$A$80:$B$82,2,FALSE),VLOOKUP(H73,Lookups!$A$80:$B$82,2,FALSE)<0.8*VLOOKUP(G73,Lookups!$A$80:$B$82,2,FALSE)),$I$9,IF(AND(VLOOKUP(H73,Lookups!$A$80:$B$82,2,FALSE)<=VLOOKUP(G73,Lookups!$A$80:$B$82,2,FALSE),VLOOKUP(H73,Lookups!$A$80:$B$82,2,FALSE)>=0.8*VLOOKUP(G73,Lookups!$A$80:$B$82,2,FALSE)),$I$10,IF(VLOOKUP(H73,Lookups!$A$80:$B$82,2,FALSE)>VLOOKUP(G73,Lookups!$A$80:$B$82,2,FALSE),$I$11,\"\")))))","v":0},null,"Trackpad","Trackpad",null,{"$f":"IF(M73=\"\",$I$7,IF(VLOOKUP(M73,Lookups!$A$80:$B$82,2,FALSE)<VLOOKUP(K73,Lookups!$A$80:$B$82,2,FALSE),$I$8,IF(AND(VLOOKUP(M73,Lookups!$A$80:$B$82,2,FALSE)>=VLOOKUP(K73,Lookups!$A$80:$B$82,2,FALSE),VLOOKUP(M73,Lookups!$A$80:$B$82,2,FALSE)<0.8*VLOOKUP(L73,Lookups!$A$80:$B$82,2,FALSE)),$I$9,IF(AND(VLOOKUP(M73,Lookups!$A$80:$B$82,2,FALSE)<=VLOOKUP(L73,Lookups!$A$80:$B$82,2,FALSE),VLOOKUP(M73,Lookups!$A$80:$B$82,2,FALSE)>=0.8*VLOOKUP(L73,Lookups!$A$80:$B$82,2,FALSE)),$I$10,IF(VLOOKUP(M73,Lookups!$A$80:$B$82,2,FALSE)>VLOOKUP(L73,Lookups!$A$80:$B$82,2,FALSE),$I$11,\"\")))))","v":0},null,"Trackpad","Trackpad",null,{"$f":"IF(R73=\"\",$I$7,IF(VLOOKUP(R73,Lookups!$A$80:$B$82,2,FALSE)<VLOOKUP(P73,Lookups!$A$80:$B$82,2,FALSE),$I$8,IF(AND(VLOOKUP(R73,Lookups!$A$80:$B$82,2,FALSE)>=VLOOKUP(P73,Lookups!$A$80:$B$82,2,FALSE),VLOOKUP(R73,Lookups!$A$80:$B$82,2,FALSE)<0.8*VLOOKUP(Q73,Lookups!$A$80:$B$82,2,FALSE)),$I$9,IF(AND(VLOOKUP(R73,Lookups!$A$80:$B$82,2,FALSE)<=VLOOKUP(Q73,Lookups!$A$80:$B$82,2,FALSE),VLOOKUP(R73,Lookups!$A$80:$B$82,2,FALSE)>=0.8*VLOOKUP(Q73,Lookups!$A$80:$B$82,2,FALSE)),$I$10,IF(VLOOKUP(R73,Lookups!$A$80:$B$82,2,FALSE)>VLOOKUP(Q73,Lookups!$A$80:$B$82,2,FALSE),$I$11,\"\")))))","v":0},null,"Trackpad","Trackpad",null,{"$f":"IF(W73=\"\",$I$7,IF(VLOOKUP(W73,Lookups!$A$80:$B$82,2,FALSE)<VLOOKUP(U73,Lookups!$A$80:$B$82,2,FALSE),$I$8,IF(AND(VLOOKUP(W73,Lookups!$A$80:$B$82,2,FALSE)>=VLOOKUP(U73,Lookups!$A$80:$B$82,2,FALSE),VLOOKUP(W73,Lookups!$A$80:$B$82,2,FALSE)<0.8*VLOOKUP(V73,Lookups!$A$80:$B$82,2,FALSE)),$I$9,IF(AND(VLOOKUP(W73,Lookups!$A$80:$B$82,2,FALSE)<=VLOOKUP(V73,Lookups!$A$80:$B$82,2,FALSE),VLOOKUP(W73,Lookups!$A$80:$B$82,2,FALSE)>=0.8*VLOOKUP(V73,Lookups!$A$80:$B$82,2,FALSE)),$I$10,IF(VLOOKUP(W73,Lookups!$A$80:$B$82,2,FALSE)>VLOOKUP(V73,Lookups!$A$80:$B$82,2,FALSE),$I$11,\"\")))))","v":0},null,"Trackpad","Trackpad",null,{"$f":"IF(AB73=\"\",$I$7,IF(VLOOKUP(AB73,Lookups!$A$80:$B$82,2,FALSE)<VLOOKUP(Z73,Lookups!$A$80:$B$82,2,FALSE),$I$8,IF(AND(VLOOKUP(AB73,Lookups!$A$80:$B$82,2,FALSE)>=VLOOKUP(Z73,Lookups!$A$80:$B$82,2,FALSE),VLOOKUP(AB73,Lookups!$A$80:$B$82,2,FALSE)<0.8*VLOOKUP(AA73,Lookups!$A$80:$B$82,2,FALSE)),$I$9,IF(AND(VLOOKUP(AB73,Lookups!$A$80:$B$82,2,FALSE)<=VLOOKUP(AA73,Lookups!$A$80:$B$82,2,FALSE),VLOOKUP(AB73,Lookups!$A$80:$B$82,2,FALSE)>=0.8*VLOOKUP(AA73,Lookups!$A$80:$B$82,2,FALSE)),$I$10,IF(VLOOKUP(AB73,Lookups!$A$80:$B$82,2,FALSE)>VLOOKUP(AA73,Lookups!$A$80:$B$82,2,FALSE),$I$11,\"\")))))","v":0},null,{"$f":"SUM(AH73:AH77)","v":{"v":0.04,"d":"4%"}},"Pointing device","Type",{"v":0.02,"d":"2.0%"},null,"Mouse","Mouse",null,{"$f":"IF(AL73=\"\",$I$7,IF(VLOOKUP(AL73,Lookups!$A$80:$B$82,2,FALSE)<VLOOKUP(AJ73,Lookups!$A$80:$B$82,2,FALSE),$I$8,IF(AND(VLOOKUP(AL73,Lookups!$A$80:$B$82,2,FALSE)>=VLOOKUP(AJ73,Lookups!$A$80:$B$82,2,FALSE),VLOOKUP(AL73,Lookups!$A$80:$B$82,2,FALSE)<0.8*VLOOKUP(AK73,Lookups!$A$80:$B$82,2,FALSE)),$I$9,IF(AND(VLOOKUP(AL73,Lookups!$A$80:$B$82,2,FALSE)<=VLOOKUP(AK73,Lookups!$A$80:$B$82,2,FALSE),VLOOKUP(AL73,Lookups!$A$80:$B$82,2,FALSE)>=0.8*VLOOKUP(AK73,Lookups!$A$80:$B$82,2,FALSE)),$I$10,IF(VLOOKUP(AL73,Lookups!$A$80:$B$82,2,FALSE)>VLOOKUP(AK73,Lookups!$A$80:$B$82,2,FALSE),$I$11,\"\")))))","v":0},null,"Mouse","Mouse",null,{"$f":"IF(AQ73=\"\",$I$7,IF(VLOOKUP(AQ73,Lookups!$A$80:$B$82,2,FALSE)<VLOOKUP(AO73,Lookups!$A$80:$B$82,2,FALSE),$I$8,IF(AND(VLOOKUP(AQ73,Lookups!$A$80:$B$82,2,FALSE)>=VLOOKUP(AO73,Lookups!$A$80:$B$82,2,FALSE),VLOOKUP(AQ73,Lookups!$A$80:$B$82,2,FALSE)<0.8*VLOOKUP(AP73,Lookups!$A$80:$B$82,2,FALSE)),$I$9,IF(AND(VLOOKUP(AQ73,Lookups!$A$80:$B$82,2,FALSE)<=VLOOKUP(AP73,Lookups!$A$80:$B$82,2,FALSE),VLOOKUP(AQ73,Lookups!$A$80:$B$82,2,FALSE)>=0.8*VLOOKUP(AP73,Lookups!$A$80:$B$82,2,FALSE)),$I$10,IF(VLOOKUP(AQ73,Lookups!$A$80:$B$82,2,FALSE)>VLOOKUP(AP73,Lookups!$A$80:$B$82,2,FALSE),$I$11,\"\")))))","v":0},null,"Mouse","Mouse",null,{"$f":"IF(AV73=\"\",$I$7,IF(VLOOKUP(AV73,Lookups!$A$80:$B$82,2,FALSE)<VLOOKUP(AT73,Lookups!$A$80:$B$82,2,FALSE),$I$8,IF(AND(VLOOKUP(AV73,Lookups!$A$80:$B$82,2,FALSE)>=VLOOKUP(AT73,Lookups!$A$80:$B$82,2,FALSE),VLOOKUP(AV73,Lookups!$A$80:$B$82,2,FALSE)<0.8*VLOOKUP(AU73,Lookups!$A$80:$B$82,2,FALSE)),$I$9,IF(AND(VLOOKUP(AV73,Lookups!$A$80:$B$82,2,FALSE)<=VLOOKUP(AU73,Lookups!$A$80:$B$82,2,FALSE),VLOOKUP(AV73,Lookups!$A$80:$B$82,2,FALSE)>=0.8*VLOOKUP(AU73,Lookups!$A$80:$B$82,2,FALSE)),$I$10,IF(VLOOKUP(AV73,Lookups!$A$80:$B$82,2,FALSE)>VLOOKUP(AU73,Lookups!$A$80:$B$82,2,FALSE),$I$11,\"\")))))","v":0}]
[null,null,"Optical tracking",{"v":0,"d":"0.0%"},null,"Yes","Yes",null,{"$f":"IF(H74=\"\",$I$7,IF(VLOOKUP(H74,Lookups!$A$31:$B$33,2,FALSE)<VLOOKUP(F74,Lookups!$A$31:$B$33,2,FALSE),$I$8,IF(AND(VLOOKUP(H74,Lookups!$A$31:$B$33,2,FALSE)>=VLOOKUP(F74,Lookups!$A$31:$B$33,2,FALSE),VLOOKUP(H74,Lookups!$A$31:$B$33,2,FALSE)<0.8*VLOOKUP(G74,Lookups!$A$31:$B$33,2,FALSE)),$I$9,IF(AND(VLOOKUP(H74,Lookups!$A$31:$B$33,2,FALSE)<=VLOOKUP(G74,Lookups!$A$31:$B$33,2,FALSE),VLOOKUP(H74,Lookups!$A$31:$B$33,2,FALSE)>=0.8*VLOOKUP(G74,Lookups!$A$31:$B$33,2,FALSE)),$I$10,IF(VLOOKUP(H74,Lookups!$A$31:$B$33,2,FALSE)>VLOOKUP(G74,Lookups!$A$31:$B$33,2,FALSE),$I$11,\"\")))))","v":0},null,"Yes","Yes",null,{"$f":"IF(M74=\"\",$I$7,IF(VLOOKUP(M74,Lookups!$A$31:$B$33,2,FALSE)<VLOOKUP(K74,Lookups!$A$31:$B$33,2,FALSE),$I$8,IF(AND(VLOOKUP(M74,Lookups!$A$31:$B$33,2,FALSE)>=VLOOKUP(K74,Lookups!$A$31:$B$33,2,FALSE),VLOOKUP(M74,Lookups!$A$31:$B$33,2,FALSE)<0.8*VLOOKUP(L74,Lookups!$A$31:$B$33,2,FALSE)),$I$9,IF(AND(VLOOKUP(M74,Lookups!$A$31:$B$33,2,FALSE)<=VLOOKUP(L74,Lookups!$A$31:$B$33,2,FALSE),VLOOKUP(M74,Lookups!$A$31:$B$33,2,FALSE)>=0.8*VLOOKUP(L74,Lookups!$A$31:$B$33,2,FALSE)),$I$10,IF(VLOOKUP(M74,Lookups!$A$31:$B$33,2,FALSE)>VLOOKUP(L74,Lookups!$A$31:$B$33,2,FALSE),$I$11,\"\")))))","v":0},null,"Yes","Yes",null,{"$f":"IF(R74=\"\",$I$7,IF(VLOOKUP(R74,Lookups!$A$31:$B$33,2,FALSE)<VLOOKUP(P74,Lookups!$A$31:$B$33,2,FALSE),$I$8,IF(AND(VLOOKUP(R74,Lookups!$A$31:$B$33,2,FALSE)>=VLOOKUP(P74,Lookups!$A$31:$B$33,2,FALSE),VLOOKUP(R74,Lookups!$A$31:$B$33,2,FALSE)<0.8*VLOOKUP(Q74,Lookups!$A$31:$B$33,2,FALSE)),$I$9,IF(AND(VLOOKUP(R74,Lookups!$A$31:$B$33,2,FALSE)<=VLOOKUP(Q74,Lookups!$A$31:$B$33,2,FALSE),VLOOKUP(R74,Lookups!$A$31:$B$33,2,FALSE)>=0.8*VLOOKUP(Q74,Lookups!$A$31:$B$33,2,FALSE)),$I$10,IF(VLOOKUP(R74,Lookups!$A$31:$B$33,2,FALSE)>VLOOKUP(Q74,Lookups!$A$31:$B$33,2,FALSE),$I$11,\"\")))))","v":0},null,"Yes","Yes",null,{"$f":"IF(W74=\"\",$I$7,IF(VLOOKUP(W74,Lookups!$A$31:$B$33,2,FALSE)<VLOOKUP(U74,Lookups!$A$31:$B$33,2,FALSE),$I$8,IF(AND(VLOOKUP(W74,Lookups!$A$31:$B$33,2,FALSE)>=VLOOKUP(U74,Lookups!$A$31:$B$33,2,FALSE),VLOOKUP(W74,Lookups!$A$31:$B$33,2,FALSE)<0.8*VLOOKUP(V74,Lookups!$A$31:$B$33,2,FALSE)),$I$9,IF(AND(VLOOKUP(W74,Lookups!$A$31:$B$33,2,FALSE)<=VLOOKUP(V74,Lookups!$A$31:$B$33,2,FALSE),VLOOKUP(W74,Lookups!$A$31:$B$33,2,FALSE)>=0.8*VLOOKUP(V74,Lookups!$A$31:$B$33,2,FALSE)),$I$10,IF(VLOOKUP(W74,Lookups!$A$31:$B$33,2,FALSE)>VLOOKUP(V74,Lookups!$A$31:$B$33,2,FALSE),$I$11,\"\")))))","v":0},null,"Yes","Yes",null,{"$f":"IF(AB74=\"\",$I$7,IF(VLOOKUP(AB74,Lookups!$A$31:$B$33,2,FALSE)<VLOOKUP(Z74,Lookups!$A$31:$B$33,2,FALSE),$I$8,IF(AND(VLOOKUP(AB74,Lookups!$A$31:$B$33,2,FALSE)>=VLOOKUP(Z74,Lookups!$A$31:$B$33,2,FALSE),VLOOKUP(AB74,Lookups!$A$31:$B$33,2,FALSE)<0.8*VLOOKUP(AA74,Lookups!$A$31:$B$33,2,FALSE)),$I$9,IF(AND(VLOOKUP(AB74,Lookups!$A$31:$B$33,2,FALSE)<=VLOOKUP(AA74,Lookups!$A$31:$B$33,2,FALSE),VLOOKUP(AB74,Lookups!$A$31:$B$33,2,FALSE)>=0.8*VLOOKUP(AA74,Lookups!$A$31:$B$33,2,FALSE)),$I$10,IF(VLOOKUP(AB74,Lookups!$A$31:$B$33,2,FALSE)>VLOOKUP(AA74,Lookups!$A$31:$B$33,2,FALSE),$I$11,\"\")))))","v":0},{"$nulls":3},"Optical tracking",{"v":0.005,"d":"0.5%"},null,"Yes","Yes",null,{"$f":"IF(AL74=\"\",$I$7,IF(VLOOKUP(AL74,Lookups!$A$31:$B$33,2,FALSE)<VLOOKUP(AJ74,Lookups!$A$31:$B$33,2,FALSE),$I$8,IF(AND(VLOOKUP(AL74,Lookups!$A$31:$B$33,2,FALSE)>=VLOOKUP(AJ74,Lookups!$A$31:$B$33,2,FALSE),VLOOKUP(AL74,Lookups!$A$31:$B$33,2,FALSE)<0.8*VLOOKUP(AK74,Lookups!$A$31:$B$33,2,FALSE)),$I$9,IF(AND(VLOOKUP(AL74,Lookups!$A$31:$B$33,2,FALSE)<=VLOOKUP(AK74,Lookups!$A$31:$B$33,2,FALSE),VLOOKUP(AL74,Lookups!$A$31:$B$33,2,FALSE)>=0.8*VLOOKUP(AK74,Lookups!$A$31:$B$33,2,FALSE)),$I$10,IF(VLOOKUP(AL74,Lookups!$A$31:$B$33,2,FALSE)>VLOOKUP(AK74,Lookups!$A$31:$B$33,2,FALSE),$I$11,\"\")))))","v":0},null,"Yes","Yes",null,{"$f":"IF(AQ74=\"\",$I$7,IF(VLOOKUP(AQ74,Lookups!$A$31:$B$33,2,FALSE)<VLOOKUP(AO74,Lookups!$A$31:$B$33,2,FALSE),$I$8,IF(AND(VLOOKUP(AQ74,Lookups!$A$31:$B$33,2,FALSE)>=VLOOKUP(AO74,Lookups!$A$31:$B$33,2,FALSE),VLOOKUP(AQ74,Lookups!$A$31:$B$33,2,FALSE)<0.8*VLOOKUP(AP74,Lookups!$A$31:$B$33,2,FALSE)),$I$9,IF(AND(VLOOKUP(AQ74,Lookups!$A$31:$B$33,2,FALSE)<=VLOOKUP(AP74,Lookups!$A$31:$B$33,2,FALSE),VLOOKUP(AQ74,Lookups!$A$31:$B$33,2,FALSE)>=0.8*VLOOKUP(AP74,Lookups!$A$31:$B$33,2,FALSE)),$I$10,IF(VLOOKUP(AQ74,Lookups!$A$31:$B$33,2,FALSE)>VLOOKUP(AP74,Lookups!$A$31:$B$33,2,FALSE),$I$11,\"\")))))","v":0},null,"Yes","Yes",null,{"$f":"IF(AV74=\"\",$I$7,IF(VLOOKUP(AV74,Lookups!$A$31:$B$33,2,FALSE)<VLOOKUP(AT74,Lookups!$A$31:$B$33,2,FALSE),$I$8,IF(AND(VLOOKUP(AV74,Lookups!$A$31:$B$33,2,FALSE)>=VLOOKUP(AT74,Lookups!$A$31:$B$33,2,FALSE),VLOOKUP(AV74,Lookups!$A$31:$B$33,2,FALSE)<0.8*VLOOKUP(AU74,Lookups!$A$31:$B$33,2,FALSE)),$I$9,IF(AND(VLOOKUP(AV74,Lookups!$A$31:$B$33,2,FALSE)<=VLOOKUP(AU74,Lookups!$A$31:$B$33,2,FALSE),VLOOKUP(AV74,Lookups!$A$31:$B$33,2,FALSE)>=0.8*VLOOKUP(AU74,Lookups!$A$31:$B$33,2,FALSE)),$I$10,IF(VLOOKUP(AV74,Lookups!$A$31:$B$33,2,FALSE)>VLOOKUP(AU74,Lookups!$A$31:$B$33,2,FALSE),$I$11,\"\")))))","v":0}]
[null,null,"Tracking resolution DPI",{"v":0,"d":"0.0%"},null,"N/A","N/A",{"$nulls":3},"N/A","N/A",{"$nulls":3},"N/A","N/A",{"$nulls":3},"N/A","N/A",{"$nulls":3},"N/A","N/A",{"$nulls":5},"Tracking resolution DPI",{"v":0.005,"d":"0.5%"},null,400,800,null,{"$f":"IF(AL75=\"\",$I$7,IF(AL75<AJ75,$I$8,IF(AND(AL75>=AJ75,AL75<0.9*AK75),$I$9,IF(AND(AL75<=AK75,AL75>=0.9*AK75),$I$10,IF(AL75>AK75,$I$11,\"\")))))","v":0},null,400,800,null,{"$f":"IF(AQ75=\"\",$I$7,IF(AQ75<AO75,$I$8,IF(AND(AQ75>=AO75,AQ75<0.9*AP75),$I$9,IF(AND(AQ75<=AP75,AQ75>=0.9*AP75),$I$10,IF(AQ75>AP75,$I$11,\"\")))))","v":0},null,800,1600,null,{"$f":"IF(AV75=\"\",$I$7,IF(AV75<AT75,$I$8,IF(AND(AV75>=AT75,AV75<0.9*AU75),$I$9,IF(AND(AV75<=AU75,AV75>=0.9*AU75),$I$10,IF(AV75>AU75,$I$11,\"\")))))","v":0}]
[null,null,"Connectivity",{"v":0,"d":"0.0%"},null,"Built-in","Built-in",null,{"$f":"IF(H76=\"\",$I$7,IF(VLOOKUP(H76,Lookups!$A$42:$B$47,2,FALSE)<VLOOKUP(F76,Lookups!$A$42:$B$47,2,FALSE),$I$8,IF(AND(VLOOKUP(H76,Lookups!$A$42:$B$47,2,FALSE)>=VLOOKUP(F76,Lookups!$A$42:$B$47,2,FALSE),VLOOKUP(H76,Lookups!$A$42:$B$47,2,FALSE)<0.8*VLOOKUP(G76,Lookups!$A$42:$B$47,2,FALSE)),$I$9,IF(AND(VLOOKUP(H76,Lookups!$A$42:$B$47,2,FALSE)<=VLOOKUP(G76,Lookups!$A$42:$B$47,2,FALSE),VLOOKUP(H76,Lookups!$A$42:$B$47,2,FALSE)>=0.8*VLOOKUP(G76,Lookups!$A$42:$B$47,2,FALSE)),$I$10,IF(VLOOKUP(H76,Lookups!$A$42:$B$47,2,FALSE)>VLOOKUP(G76,Lookups!$A$42:$B$47,2,FALSE),$I$11,\"\")))))","v":0},null,"Built-in","Built-in",null,{"$f":"IF(M76=\"\",$I$7,IF(VLOOKUP(M76,Lookups!$A$42:$B$47,2,FALSE)<VLOOKUP(K76,Lookups!$A$42:$B$47,2,FALSE),$I$8,IF(AND(VLOOKUP(M76,Lookups!$A$42:$B$47,2,FALSE)>=VLOOKUP(K76,Lookups!$A$42:$B$47,2,FALSE),VLOOKUP(M76,Lookups!$A$42:$B$47,2,FALSE)<0.8*VLOOKUP(L76,Lookups!$A$42:$B$47,2,FALSE)),$I$9,IF(AND(VLOOKUP(M76,Lookups!$A$42:$B$47,2,FALSE)<=VLOOKUP(L76,Lookups!$A$42:$B$47,2,FALSE),VLOOKUP(M76,Lookups!$A$42:$B$47,2,FALSE)>=0.8*VLOOKUP(L76,Lookups!$A$42:$B$47,2,FALSE)),$I$10,IF(VLOOKUP(M76,Lookups!$A$42:$B$47,2,FALSE)>VLOOKUP(L76,Lookups!$A$42:$B$47,2,FALSE),$I$11,\"\")))))","v":0},null,"Built-in","Built-in",null,{"$f":"IF(R76=\"\",$I$7,IF(VLOOKUP(R76,Lookups!$A$42:$B$47,2,FALSE)<VLOOKUP(P76,Lookups!$A$42:$B$47,2,FALSE),$I$8,IF(AND(VLOOKUP(R76,Lookups!$A$42:$B$47,2,FALSE)>=VLOOKUP(P76,Lookups!$A$42:$B$47,2,FALSE),VLOOKUP(R76,Lookups!$A$42:$B$47,2,FALSE)<0.8*VLOOKUP(Q76,Lookups!$A$42:$B$47,2,FALSE)),$I$9,IF(AND(VLOOKUP(R76,Lookups!$A$42:$B$47,2,FALSE)<=VLOOKUP(Q76,Lookups!$A$42:$B$47,2,FALSE),VLOOKUP(R76,Lookups!$A$42:$B$47,2,FALSE)>=0.8*VLOOKUP(Q76,Lookups!$A$42:$B$47,2,FALSE)),$I$10,IF(VLOOKUP(R76,Lookups!$A$42:$B$47,2,FALSE)>VLOOKUP(Q76,Lookups!$A$42:$B$47,2,FALSE),$I$11,\"\")))))","v":0},null,"Built-in","Built-in",null,{"$f":"IF(W76=\"\",$I$7,IF(VLOOKUP(W76,Lookups!$A$42:$B$47,2,FALSE)<VLOOKUP(U76,Lookups!$A$42:$B$47,2,FALSE),$I$8,IF(AND(VLOOKUP(W76,Lookups!$A$42:$B$47,2,FALSE)>=VLOOKUP(U76,Lookups!$A$42:$B$47,2,FALSE),VLOOKUP(W76,Lookups!$A$42:$B$47,2,FALSE)<0.8*VLOOKUP(V76,Lookups!$A$42:$B$47,2,FALSE)),$I$9,IF(AND(VLOOKUP(W76,Lookups!$A$42:$B$47,2,FALSE)<=VLOOKUP(V76,Lookups!$A$42:$B$47,2,FALSE),VLOOKUP(W76,Lookups!$A$42:$B$47,2,FALSE)>=0.8*VLOOKUP(V76,Lookups!$A$42:$B$47,2,FALSE)),$I$10,IF(VLOOKUP(W76,Lookups!$A$42:$B$47,2,FALSE)>VLOOKUP(V76,Lookups!$A$42:$B$47,2,FALSE),$I$11,\"\")))))","v":0},null,"Built-in","Built-in",null,{"$f":"IF(AB76=\"\",$I$7,IF(VLOOKUP(AB76,Lookups!$A$42:$B$47,2,FALSE)<VLOOKUP(Z76,Lookups!$A$42:$B$47,2,FALSE),$I$8,IF(AND(VLOOKUP(AB76,Lookups!$A$42:$B$47,2,FALSE)>=VLOOKUP(Z76,Lookups!$A$42:$B$47,2,FALSE),VLOOKUP(AB76,Lookups!$A$42:$B$47,2,FALSE)<0.8*VLOOKUP(AA76,Lookups!$A$42:$B$47,2,FALSE)),$I$9,IF(AND(VLOOKUP(AB76,Lookups!$A$42:$B$47,2,FALSE)<=VLOOKUP(AA76,Lookups!$A$42:$B$47,2,FALSE),VLOOKUP(AB76,Lookups!$A$42:$B$47,2,FALSE)>=0.8*VLOOKUP(AA76,Lookups!$A$42:$B$47,2,FALSE)),$I$10,IF(VLOOKUP(AB76,Lookups!$A$42:$B$47,2,FALSE)>VLOOKUP(AA76,Lookups!$A$42:$B$47,2,FALSE),$I$11,\"\")))))","v":0},{"$nulls":3},"Connectivity",{"v":0.005,"d":"0.5%"},null,"Wired (USB)","Wireless (BT) ",null,{"$f":"IF(AL76=\"\",$I$7,IF(VLOOKUP(AL76,Lookups!$A$42:$B$47,2,FALSE)<VLOOKUP(AJ76,Lookups!$A$42:$B$47,2,FALSE),$I$8,IF(AND(VLOOKUP(AL76,Lookups!$A$42:$B$47,2,FALSE)>=VLOOKUP(AJ76,Lookups!$A$42:$B$47,2,FALSE),VLOOKUP(AL76,Lookups!$A$42:$B$47,2,FALSE)<0.8*VLOOKUP(AK76,Lookups!$A$42:$B$47,2,FALSE)),$I$9,IF(AND(VLOOKUP(AL76,Lookups!$A$42:$B$47,2,FALSE)<=VLOOKUP(AK76,Lookups!$A$42:$B$47,2,FALSE),VLOOKUP(AL76,Lookups!$A$42:$B$47,2,FALSE)>=0.8*VLOOKUP(AK76,Lookups!$A$42:$B$47,2,FALSE)),$I$10,IF(VLOOKUP(AL76,Lookups!$A$42:$B$47,2,FALSE)>VLOOKUP(AK76,Lookups!$A$42:$B$47,2,FALSE),$I$11,\"\")))))","v":0},null,"Wired (USB)","Wireless (BT) ",null,{"$f":"IF(AQ76=\"\",$I$7,IF(VLOOKUP(AQ76,Lookups!$A$42:$B$47,2,FALSE)<VLOOKUP(AO76,Lookups!$A$42:$B$47,2,FALSE),$I$8,IF(AND(VLOOKUP(AQ76,Lookups!$A$42:$B$47,2,FALSE)>=VLOOKUP(AO76,Lookups!$A$42:$B$47,2,FALSE),VLOOKUP(AQ76,Lookups!$A$42:$B$47,2,FALSE)<0.8*VLOOKUP(AP76,Lookups!$A$42:$B$47,2,FALSE)),$I$9,IF(AND(VLOOKUP(AQ76,Lookups!$A$42:$B$47,2,FALSE)<=VLOOKUP(AP76,Lookups!$A$42:$B$47,2,FALSE),VLOOKUP(AQ76,Lookups!$A$42:$B$47,2,FALSE)>=0.8*VLOOKUP(AP76,Lookups!$A$42:$B$47,2,FALSE)),$I$10,IF(VLOOKUP(AQ76,Lookups!$A$42:$B$47,2,FALSE)>VLOOKUP(AP76,Lookups!$A$42:$B$47,2,FALSE),$I$11,\"\")))))","v":0},null,"Wireless (USB Shared)","Wireless (BT) ",null,{"$f":"IF(AV76=\"\",$I$7,IF(VLOOKUP(AV76,Lookups!$A$42:$B$47,2,FALSE)<VLOOKUP(AT76,Lookups!$A$42:$B$47,2,FALSE),$I$8,IF(AND(VLOOKUP(AV76,Lookups!$A$42:$B$47,2,FALSE)>=VLOOKUP(AT76,Lookups!$A$42:$B$47,2,FALSE),VLOOKUP(AV76,Lookups!$A$42:$B$47,2,FALSE)<0.8*VLOOKUP(AU76,Lookups!$A$42:$B$47,2,FALSE)),$I$9,IF(AND(VLOOKUP(AV76,Lookups!$A$42:$B$47,2,FALSE)<=VLOOKUP(AU76,Lookups!$A$42:$B$47,2,FALSE),VLOOKUP(AV76,Lookups!$A$42:$B$47,2,FALSE)>=0.8*VLOOKUP(AU76,Lookups!$A$42:$B$47,2,FALSE)),$I$10,IF(VLOOKUP(AV76,Lookups!$A$42:$B$47,2,FALSE)>VLOOKUP(AU76,Lookups!$A$42:$B$47,2,FALSE),$I$11,\"\")))))","v":0}]
[null,null,"Power Source",{"v":0,"d":"0.0%"},null,"Device","Device",null,{"$f":"IF(H77=\"\",$I$7,IF(VLOOKUP(H77,Lookups!$A$50:$B$52,2,FALSE)<VLOOKUP(F77,Lookups!$A$50:$B$52,2,FALSE),$I$8,IF(AND(VLOOKUP(H77,Lookups!$A$50:$B$52,2,FALSE)>=VLOOKUP(F77,Lookups!$A$50:$B$52,2,FALSE),VLOOKUP(H77,Lookups!$A$50:$B$52,2,FALSE)<0.8*VLOOKUP(G77,Lookups!$A$50:$B$52,2,FALSE)),$I$9,IF(AND(VLOOKUP(H77,Lookups!$A$50:$B$52,2,FALSE)<=VLOOKUP(G77,Lookups!$A$50:$B$52,2,FALSE),VLOOKUP(H77,Lookups!$A$50:$B$52,2,FALSE)>=0.8*VLOOKUP(G77,Lookups!$A$50:$B$52,2,FALSE)),$I$10,IF(VLOOKUP(H77,Lookups!$A$50:$B$52,2,FALSE)>VLOOKUP(G77,Lookups!$A$50:$B$52,2,FALSE),$I$11,\"\")))))","v":0},null,"Device","Device",null,{"$f":"IF(M77=\"\",$I$7,IF(VLOOKUP(M77,Lookups!$A$50:$B$52,2,FALSE)<VLOOKUP(K77,Lookups!$A$50:$B$52,2,FALSE),$I$8,IF(AND(VLOOKUP(M77,Lookups!$A$50:$B$52,2,FALSE)>=VLOOKUP(K77,Lookups!$A$50:$B$52,2,FALSE),VLOOKUP(M77,Lookups!$A$50:$B$52,2,FALSE)<0.8*VLOOKUP(L77,Lookups!$A$50:$B$52,2,FALSE)),$I$9,IF(AND(VLOOKUP(M77,Lookups!$A$50:$B$52,2,FALSE)<=VLOOKUP(L77,Lookups!$A$50:$B$52,2,FALSE),VLOOKUP(M77,Lookups!$A$50:$B$52,2,FALSE)>=0.8*VLOOKUP(L77,Lookups!$A$50:$B$52,2,FALSE)),$I$10,IF(VLOOKUP(M77,Lookups!$A$50:$B$52,2,FALSE)>VLOOKUP(L77,Lookups!$A$50:$B$52,2,FALSE),$I$11,\"\")))))","v":0},null,"Device","Device",null,{"$f":"IF(R77=\"\",$I$7,IF(VLOOKUP(R77,Lookups!$A$50:$B$52,2,FALSE)<VLOOKUP(P77,Lookups!$A$50:$B$52,2,FALSE),$I$8,IF(AND(VLOOKUP(R77,Lookups!$A$50:$B$52,2,FALSE)>=VLOOKUP(P77,Lookups!$A$50:$B$52,2,FALSE),VLOOKUP(R77,Lookups!$A$50:$B$52,2,FALSE)<0.8*VLOOKUP(Q77,Lookups!$A$50:$B$52,2,FALSE)),$I$9,IF(AND(VLOOKUP(R77,Lookups!$A$50:$B$52,2,FALSE)<=VLOOKUP(Q77,Lookups!$A$50:$B$52,2,FALSE),VLOOKUP(R77,Lookups!$A$50:$B$52,2,FALSE)>=0.8*VLOOKUP(Q77,Lookups!$A$50:$B$52,2,FALSE)),$I$10,IF(VLOOKUP(R77,Lookups!$A$50:$B$52,2,FALSE)>VLOOKUP(Q77,Lookups!$A$50:$B$52,2,FALSE),$I$11,\"\")))))","v":0},null,"Device","Device",null,{"$f":"IF(W77=\"\",$I$7,IF(VLOOKUP(W77,Lookups!$A$50:$B$52,2,FALSE)<VLOOKUP(U77,Lookups!$A$50:$B$52,2,FALSE),$I$8,IF(AND(VLOOKUP(W77,Lookups!$A$50:$B$52,2,FALSE)>=VLOOKUP(U77,Lookups!$A$50:$B$52,2,FALSE),VLOOKUP(W77,Lookups!$A$50:$B$52,2,FALSE)<0.8*VLOOKUP(V77,Lookups!$A$50:$B$52,2,FALSE)),$I$9,IF(AND(VLOOKUP(W77,Lookups!$A$50:$B$52,2,FALSE)<=VLOOKUP(V77,Lookups!$A$50:$B$52,2,FALSE),VLOOKUP(W77,Lookups!$A$50:$B$52,2,FALSE)>=0.8*VLOOKUP(V77,Lookups!$A$50:$B$52,2,FALSE)),$I$10,IF(VLOOKUP(W77,Lookups!$A$50:$B$52,2,FALSE)>VLOOKUP(V77,Lookups!$A$50:$B$52,2,FALSE),$I$11,\"\")))))","v":0},null,"Device","Device",null,{"$f":"IF(AB77=\"\",$I$7,IF(VLOOKUP(AB77,Lookups!$A$50:$B$52,2,FALSE)<VLOOKUP(Z77,Lookups!$A$50:$B$52,2,FALSE),$I$8,IF(AND(VLOOKUP(AB77,Lookups!$A$50:$B$52,2,FALSE)>=VLOOKUP(Z77,Lookups!$A$50:$B$52,2,FALSE),VLOOKUP(AB77,Lookups!$A$50:$B$52,2,FALSE)<0.8*VLOOKUP(AA77,Lookups!$A$50:$B$52,2,FALSE)),$I$9,IF(AND(VLOOKUP(AB77,Lookups!$A$50:$B$52,2,FALSE)<=VLOOKUP(AA77,Lookups!$A$50:$B$52,2,FALSE),VLOOKUP(AB77,Lookups!$A$50:$B$52,2,FALSE)>=0.8*VLOOKUP(AA77,Lookups!$A$50:$B$52,2,FALSE)),$I$10,IF(VLOOKUP(AB77,Lookups!$A$50:$B$52,2,FALSE)>VLOOKUP(AA77,Lookups!$A$50:$B$52,2,FALSE),$I$11,\"\")))))","v":0},{"$nulls":3},"Power Source",{"v":0.005,"d":"0.5%"},null,"Device","Batteries",null,{"$f":"IF(AL77=\"\",$I$7,IF(VLOOKUP(AL77,Lookups!$A$50:$B$52,2,FALSE)<VLOOKUP(AJ77,Lookups!$A$50:$B$52,2,FALSE),$I$8,IF(AND(VLOOKUP(AL77,Lookups!$A$50:$B$52,2,FALSE)>=VLOOKUP(AJ77,Lookups!$A$50:$B$52,2,FALSE),VLOOKUP(AL77,Lookups!$A$50:$B$52,2,FALSE)<0.8*VLOOKUP(AK77,Lookups!$A$50:$B$52,2,FALSE)),$I$9,IF(AND(VLOOKUP(AL77,Lookups!$A$50:$B$52,2,FALSE)<=VLOOKUP(AK77,Lookups!$A$50:$B$52,2,FALSE),VLOOKUP(AL77,Lookups!$A$50:$B$52,2,FALSE)>=0.8*VLOOKUP(AK77,Lookups!$A$50:$B$52,2,FALSE)),$I$10,IF(VLOOKUP(AL77,Lookups!$A$50:$B$52,2,FALSE)>VLOOKUP(AK77,Lookups!$A$50:$B$52,2,FALSE),$I$11,\"\")))))","v":0},null,"Device","Rechareable batteries",null,{"$f":"IF(AQ77=\"\",$I$7,IF(VLOOKUP(AQ77,Lookups!$A$50:$B$52,2,FALSE)<VLOOKUP(AO77,Lookups!$A$50:$B$52,2,FALSE),$I$8,IF(AND(VLOOKUP(AQ77,Lookups!$A$50:$B$52,2,FALSE)>=VLOOKUP(AO77,Lookups!$A$50:$B$52,2,FALSE),VLOOKUP(AQ77,Lookups!$A$50:$B$52,2,FALSE)<0.8*VLOOKUP(AP77,Lookups!$A$50:$B$52,2,FALSE)),$I$9,IF(AND(VLOOKUP(AQ77,Lookups!$A$50:$B$52,2,FALSE)<=VLOOKUP(AP77,Lookups!$A$50:$B$52,2,FALSE),VLOOKUP(AQ77,Lookups!$A$50:$B$52,2,FALSE)>=0.8*VLOOKUP(AP77,Lookups!$A$50:$B$52,2,FALSE)),$I$10,IF(VLOOKUP(AQ77,Lookups!$A$50:$B$52,2,FALSE)>VLOOKUP(AP77,Lookups!$A$50:$B$52,2,FALSE),$I$11,\"\")))))","v":0},null,"Rechareable batteries","Rechareable batteries",null,{"$f":"IF(AV77=\"\",$I$7,IF(VLOOKUP(AV77,Lookups!$A$50:$B$52,2,FALSE)<VLOOKUP(AT77,Lookups!$A$50:$B$52,2,FALSE),$I$8,IF(AND(VLOOKUP(AV77,Lookups!$A$50:$B$52,2,FALSE)>=VLOOKUP(AT77,Lookups!$A$50:$B$52,2,FALSE),VLOOKUP(AV77,Lookups!$A$50:$B$52,2,FALSE)<0.8*VLOOKUP(AU77,Lookups!$A$50:$B$52,2,FALSE)),$I$9,IF(AND(VLOOKUP(AV77,Lookups!$A$50:$B$52,2,FALSE)<=VLOOKUP(AU77,Lookups!$A$50:$B$52,2,FALSE),VLOOKUP(AV77,Lookups!$A$50:$B$52,2,FALSE)>=0.8*VLOOKUP(AU77,Lookups!$A$50:$B$52,2,FALSE)),$I$10,IF(VLOOKUP(AV77,Lookups!$A$50:$B$52,2,FALSE)>VLOOKUP(AU77,Lookups!$A$50:$B$52,2,FALSE),$I$11,\"\")))))","v":0}]
[{"$f":"SUM(D78:D79)","v":{"v":0.04,"d":"4%"}},"Webcam and Mic","Webcam Resolution",{"v":0.02,"d":"2.0%"},null,"1280x720","1920x1080",null,{"$f":"IF(H78=\"\",$I$7,IF(VLOOKUP(H78,Lookups!$A$55:$B$72,2,FALSE)<VLOOKUP(F78,Lookups!$A$55:$B$72,2,FALSE),$I$8,IF(AND(VLOOKUP(H78,Lookups!$A$55:$B$72,2,FALSE)>=VLOOKUP(F78,Lookups!$A$55:$B$72,2,FALSE),VLOOKUP(H78,Lookups!$A$55:$B$72,2,FALSE)<0.8*VLOOKUP(G78,Lookups!$A$55:$B$72,2,FALSE)),$I$9,IF(AND(VLOOKUP(H78,Lookups!$A$55:$B$72,2,FALSE)<=VLOOKUP(G78,Lookups!$A$55:$B$72,2,FALSE),VLOOKUP(H78,Lookups!$A$55:$B$72,2,FALSE)>=0.8*VLOOKUP(G78,Lookups!$A$55:$B$72,2,FALSE)),$I$10,IF(VLOOKUP(H78,Lookups!$A$55:$B$72,2,FALSE)>VLOOKUP(G78,Lookups!$A$55:$B$72,2,FALSE),$I$11,\"\")))))","v":0},null,"1920x1080","1920x1080",null,{"$f":"IF(M78=\"\",$I$7,IF(VLOOKUP(M78,Lookups!$A$55:$B$72,2,FALSE)<VLOOKUP(K78,Lookups!$A$55:$B$72,2,FALSE),$I$8,IF(AND(VLOOKUP(M78,Lookups!$A$55:$B$72,2,FALSE)>=VLOOKUP(K78,Lookups!$A$55:$B$72,2,FALSE),VLOOKUP(M78,Lookups!$A$55:$B$72,2,FALSE)<0.8*VLOOKUP(L78,Lookups!$A$55:$B$72,2,FALSE)),$I$9,IF(AND(VLOOKUP(M78,Lookups!$A$55:$B$72,2,FALSE)<=VLOOKUP(L78,Lookups!$A$55:$B$72,2,FALSE),VLOOKUP(M78,Lookups!$A$55:$B$72,2,FALSE)>=0.8*VLOOKUP(L78,Lookups!$A$55:$B$72,2,FALSE)),$I$10,IF(VLOOKUP(M78,Lookups!$A$55:$B$72,2,FALSE)>VLOOKUP(L78,Lookups!$A$55:$B$72,2,FALSE),$I$11,\"\")))))","v":0},null,"1920x1080","1920x1080",null,{"$f":"IF(R78=\"\",$I$7,IF(VLOOKUP(R78,Lookups!$A$55:$B$72,2,FALSE)<VLOOKUP(P78,Lookups!$A$55:$B$72,2,FALSE),$I$8,IF(AND(VLOOKUP(R78,Lookups!$A$55:$B$72,2,FALSE)>=VLOOKUP(P78,Lookups!$A$55:$B$72,2,FALSE),VLOOKUP(R78,Lookups!$A$55:$B$72,2,FALSE)<0.8*VLOOKUP(Q78,Lookups!$A$55:$B$72,2,FALSE)),$I$9,IF(AND(VLOOKUP(R78,Lookups!$A$55:$B$72,2,FALSE)<=VLOOKUP(Q78,Lookups!$A$55:$B$72,2,FALSE),VLOOKUP(R78,Lookups!$A$55:$B$72,2,FALSE)>=0.8*VLOOKUP(Q78,Lookups!$A$55:$B$72,2,FALSE)),$I$10,IF(VLOOKUP(R78,Lookups!$A$55:$B$72,2,FALSE)>VLOOKUP(Q78,Lookups!$A$55:$B$72,2,FALSE),$I$11,\"\")))))","v":0},null,"1280x720","1920x1080",null,{"$f":"IF(W78=\"\",$I$7,IF(VLOOKUP(W78,Lookups!$A$55:$B$72,2,FALSE)<VLOOKUP(U78,Lookups!$A$55:$B$72,2,FALSE),$I$8,IF(AND(VLOOKUP(W78,Lookups!$A$55:$B$72,2,FALSE)>=VLOOKUP(U78,Lookups!$A$55:$B$72,2,FALSE),VLOOKUP(W78,Lookups!$A$55:$B$72,2,FALSE)<0.8*VLOOKUP(V78,Lookups!$A$55:$B$72,2,FALSE)),$I$9,IF(AND(VLOOKUP(W78,Lookups!$A$55:$B$72,2,FALSE)<=VLOOKUP(V78,Lookups!$A$55:$B$72,2,FALSE),VLOOKUP(W78,Lookups!$A$55:$B$72,2,FALSE)>=0.8*VLOOKUP(V78,Lookups!$A$55:$B$72,2,FALSE)),$I$10,IF(VLOOKUP(W78,Lookups!$A$55:$B$72,2,FALSE)>VLOOKUP(V78,Lookups!$A$55:$B$72,2,FALSE),$I$11,\"\")))))","v":0},null,"1280x720","1920x1080",null,{"$f":"IF(AB78=\"\",$I$7,IF(VLOOKUP(AB78,Lookups!$A$55:$B$72,2,FALSE)<VLOOKUP(Z78,Lookups!$A$55:$B$72,2,FALSE),$I$8,IF(AND(VLOOKUP(AB78,Lookups!$A$55:$B$72,2,FALSE)>=VLOOKUP(Z78,Lookups!$A$55:$B$72,2,FALSE),VLOOKUP(AB78,Lookups!$A$55:$B$72,2,FALSE)<0.8*VLOOKUP(AA78,Lookups!$A$55:$B$72,2,FALSE)),$I$9,IF(AND(VLOOKUP(AB78,Lookups!$A$55:$B$72,2,FALSE)<=VLOOKUP(AA78,Lookups!$A$55:$B$72,2,FALSE),VLOOKUP(AB78,Lookups!$A$55:$B$72,2,FALSE)>=0.8*VLOOKUP(AA78,Lookups!$A$55:$B$72,2,FALSE)),$I$10,IF(VLOOKUP(AB78,Lookups!$A$55:$B$72,2,FALSE)>VLOOKUP(AA78,Lookups!$A$55:$B$72,2,FALSE),$I$11,\"\")))))","v":0},null,{"$f":"SUM(AH78:AH79)","v":{"v":0,"d":"0%"}},"Webcam and Mic","Webcam Resolution",{"v":0,"d":"0.0%"},null,"No Webcam","No Webcam",null,{"$f":"IF(AL78=\"\",$I$7,IF(VLOOKUP(AL78,Lookups!$A$55:$B$72,2,FALSE)<VLOOKUP(AJ78,Lookups!$A$55:$B$72,2,FALSE),$I$8,IF(AND(VLOOKUP(AL78,Lookups!$A$55:$B$72,2,FALSE)>=VLOOKUP(AJ78,Lookups!$A$55:$B$72,2,FALSE),VLOOKUP(AL78,Lookups!$A$55:$B$72,2,FALSE)<0.8*VLOOKUP(AK78,Lookups!$A$55:$B$72,2,FALSE)),$I$9,IF(AND(VLOOKUP(AL78,Lookups!$A$55:$B$72,2,FALSE)<=VLOOKUP(AK78,Lookups!$A$55:$B$72,2,FALSE),VLOOKUP(AL78,Lookups!$A$55:$B$72,2,FALSE)>=0.8*VLOOKUP(AK78,Lookups!$A$55:$B$72,2,FALSE)),$I$10,IF(VLOOKUP(AL78,Lookups!$A$55:$B$72,2,FALSE)>VLOOKUP(AK78,Lookups!$A$55:$B$72,2,FALSE),$I$11,\"\")))))","v":0},null,"No Webcam","No Webcam",null,{"$f":"IF(AQ78=\"\",$I$7,IF(VLOOKUP(AQ78,Lookups!$A$55:$B$72,2,FALSE)<VLOOKUP(AO78,Lookups!$A$55:$B$72,2,FALSE),$I$8,IF(AND(VLOOKUP(AQ78,Lookups!$A$55:$B$72,2,FALSE)>=VLOOKUP(AO78,Lookups!$A$55:$B$72,2,FALSE),VLOOKUP(AQ78,Lookups!$A$55:$B$72,2,FALSE)<0.8*VLOOKUP(AP78,Lookups!$A$55:$B$72,2,FALSE)),$I$9,IF(AND(VLOOKUP(AQ78,Lookups!$A$55:$B$72,2,FALSE)<=VLOOKUP(AP78,Lookups!$A$55:$B$72,2,FALSE),VLOOKUP(AQ78,Lookups!$A$55:$B$72,2,FALSE)>=0.8*VLOOKUP(AP78,Lookups!$A$55:$B$72,2,FALSE)),$I$10,IF(VLOOKUP(AQ78,Lookups!$A$55:$B$72,2,FALSE)>VLOOKUP(AP78,Lookups!$A$55:$B$72,2,FALSE),$I$11,\"\")))))","v":0},null,"No Webcam","No Webcam",null,{"$f":"IF(AV78=\"\",$I$7,IF(VLOOKUP(AV78,Lookups!$A$55:$B$72,2,FALSE)<VLOOKUP(AT78,Lookups!$A$55:$B$72,2,FALSE),$I$8,IF(AND(VLOOKUP(AV78,Lookups!$A$55:$B$72,2,FALSE)>=VLOOKUP(AT78,Lookups!$A$55:$B$72,2,FALSE),VLOOKUP(AV78,Lookups!$A$55:$B$72,2,FALSE)<0.8*VLOOKUP(AU78,Lookups!$A$55:$B$72,2,FALSE)),$I$9,IF(AND(VLOOKUP(AV78,Lookups!$A$55:$B$72,2,FALSE)<=VLOOKUP(AU78,Lookups!$A$55:$B$72,2,FALSE),VLOOKUP(AV78,Lookups!$A$55:$B$72,2,FALSE)>=0.8*VLOOKUP(AU78,Lookups!$A$55:$B$72,2,FALSE)),$I$10,IF(VLOOKUP(AV78,Lookups!$A$55:$B$72,2,FALSE)>VLOOKUP(AU78,Lookups!$A$55:$B$72,2,FALSE),$I$11,\"\")))))","v":0}]
[null,null,"Built-in Mic",{"v":0.02,"d":"2.0%"},null,"Yes, WITH noise cancelling","Yes, WITH noise cancelling",null,{"$f":"IF(H79=\"\",$I$7,IF(VLOOKUP(H79,Lookups!$A$75:$B$77,2,FALSE)<VLOOKUP(F79,Lookups!$A$75:$B$77,2,FALSE),$I$8,IF(AND(VLOOKUP(H79,Lookups!$A$75:$B$77,2,FALSE)>=VLOOKUP(F79,Lookups!$A$75:$B$77,2,FALSE),VLOOKUP(H79,Lookups!$A$75:$B$77,2,FALSE)<0.8*VLOOKUP(G79,Lookups!$A$75:$B$77,2,FALSE)),$I$9,IF(AND(VLOOKUP(H79,Lookups!$A$75:$B$77,2,FALSE)<=VLOOKUP(G79,Lookups!$A$75:$B$77,2,FALSE),VLOOKUP(H79,Lookups!$A$75:$B$77,2,FALSE)>=0.8*VLOOKUP(G79,Lookups!$A$75:$B$77,2,FALSE)),$I$10,IF(VLOOKUP(H79,Lookups!$A$75:$B$77,2,FALSE)>VLOOKUP(G79,Lookups!$A$75:$B$77,2,FALSE),$I$11,\"\")))))","v":0},null,"Yes, without noise cancelling","Yes, WITH noise cancelling",null,{"$f":"IF(M79=\"\",$I$7,IF(VLOOKUP(M79,Lookups!$A$75:$B$77,2,FALSE)<VLOOKUP(K79,Lookups!$A$75:$B$77,2,FALSE),$I$8,IF(AND(VLOOKUP(M79,Lookups!$A$75:$B$77,2,FALSE)>=VLOOKUP(K79,Lookups!$A$75:$B$77,2,FALSE),VLOOKUP(M79,Lookups!$A$75:$B$77,2,FALSE)<0.8*VLOOKUP(L79,Lookups!$A$75:$B$77,2,FALSE)),$I$9,IF(AND(VLOOKUP(M79,Lookups!$A$75:$B$77,2,FALSE)<=VLOOKUP(L79,Lookups!$A$75:$B$77,2,FALSE),VLOOKUP(M79,Lookups!$A$75:$B$77,2,FALSE)>=0.8*VLOOKUP(L79,Lookups!$A$75:$B$77,2,FALSE)),$I$10,IF(VLOOKUP(M79,Lookups!$A$75:$B$77,2,FALSE)>VLOOKUP(L79,Lookups!$A$75:$B$77,2,FALSE),$I$11,\"\")))))","v":0},null,"Yes, WITH noise cancelling","Yes, WITH noise cancelling",null,{"$f":"IF(R79=\"\",$I$7,IF(VLOOKUP(R79,Lookups!$A$75:$B$77,2,FALSE)<VLOOKUP(P79,Lookups!$A$75:$B$77,2,FALSE),$I$8,IF(AND(VLOOKUP(R79,Lookups!$A$75:$B$77,2,FALSE)>=VLOOKUP(P79,Lookups!$A$75:$B$77,2,FALSE),VLOOKUP(R79,Lookups!$A$75:$B$77,2,FALSE)<0.8*VLOOKUP(Q79,Lookups!$A$75:$B$77,2,FALSE)),$I$9,IF(AND(VLOOKUP(R79,Lookups!$A$75:$B$77,2,FALSE)<=VLOOKUP(Q79,Lookups!$A$75:$B$77,2,FALSE),VLOOKUP(R79,Lookups!$A$75:$B$77,2,FALSE)>=0.8*VLOOKUP(Q79,Lookups!$A$75:$B$77,2,FALSE)),$I$10,IF(VLOOKUP(R79,Lookups!$A$75:$B$77,2,FALSE)>VLOOKUP(Q79,Lookups!$A$75:$B$77,2,FALSE),$I$11,\"\")))))","v":0},null,"Yes, WITH noise cancelling","Yes, WITH noise cancelling",null,{"$f":"IF(W79=\"\",$I$7,IF(VLOOKUP(W79,Lookups!$A$75:$B$77,2,FALSE)<VLOOKUP(U79,Lookups!$A$75:$B$77,2,FALSE),$I$8,IF(AND(VLOOKUP(W79,Lookups!$A$75:$B$77,2,FALSE)>=VLOOKUP(U79,Lookups!$A$75:$B$77,2,FALSE),VLOOKUP(W79,Lookups!$A$75:$B$77,2,FALSE)<0.8*VLOOKUP(V79,Lookups!$A$75:$B$77,2,FALSE)),$I$9,IF(AND(VLOOKUP(W79,Lookups!$A$75:$B$77,2,FALSE)<=VLOOKUP(V79,Lookups!$A$75:$B$77,2,FALSE),VLOOKUP(W79,Lookups!$A$75:$B$77,2,FALSE)>=0.8*VLOOKUP(V79,Lookups!$A$75:$B$77,2,FALSE)),$I$10,IF(VLOOKUP(W79,Lookups!$A$75:$B$77,2,FALSE)>VLOOKUP(V79,Lookups!$A$75:$B$77,2,FALSE),$I$11,\"\")))))","v":0},null,"Yes, WITH noise cancelling","Yes, WITH noise cancelling",null,{"$f":"IF(AB79=\"\",$I$7,IF(VLOOKUP(AB79,Lookups!$A$75:$B$77,2,FALSE)<VLOOKUP(Z79,Lookups!$A$75:$B$77,2,FALSE),$I$8,IF(AND(VLOOKUP(AB79,Lookups!$A$75:$B$77,2,FALSE)>=VLOOKUP(Z79,Lookups!$A$75:$B$77,2,FALSE),VLOOKUP(AB79,Lookups!$A$75:$B$77,2,FALSE)<0.8*VLOOKUP(AA79,Lookups!$A$75:$B$77,2,FALSE)),$I$9,IF(AND(VLOOKUP(AB79,Lookups!$A$75:$B$77,2,FALSE)<=VLOOKUP(AA79,Lookups!$A$75:$B$77,2,FALSE),VLOOKUP(AB79,Lookups!$A$75:$B$77,2,FALSE)>=0.8*VLOOKUP(AA79,Lookups!$A$75:$B$77,2,FALSE)),$I$10,IF(VLOOKUP(AB79,Lookups!$A$75:$B$77,2,FALSE)>VLOOKUP(AA79,Lookups!$A$75:$B$77,2,FALSE),$I$11,\"\")))))","v":0},{"$nulls":3},"Built-in Mic",{"v":0,"d":"0.0%"},null,"No built-in microphone","No built-in microphone",null,{"$f":"IF(AL79=\"\",$I$7,IF(VLOOKUP(AL79,Lookups!$A$75:$B$77,2,FALSE)<VLOOKUP(AJ79,Lookups!$A$75:$B$77,2,FALSE),$I$8,IF(AND(VLOOKUP(AL79,Lookups!$A$75:$B$77,2,FALSE)>=VLOOKUP(AJ79,Lookups!$A$75:$B$77,2,FALSE),VLOOKUP(AL79,Lookups!$A$75:$B$77,2,FALSE)<0.8*VLOOKUP(AK79,Lookups!$A$75:$B$77,2,FALSE)),$I$9,IF(AND(VLOOKUP(AL79,Lookups!$A$75:$B$77,2,FALSE)<=VLOOKUP(AK79,Lookups!$A$75:$B$77,2,FALSE),VLOOKUP(AL79,Lookups!$A$75:$B$77,2,FALSE)>=0.8*VLOOKUP(AK79,Lookups!$A$75:$B$77,2,FALSE)),$I$10,IF(VLOOKUP(AL79,Lookups!$A$75:$B$77,2,FALSE)>VLOOKUP(AK79,Lookups!$A$75:$B$77,2,FALSE),$I$11,\"\")))))","v":0},null,"No built-in microphone","No built-in microphone",null,{"$f":"IF(AQ79=\"\",$I$7,IF(VLOOKUP(AQ79,Lookups!$A$75:$B$77,2,FALSE)<VLOOKUP(AO79,Lookups!$A$75:$B$77,2,FALSE),$I$8,IF(AND(VLOOKUP(AQ79,Lookups!$A$75:$B$77,2,FALSE)>=VLOOKUP(AO79,Lookups!$A$75:$B$77,2,FALSE),VLOOKUP(AQ79,Lookups!$A$75:$B$77,2,FALSE)<0.8*VLOOKUP(AP79,Lookups!$A$75:$B$77,2,FALSE)),$I$9,IF(AND(VLOOKUP(AQ79,Lookups!$A$75:$B$77,2,FALSE)<=VLOOKUP(AP79,Lookups!$A$75:$B$77,2,FALSE),VLOOKUP(AQ79,Lookups!$A$75:$B$77,2,FALSE)>=0.8*VLOOKUP(AP79,Lookups!$A$75:$B$77,2,FALSE)),$I$10,IF(VLOOKUP(AQ79,Lookups!$A$75:$B$77,2,FALSE)>VLOOKUP(AP79,Lookups!$A$75:$B$77,2,FALSE),$I$11,\"\")))))","v":0},null,"No built-in microphone","No built-in microphone",null,{"$f":"IF(AV79=\"\",$I$7,IF(VLOOKUP(AV79,Lookups!$A$75:$B$77,2,FALSE)<VLOOKUP(AT79,Lookups!$A$75:$B$77,2,FALSE),$I$8,IF(AND(VLOOKUP(AV79,Lookups!$A$75:$B$77,2,FALSE)>=VLOOKUP(AT79,Lookups!$A$75:$B$77,2,FALSE),VLOOKUP(AV79,Lookups!$A$75:$B$77,2,FALSE)<0.8*VLOOKUP(AU79,Lookups!$A$75:$B$77,2,FALSE)),$I$9,IF(AND(VLOOKUP(AV79,Lookups!$A$75:$B$77,2,FALSE)<=VLOOKUP(AU79,Lookups!$A$75:$B$77,2,FALSE),VLOOKUP(AV79,Lookups!$A$75:$B$77,2,FALSE)>=0.8*VLOOKUP(AU79,Lookups!$A$75:$B$77,2,FALSE)),$I$10,IF(VLOOKUP(AV79,Lookups!$A$75:$B$77,2,FALSE)>VLOOKUP(AU79,Lookups!$A$75:$B$77,2,FALSE),$I$11,\"\")))))","v":0}]
[{"$f":"SUM(D80)","v":{"v":0.03,"d":"3%"}},"Battery","Maximum Continuous Operation on Battery Power (h)",{"v":0.03,"d":"3.0%"},null,8,16,null,{"$f":"IF(H80=\"\",$I$7,IF(H80<F80,$I$8,IF(AND(H80>=F80,H80<0.9*G80),$I$9,IF(AND(H80<=G80,H80>=0.9*G80),$I$10,IF(H80>G80,$I$11,\"\")))))","v":0},null,8,16,null,{"$f":"IF(M80=\"\",$I$7,IF(M80<K80,$I$8,IF(AND(M80>=K80,M80<0.9*L80),$I$9,IF(AND(M80<=L80,M80>=0.9*L80),$I$10,IF(M80>L80,$I$11,\"\")))))","v":0},null,8,16,null,{"$f":"IF(R80=\"\",$I$7,IF(R80<P80,$I$8,IF(AND(R80>=P80,R80<0.9*Q80),$I$9,IF(AND(R80<=Q80,R80>=0.9*Q80),$I$10,IF(R80>Q80,$I$11,\"\")))))","v":0},null,16,24,null,{"$f":"IF(W80=\"\",$I$7,IF(W80<U80,$I$8,IF(AND(W80>=U80,W80<0.9*V80),$I$9,IF(AND(W80<=V80,W80>=0.9*V80),$I$10,IF(W80>V80,$I$11,\"\")))))","v":0},null,16,24,null,{"$f":"IF(AB80=\"\",$I$7,IF(AB80<Z80,$I$8,IF(AND(AB80>=Z80,AB80<0.9*AA80),$I$9,IF(AND(AB80<=AA80,AB80>=0.9*AA80),$I$10,IF(AB80>AA80,$I$11,\"\")))))","v":0},null,{"$f":"SUM(AH80)","v":{"v":0,"d":"0%"}},"Battery","Maximum Continuous Operation on Battery Power (h)",{"v":0,"d":"0.0%"},{"$nulls":4},{"$f":"IF(AL80=\"\",$I$7,IF(AL80<AJ80,$I$8,IF(AND(AL80>=AJ80,AL80<0.9*AK80),$I$9,IF(AND(AL80<=AK80,AL80>=0.9*AK80),$I$10,IF(AL80>AK80,$I$11,\"\")))))","v":0},{"$nulls":4},{"$f":"IF(AQ80=\"\",$I$7,IF(AQ80<AO80,$I$8,IF(AND(AQ80>=AO80,AQ80<0.9*AP80),$I$9,IF(AND(AQ80<=AP80,AQ80>=0.9*AP80),$I$10,IF(AQ80>AP80,$I$11,\"\")))))","v":0},{"$nulls":4},{"$f":"IF(AV80=\"\",$I$7,IF(AV80<AT80,$I$8,IF(AND(AV80>=AT80,AV80<0.9*AU80),$I$9,IF(AND(AV80<=AU80,AV80>=0.9*AU80),$I$10,IF(AV80>AU80,$I$11,\"\")))))","v":0}]
[{"$f":"SUM(D81:D84)","v":{"v":0.030000000000000002,"d":"3%"}},"Weight and Dimensions","Maximum Weight (kg)",{"v":0.015,"d":"1.5%"},null,1.3,1,null,{"$f":"IF(H81=\"\",$I$7,IF(H81>F81,$I$8,IF(AND(H81<=F81,H81>1.02*G81),$I$9,IF(AND(H81>=0.98*G81,H81<=1.02*G81),$I$10,IF(H81<0.98*G81,$I$11,\"\")))))","v":0},null,1.6,1.4,null,{"$f":"IF(M81=\"\",$I$7,IF(M81>K81,$I$8,IF(AND(M81<=K81,M81>1.02*L81),$I$9,IF(AND(M81>=0.98*L81,M81<=1.02*L81),$I$10,IF(M81<0.98*L81,$I$11,\"\")))))","v":0},null,1.8,1.5,null,{"$f":"IF(R81=\"\",$I$7,IF(R81>P81,$I$8,IF(AND(R81<=P81,R81>1.02*Q81),$I$9,IF(AND(R81>=0.98*Q81,R81<=1.02*Q81),$I$10,IF(R81<0.98*Q81,$I$11,\"\")))))","v":0},null,2.5,1.8,null,{"$f":"IF(W81=\"\",$I$7,IF(W81>U81,$I$8,IF(AND(W81<=U81,W81>1.02*V81),$I$9,IF(AND(W81>=0.98*V81,W81<=1.02*V81),$I$10,IF(W81<0.98*V81,$I$11,\"\")))))","v":0},null,2.5,1.8,null,{"$f":"IF(AB81=\"\",$I$7,IF(AB81>Z81,$I$8,IF(AND(AB81<=Z81,AB81>1.02*AA81),$I$9,IF(AND(AB81>=0.98*AA81,AB81<=1.02*AA81),$I$10,IF(AB81<0.98*AA81,$I$11,\"\")))))","v":0},null,{"$f":"SUM(AH81:AH84)","v":{"v":0,"d":"0%"}},"Weight and Dimensions","Maximum Weight (kg)",{"v":0,"d":"0.0%"},{"$nulls":4},{"$f":"IF(AL81=\"\",$I$7,IF(AL81>AJ81,$I$8,IF(AND(AL81<=AJ81,AL81>1.02*AK81),$I$9,IF(AND(AL81>=0.98*AK81,AL81<=1.02*AK81),$I$10,IF(AL81<0.98*AK81,$I$11,\"\")))))","v":0},{"$nulls":4},{"$f":"IF(AQ81=\"\",$I$7,IF(AQ81>AO81,$I$8,IF(AND(AQ81<=AO81,AQ81>1.02*AP81),$I$9,IF(AND(AQ81>=0.98*AP81,AQ81<=1.02*AP81),$I$10,IF(AQ81<0.98*AP81,$I$11,\"\")))))","v":0},{"$nulls":4},{"$f":"IF(AV81=\"\",$I$7,IF(AV81>AT81,$I$8,IF(AND(AV81<=AT81,AV81>1.02*AU81),$I$9,IF(AND(AV81>=0.98*AU81,AV81<=1.02*AU81),$I$10,IF(AV81<0.98*AU81,$I$11,\"\")))))","v":0}]
[null,"(Maximum)","Maximum Width (mm)",{"v":0.005,"d":"0.5%"},null,325,310,null,{"$f":"IF(H82=\"\",$I$7,IF(H82>F82,$I$8,IF(AND(H82<=F82,H82>1.015*G82),$I$9,IF(AND(H82>=0.985*G82,H82<=1.015*G82),$I$10,IF(H82<0.985*G82,$I$11,\"\")))))","v":0},null,325,325,null,{"$f":"IF(M82=\"\",$I$7,IF(M82>K82,$I$8,IF(AND(M82<=K82,M82>1.015*L82),$I$9,IF(AND(M82>=0.985*L82,M82<=1.015*L82),$I$10,IF(M82<0.985*L82,$I$11,\"\")))))","v":0},null,325,325,null,{"$f":"IF(R82=\"\",$I$7,IF(R82>P82,$I$8,IF(AND(R82<=P82,R82>1.015*Q82),$I$9,IF(AND(R82>=0.985*Q82,R82<=1.015*Q82),$I$10,IF(R82<0.985*Q82,$I$11,\"\")))))","v":0},null,360,310,null,{"$f":"IF(W82=\"\",$I$7,IF(W82>U82,$I$8,IF(AND(W82<=U82,W82>1.015*V82),$I$9,IF(AND(W82>=0.985*V82,W82<=1.015*V82),$I$10,IF(W82<0.985*V82,$I$11,\"\")))))","v":0},null,360,310,null,{"$f":"IF(AB82=\"\",$I$7,IF(AB82>Z82,$I$8,IF(AND(AB82<=Z82,AB82>1.015*AA82),$I$9,IF(AND(AB82>=0.985*AA82,AB82<=1.015*AA82),$I$10,IF(AB82<0.985*AA82,$I$11,\"\")))))","v":0},null,null,"(Maximum)","Maximum Width (mm)",{"v":0,"d":"0.0%"},{"$nulls":4},{"$f":"IF(AL82=\"\",$I$7,IF(AL82>AJ82,$I$8,IF(AND(AL82<=AJ82,AL82>1.015*AK82),$I$9,IF(AND(AL82>=0.985*AK82,AL82<=1.015*AK82),$I$10,IF(AL82<0.985*AK82,$I$11,\"\")))))","v":0},{"$nulls":4},{"$f":"IF(AQ82=\"\",$I$7,IF(AQ82>AO82,$I$8,IF(AND(AQ82<=AO82,AQ82>1.015*AP82),$I$9,IF(AND(AQ82>=0.985*AP82,AQ82<=1.015*AP82),$I$10,IF(AQ82<0.985*AP82,$I$11,\"\")))))","v":0},{"$nulls":4},{"$f":"IF(AV82=\"\",$I$7,IF(AV82>AT82,$I$8,IF(AND(AV82<=AT82,AV82>1.015*AU82),$I$9,IF(AND(AV82>=0.985*AU82,AV82<=1.015*AU82),$I$10,IF(AV82<0.985*AU82,$I$11,\"\")))))","v":0}]
[null,null,"Maximum Depth (mm)",{"v":0.005,"d":"0.5%"},null,210,210,null,{"$f":"IF(H83=\"\",$I$7,IF(H83>F83,$I$8,IF(AND(H83<=F83,H83>1.015*G83),$I$9,IF(AND(H83>=0.985*G83,H83<=1.015*G83),$I$10,IF(H83<0.985*G83,$I$11,\"\")))))","v":0},null,215,215,null,{"$f":"IF(M83=\"\",$I$7,IF(M83>K83,$I$8,IF(AND(M83<=K83,M83>1.015*L83),$I$9,IF(AND(M83>=0.985*L83,M83<=1.015*L83),$I$10,IF(M83<0.985*L83,$I$11,\"\")))))","v":0},null,215,215,null,{"$f":"IF(R83=\"\",$I$7,IF(R83>P83,$I$8,IF(AND(R83<=P83,R83>1.015*Q83),$I$9,IF(AND(R83>=0.985*Q83,R83<=1.015*Q83),$I$10,IF(R83<0.985*Q83,$I$11,\"\")))))","v":0},null,245,215,null,{"$f":"IF(W83=\"\",$I$7,IF(W83>U83,$I$8,IF(AND(W83<=U83,W83>1.015*V83),$I$9,IF(AND(W83>=0.985*V83,W83<=1.015*V83),$I$10,IF(W83<0.985*V83,$I$11,\"\")))))","v":0},null,245,215,null,{"$f":"IF(AB83=\"\",$I$7,IF(AB83>Z83,$I$8,IF(AND(AB83<=Z83,AB83>1.015*AA83),$I$9,IF(AND(AB83>=0.985*AA83,AB83<=1.015*AA83),$I$10,IF(AB83<0.985*AA83,$I$11,\"\")))))","v":0},{"$nulls":3},"Maximum Depth (mm)",{"v":0,"d":"0.0%"},{"$nulls":4},{"$f":"IF(AL83=\"\",$I$7,IF(AL83>AJ83,$I$8,IF(AND(AL83<=AJ83,AL83>1.015*AK83),$I$9,IF(AND(AL83>=0.985*AK83,AL83<=1.015*AK83),$I$10,IF(AL83<0.985*AK83,$I$11,\"\")))))","v":0},{"$nulls":4},{"$f":"IF(AQ83=\"\",$I$7,IF(AQ83>AO83,$I$8,IF(AND(AQ83<=AO83,AQ83>1.015*AP83),$I$9,IF(AND(AQ83>=0.985*AP83,AQ83<=1.015*AP83),$I$10,IF(AQ83<0.985*AP83,$I$11,\"\")))))","v":0},{"$nulls":4},{"$f":"IF(AV83=\"\",$I$7,IF(AV83>AT83,$I$8,IF(AND(AV83<=AT83,AV83>1.015*AU83),$I$9,IF(AND(AV83>=0.985*AU83,AV83<=1.015*AU83),$I$10,IF(AV83<0.985*AU83,$I$11,\"\")))))","v":0}]
[null,null,"Maximum Height (mm)",{"v":0.005,"d":"0.5%"},null,18,18,null,{"$f":"IF(H84=\"\",$I$7,IF(H84>F84,$I$8,IF(AND(H84<=F84,H84>1.015*G84),$I$9,IF(AND(H84>=0.985*G84,H84<=1.015*G84),$I$10,IF(H84<0.985*G84,$I$11,\"\")))))","v":0},null,25,20,null,{"$f":"IF(M84=\"\",$I$7,IF(M84>K84,$I$8,IF(AND(M84<=K84,M84>1.015*L84),$I$9,IF(AND(M84>=0.985*L84,M84<=1.015*L84),$I$10,IF(M84<0.985*L84,$I$11,\"\")))))","v":0},null,25,20,null,{"$f":"IF(R84=\"\",$I$7,IF(R84>P84,$I$8,IF(AND(R84<=P84,R84>1.015*Q84),$I$9,IF(AND(R84>=0.985*Q84,R84<=1.015*Q84),$I$10,IF(R84<0.985*Q84,$I$11,\"\")))))","v":0},null,30,25,null,{"$f":"IF(W84=\"\",$I$7,IF(W84>U84,$I$8,IF(AND(W84<=U84,W84>1.015*V84),$I$9,IF(AND(W84>=0.985*V84,W84<=1.015*V84),$I$10,IF(W84<0.985*V84,$I$11,\"\")))))","v":0},null,30,25,null,{"$f":"IF(AB84=\"\",$I$7,IF(AB84>Z84,$I$8,IF(AND(AB84<=Z84,AB84>1.015*AA84),$I$9,IF(AND(AB84>=0.985*AA84,AB84<=1.015*AA84),$I$10,IF(AB84<0.985*AA84,$I$11,\"\")))))","v":0},{"$nulls":3},"Maximum Height (mm)",{"v":0,"d":"0.0%"},{"$nulls":4},{"$f":"IF(AL84=\"\",$I$7,IF(AL84>AJ84,$I$8,IF(AND(AL84<=AJ84,AL84>1.015*AK84),$I$9,IF(AND(AL84>=0.985*AK84,AL84<=1.015*AK84),$I$10,IF(AL84<0.985*AK84,$I$11,\"\")))))","v":0},{"$nulls":4},{"$f":"IF(AQ84=\"\",$I$7,IF(AQ84>AO84,$I$8,IF(AND(AQ84<=AO84,AQ84>1.015*AP84),$I$9,IF(AND(AQ84>=0.985*AP84,AQ84<=1.015*AP84),$I$10,IF(AQ84<0.985*AP84,$I$11,\"\")))))","v":0},{"$nulls":4},{"$f":"IF(AV84=\"\",$I$7,IF(AV84>AT84,$I$8,IF(AND(AV84<=AT84,AV84>1.015*AU84),$I$9,IF(AND(AV84>=0.985*AU84,AV84<=1.015*AU84),$I$10,IF(AV84<0.985*AU84,$I$11,\"\")))))","v":0}]
[{"$f":"D85","v":{"v":0.005,"d":"1%"}},"Operating System","Windows 10/11 Professional (native or virtual)",{"v":0.005,"d":"0.5%"},null,"Yes","Yes",null,{"$f":"IF(H85=\"Yes\",$I$10,$I$7)","v":0},null,"Yes","Yes",null,{"$f":"IF(M85=\"Yes\",$I$10,$I$7)","v":0},null,"Yes","Yes",null,{"$f":"IF(R85=\"Yes\",$I$10,$I$7)","v":0},null,"Yes","Yes",null,{"$f":"IF(W85=\"Yes\",$I$10,$I$7)","v":0},null,"Yes","Yes",null,{"$f":"IF(AB85=\"Yes\",$I$10,$I$7)","v":0},null,{"$f":"AH85","v":{"v":0,"d":"0%"}},"Operating System","Windows 10/11 Professional",{"v":0,"d":"0.0%"},null,"Yes","Yes",null,{"$f":"IF(AL85=\"Yes\",$I$10,$I$7)","v":0},null,"Yes","Yes",null,{"$f":"IF(AQ85=\"Yes\",$I$10,$I$7)","v":0},null,"Yes","Yes",null,{"$f":"IF(AV85=\"Yes\",$I$10,$I$7)","v":0}]
[{"$f":"SUM(D86:D89)","v":{"v":0.13,"d":"13%"}},"Maximum Next Business Day (NBD) Warranty in Years Available at Point of Sale for the device",null,{"v":0.03,"d":"3.0%"},null,3,5,null,{"$f":"IF(OR(H86=\"\",H86=\"No NBD warranty available\"),$I$7,IF(VLOOKUP(H86,Lookups!$A$130:$B$135,2,FALSE)<VLOOKUP(F86,Lookups!$A$130:$B$135,2,FALSE),$I$8,IF(AND(VLOOKUP(H86,Lookups!$A$130:$B$135,2,FALSE)>=VLOOKUP(F86,Lookups!$A$130:$B$135,2,FALSE),VLOOKUP(H86,Lookups!$A$130:$B$135,2,FALSE)<0.8*VLOOKUP(G86,Lookups!$A$130:$B$135,2,FALSE)),$I$9,IF(AND(VLOOKUP(H86,Lookups!$A$130:$B$135,2,FALSE)<=VLOOKUP(G86,Lookups!$A$130:$B$135,2,FALSE),VLOOKUP(H86,Lookups!$A$130:$B$135,2,FALSE)>=0.8*VLOOKUP(G86,Lookups!$A$130:$B$135,2,FALSE)),$I$10,IF(VLOOKUP(H86,Lookups!$A$130:$B$135,2,FALSE)>VLOOKUP(G86,Lookups!$A$130:$B$135,2,FALSE),$I$11,\"\")))))","v":0},null,3,5,null,{"$f":"IF(OR(M86=\"\",M86=\"No NBD warranty available\"),$I$7,IF(VLOOKUP(M86,Lookups!$A$130:$B$135,2,FALSE)<VLOOKUP(K86,Lookups!$A$130:$B$135,2,FALSE),$I$8,IF(AND(VLOOKUP(M86,Lookups!$A$130:$B$135,2,FALSE)>=VLOOKUP(K86,Lookups!$A$130:$B$135,2,FALSE),VLOOKUP(M86,Lookups!$A$130:$B$135,2,FALSE)<0.8*VLOOKUP(L86,Lookups!$A$130:$B$135,2,FALSE)),$I$9,IF(AND(VLOOKUP(M86,Lookups!$A$130:$B$135,2,FALSE)<=VLOOKUP(L86,Lookups!$A$130:$B$135,2,FALSE),VLOOKUP(M86,Lookups!$A$130:$B$135,2,FALSE)>=0.8*VLOOKUP(L86,Lookups!$A$130:$B$135,2,FALSE)),$I$10,IF(VLOOKUP(M86,Lookups!$A$130:$B$135,2,FALSE)>VLOOKUP(L86,Lookups!$A$130:$B$135,2,FALSE),$I$11,\"\")))))","v":0},null,5,7,null,{"$f":"IF(OR(R86=\"\",R86=\"No NBD warranty available\"),$I$7,IF(VLOOKUP(R86,Lookups!$A$130:$B$135,2,FALSE)<VLOOKUP(P86,Lookups!$A$130:$B$135,2,FALSE),$I$8,IF(AND(VLOOKUP(R86,Lookups!$A$130:$B$135,2,FALSE)>=VLOOKUP(P86,Lookups!$A$130:$B$135,2,FALSE),VLOOKUP(R86,Lookups!$A$130:$B$135,2,FALSE)<0.8*VLOOKUP(Q86,Lookups!$A$130:$B$135,2,FALSE)),$I$9,IF(AND(VLOOKUP(R86,Lookups!$A$130:$B$135,2,FALSE)<=VLOOKUP(Q86,Lookups!$A$130:$B$135,2,FALSE),VLOOKUP(R86,Lookups!$A$130:$B$135,2,FALSE)>=0.8*VLOOKUP(Q86,Lookups!$A$130:$B$135,2,FALSE)),$I$10,IF(VLOOKUP(R86,Lookups!$A$130:$B$135,2,FALSE)>VLOOKUP(Q86,Lookups!$A$130:$B$135,2,FALSE),$I$11,\"\")))))","v":0},null,3,5,null,{"$f":"IF(OR(W86=\"\",W86=\"No NBD warranty available\"),$I$7,IF(VLOOKUP(W86,Lookups!$A$130:$B$135,2,FALSE)<VLOOKUP(U86,Lookups!$A$130:$B$135,2,FALSE),$I$8,IF(AND(VLOOKUP(W86,Lookups!$A$130:$B$135,2,FALSE)>=VLOOKUP(U86,Lookups!$A$130:$B$135,2,FALSE),VLOOKUP(W86,Lookups!$A$130:$B$135,2,FALSE)<0.8*VLOOKUP(V86,Lookups!$A$130:$B$135,2,FALSE)),$I$9,IF(AND(VLOOKUP(W86,Lookups!$A$130:$B$135,2,FALSE)<=VLOOKUP(V86,Lookups!$A$130:$B$135,2,FALSE),VLOOKUP(W86,Lookups!$A$130:$B$135,2,FALSE)>=0.8*VLOOKUP(V86,Lookups!$A$130:$B$135,2,FALSE)),$I$10,IF(VLOOKUP(W86,Lookups!$A$130:$B$135,2,FALSE)>VLOOKUP(V86,Lookups!$A$130:$B$135,2,FALSE),$I$11,\"\")))))","v":0},null,3,5,null,{"$f":"IF(OR(AB86=\"\",AB86=\"No NBD warranty available\"),$I$7,IF(VLOOKUP(AB86,Lookups!$A$130:$B$135,2,FALSE)<VLOOKUP(Z86,Lookups!$A$130:$B$135,2,FALSE),$I$8,IF(AND(VLOOKUP(AB86,Lookups!$A$130:$B$135,2,FALSE)>=VLOOKUP(Z86,Lookups!$A$130:$B$135,2,FALSE),VLOOKUP(AB86,Lookups!$A$130:$B$135,2,FALSE)<0.8*VLOOKUP(AA86,Lookups!$A$130:$B$135,2,FALSE)),$I$9,IF(AND(VLOOKUP(AB86,Lookups!$A$130:$B$135,2,FALSE)<=VLOOKUP(AA86,Lookups!$A$130:$B$135,2,FALSE),VLOOKUP(AB86,Lookups!$A$130:$B$135,2,FALSE)>=0.8*VLOOKUP(AA86,Lookups!$A$130:$B$135,2,FALSE)),$I$10,IF(VLOOKUP(AB86,Lookups!$A$130:$B$135,2,FALSE)>VLOOKUP(AA86,Lookups!$A$130:$B$135,2,FALSE),$I$11,\"\")))))","v":0},null,{"$f":"SUM(AH86:AH89)","v":{"v":0.13,"d":"13%"}},"Maximum Next Business Day (NBD) Warranty in Years Available at Point of Sale for the device",null,{"v":0.06,"d":"6.0%"},null,3,5,null,{"$f":"IF(OR(AL86=\"\",AL86=\"No NBD warranty available\"),$I$7,IF(VLOOKUP(AL86,Lookups!$A$130:$B$135,2,FALSE)<VLOOKUP(AJ86,Lookups!$A$130:$B$135,2,FALSE),$I$8,IF(AND(VLOOKUP(AL86,Lookups!$A$130:$B$135,2,FALSE)>=VLOOKUP(AJ86,Lookups!$A$130:$B$135,2,FALSE),VLOOKUP(AL86,Lookups!$A$130:$B$135,2,FALSE)<0.8*VLOOKUP(AK86,Lookups!$A$130:$B$135,2,FALSE)),$I$9,IF(AND(VLOOKUP(AL86,Lookups!$A$130:$B$135,2,FALSE)<=VLOOKUP(AK86,Lookups!$A$130:$B$135,2,FALSE),VLOOKUP(AL86,Lookups!$A$130:$B$135,2,FALSE)>=0.8*VLOOKUP(AK86,Lookups!$A$130:$B$135,2,FALSE)),$I$10,IF(VLOOKUP(AL86,Lookups!$A$130:$B$135,2,FALSE)>VLOOKUP(AK86,Lookups!$A$130:$B$135,2,FALSE),$I$11,\"\")))))","v":0},null,5,7,null,{"$f":"IF(OR(AQ86=\"\",AQ86=\"No NBD warranty available\"),$I$7,IF(VLOOKUP(AQ86,Lookups!$A$130:$B$135,2,FALSE)<VLOOKUP(AO86,Lookups!$A$130:$B$135,2,FALSE),$I$8,IF(AND(VLOOKUP(AQ86,Lookups!$A$130:$B$135,2,FALSE)>=VLOOKUP(AO86,Lookups!$A$130:$B$135,2,FALSE),VLOOKUP(AQ86,Lookups!$A$130:$B$135,2,FALSE)<0.8*VLOOKUP(AP86,Lookups!$A$130:$B$135,2,FALSE)),$I$9,IF(AND(VLOOKUP(AQ86,Lookups!$A$130:$B$135,2,FALSE)<=VLOOKUP(AP86,Lookups!$A$130:$B$135,2,FALSE),VLOOKUP(AQ86,Lookups!$A$130:$B$135,2,FALSE)>=0.8*VLOOKUP(AP86,Lookups!$A$130:$B$135,2,FALSE)),$I$10,IF(VLOOKUP(AQ86,Lookups!$A$130:$B$135,2,FALSE)>VLOOKUP(AP86,Lookups!$A$130:$B$135,2,FALSE),$I$11,\"\")))))","v":0},null,7,7,null,{"$f":"IF(OR(AV86=\"\",AV86=\"No NBD warranty available\"),$I$7,IF(VLOOKUP(AV86,Lookups!$A$130:$B$135,2,FALSE)<VLOOKUP(AT86,Lookups!$A$130:$B$135,2,FALSE),$I$8,IF(AND(VLOOKUP(AV86,Lookups!$A$130:$B$135,2,FALSE)>=VLOOKUP(AT86,Lookups!$A$130:$B$135,2,FALSE),VLOOKUP(AV86,Lookups!$A$130:$B$135,2,FALSE)<0.8*VLOOKUP(AU86,Lookups!$A$130:$B$135,2,FALSE)),$I$9,IF(AND(VLOOKUP(AV86,Lookups!$A$130:$B$135,2,FALSE)<=VLOOKUP(AU86,Lookups!$A$130:$B$135,2,FALSE),VLOOKUP(AV86,Lookups!$A$130:$B$135,2,FALSE)>=0.8*VLOOKUP(AU86,Lookups!$A$130:$B$135,2,FALSE)),$I$10,IF(VLOOKUP(AV86,Lookups!$A$130:$B$135,2,FALSE)>VLOOKUP(AU86,Lookups!$A$130:$B$135,2,FALSE),$I$11,\"\")))))","v":0}]
[null,"Maximum Next Business Day (NBD) Warranty in Years Available at Point of Sale for the BATTERY",null,{"v":0.03,"d":"3.0%"},null,3,5,null,{"$f":"IF(OR(H87=\"\",H87=\"No NBD warranty available\"),$I$7,IF(VLOOKUP(H87,Lookups!$A$130:$B$135,2,FALSE)<VLOOKUP(F87,Lookups!$A$130:$B$135,2,FALSE),$I$8,IF(AND(VLOOKUP(H87,Lookups!$A$130:$B$135,2,FALSE)>=VLOOKUP(F87,Lookups!$A$130:$B$135,2,FALSE),VLOOKUP(H87,Lookups!$A$130:$B$135,2,FALSE)<0.8*VLOOKUP(G87,Lookups!$A$130:$B$135,2,FALSE)),$I$9,IF(AND(VLOOKUP(H87,Lookups!$A$130:$B$135,2,FALSE)<=VLOOKUP(G87,Lookups!$A$130:$B$135,2,FALSE),VLOOKUP(H87,Lookups!$A$130:$B$135,2,FALSE)>=0.8*VLOOKUP(G87,Lookups!$A$130:$B$135,2,FALSE)),$I$10,IF(VLOOKUP(H87,Lookups!$A$130:$B$135,2,FALSE)>VLOOKUP(G87,Lookups!$A$130:$B$135,2,FALSE),$I$11,\"\")))))","v":0},null,3,5,null,{"$f":"IF(OR(M87=\"\",M87=\"No NBD warranty available\"),$I$7,IF(VLOOKUP(M87,Lookups!$A$130:$B$135,2,FALSE)<VLOOKUP(K87,Lookups!$A$130:$B$135,2,FALSE),$I$8,IF(AND(VLOOKUP(M87,Lookups!$A$130:$B$135,2,FALSE)>=VLOOKUP(K87,Lookups!$A$130:$B$135,2,FALSE),VLOOKUP(M87,Lookups!$A$130:$B$135,2,FALSE)<0.8*VLOOKUP(L87,Lookups!$A$130:$B$135,2,FALSE)),$I$9,IF(AND(VLOOKUP(M87,Lookups!$A$130:$B$135,2,FALSE)<=VLOOKUP(L87,Lookups!$A$130:$B$135,2,FALSE),VLOOKUP(M87,Lookups!$A$130:$B$135,2,FALSE)>=0.8*VLOOKUP(L87,Lookups!$A$130:$B$135,2,FALSE)),$I$10,IF(VLOOKUP(M87,Lookups!$A$130:$B$135,2,FALSE)>VLOOKUP(L87,Lookups!$A$130:$B$135,2,FALSE),$I$11,\"\")))))","v":0},null,5,7,null,{"$f":"IF(OR(R87=\"\",R87=\"No NBD warranty available\"),$I$7,IF(VLOOKUP(R87,Lookups!$A$130:$B$135,2,FALSE)<VLOOKUP(P87,Lookups!$A$130:$B$135,2,FALSE),$I$8,IF(AND(VLOOKUP(R87,Lookups!$A$130:$B$135,2,FALSE)>=VLOOKUP(P87,Lookups!$A$130:$B$135,2,FALSE),VLOOKUP(R87,Lookups!$A$130:$B$135,2,FALSE)<0.8*VLOOKUP(Q87,Lookups!$A$130:$B$135,2,FALSE)),$I$9,IF(AND(VLOOKUP(R87,Lookups!$A$130:$B$135,2,FALSE)<=VLOOKUP(Q87,Lookups!$A$130:$B$135,2,FALSE),VLOOKUP(R87,Lookups!$A$130:$B$135,2,FALSE)>=0.8*VLOOKUP(Q87,Lookups!$A$130:$B$135,2,FALSE)),$I$10,IF(VLOOKUP(R87,Lookups!$A$130:$B$135,2,FALSE)>VLOOKUP(Q87,Lookups!$A$130:$B$135,2,FALSE),$I$11,\"\")))))","v":0},null,3,5,null,{"$f":"IF(OR(W87=\"\",W87=\"No NBD warranty available\"),$I$7,IF(VLOOKUP(W87,Lookups!$A$130:$B$135,2,FALSE)<VLOOKUP(U87,Lookups!$A$130:$B$135,2,FALSE),$I$8,IF(AND(VLOOKUP(W87,Lookups!$A$130:$B$135,2,FALSE)>=VLOOKUP(U87,Lookups!$A$130:$B$135,2,FALSE),VLOOKUP(W87,Lookups!$A$130:$B$135,2,FALSE)<0.8*VLOOKUP(V87,Lookups!$A$130:$B$135,2,FALSE)),$I$9,IF(AND(VLOOKUP(W87,Lookups!$A$130:$B$135,2,FALSE)<=VLOOKUP(V87,Lookups!$A$130:$B$135,2,FALSE),VLOOKUP(W87,Lookups!$A$130:$B$135,2,FALSE)>=0.8*VLOOKUP(V87,Lookups!$A$130:$B$135,2,FALSE)),$I$10,IF(VLOOKUP(W87,Lookups!$A$130:$B$135,2,FALSE)>VLOOKUP(V87,Lookups!$A$130:$B$135,2,FALSE),$I$11,\"\")))))","v":0},null,3,5,null,{"$f":"IF(OR(AB87=\"\",AB87=\"No NBD warranty available\"),$I$7,IF(VLOOKUP(AB87,Lookups!$A$130:$B$135,2,FALSE)<VLOOKUP(Z87,Lookups!$A$130:$B$135,2,FALSE),$I$8,IF(AND(VLOOKUP(AB87,Lookups!$A$130:$B$135,2,FALSE)>=VLOOKUP(Z87,Lookups!$A$130:$B$135,2,FALSE),VLOOKUP(AB87,Lookups!$A$130:$B$135,2,FALSE)<0.8*VLOOKUP(AA87,Lookups!$A$130:$B$135,2,FALSE)),$I$9,IF(AND(VLOOKUP(AB87,Lookups!$A$130:$B$135,2,FALSE)<=VLOOKUP(AA87,Lookups!$A$130:$B$135,2,FALSE),VLOOKUP(AB87,Lookups!$A$130:$B$135,2,FALSE)>=0.8*VLOOKUP(AA87,Lookups!$A$130:$B$135,2,FALSE)),$I$10,IF(VLOOKUP(AB87,Lookups!$A$130:$B$135,2,FALSE)>VLOOKUP(AA87,Lookups!$A$130:$B$135,2,FALSE),$I$11,\"\")))))","v":0},null,null,"Maximum Next Business Day (NBD) Warranty in Years Available at Point of Sale for the BATTERY",null,{"v":0,"d":"0.0%"}]
[null,"Next Business Day (NBD) Warranty Included in the Proposed Device for the device",null,{"v":0.035,"d":"3.5%"},null,3,5,null,{"$f":"IF(OR(H88=\"\",H88=\"No NBD warranty available\"),$I$7,IF(VLOOKUP(H88,Lookups!$A$130:$B$135,2,FALSE)<VLOOKUP(F88,Lookups!$A$130:$B$135,2,FALSE),$I$8,IF(AND(VLOOKUP(H88,Lookups!$A$130:$B$135,2,FALSE)>=VLOOKUP(F88,Lookups!$A$130:$B$135,2,FALSE),VLOOKUP(H88,Lookups!$A$130:$B$135,2,FALSE)<0.8*VLOOKUP(G88,Lookups!$A$130:$B$135,2,FALSE)),$I$9,IF(AND(VLOOKUP(H88,Lookups!$A$130:$B$135,2,FALSE)<=VLOOKUP(G88,Lookups!$A$130:$B$135,2,FALSE),VLOOKUP(H88,Lookups!$A$130:$B$135,2,FALSE)>=0.8*VLOOKUP(G88,Lookups!$A$130:$B$135,2,FALSE)),$I$10,IF(VLOOKUP(H88,Lookups!$A$130:$B$135,2,FALSE)>VLOOKUP(G88,Lookups!$A$130:$B$135,2,FALSE),$I$11,\"\")))))","v":0},null,3,5,null,{"$f":"IF(OR(M88=\"\",M88=\"No NBD warranty available\"),$I$7,IF(VLOOKUP(M88,Lookups!$A$130:$B$135,2,FALSE)<VLOOKUP(K88,Lookups!$A$130:$B$135,2,FALSE),$I$8,IF(AND(VLOOKUP(M88,Lookups!$A$130:$B$135,2,FALSE)>=VLOOKUP(K88,Lookups!$A$130:$B$135,2,FALSE),VLOOKUP(M88,Lookups!$A$130:$B$135,2,FALSE)<0.8*VLOOKUP(L88,Lookups!$A$130:$B$135,2,FALSE)),$I$9,IF(AND(VLOOKUP(M88,Lookups!$A$130:$B$135,2,FALSE)<=VLOOKUP(L88,Lookups!$A$130:$B$135,2,FALSE),VLOOKUP(M88,Lookups!$A$130:$B$135,2,FALSE)>=0.8*VLOOKUP(L88,Lookups!$A$130:$B$135,2,FALSE)),$I$10,IF(VLOOKUP(M88,Lookups!$A$130:$B$135,2,FALSE)>VLOOKUP(L88,Lookups!$A$130:$B$135,2,FALSE),$I$11,\"\")))))","v":0},null,3,5,null,{"$f":"IF(OR(R88=\"\",R88=\"No NBD warranty available\"),$I$7,IF(VLOOKUP(R88,Lookups!$A$130:$B$135,2,FALSE)<VLOOKUP(P88,Lookups!$A$130:$B$135,2,FALSE),$I$8,IF(AND(VLOOKUP(R88,Lookups!$A$130:$B$135,2,FALSE)>=VLOOKUP(P88,Lookups!$A$130:$B$135,2,FALSE),VLOOKUP(R88,Lookups!$A$130:$B$135,2,FALSE)<0.8*VLOOKUP(Q88,Lookups!$A$130:$B$135,2,FALSE)),$I$9,IF(AND(VLOOKUP(R88,Lookups!$A$130:$B$135,2,FALSE)<=VLOOKUP(Q88,Lookups!$A$130:$B$135,2,FALSE),VLOOKUP(R88,Lookups!$A$130:$B$135,2,FALSE)>=0.8*VLOOKUP(Q88,Lookups!$A$130:$B$135,2,FALSE)),$I$10,IF(VLOOKUP(R88,Lookups!$A$130:$B$135,2,FALSE)>VLOOKUP(Q88,Lookups!$A$130:$B$135,2,FALSE),$I$11,\"\")))))","v":0},null,3,5,null,{"$f":"IF(OR(W88=\"\",W88=\"No NBD warranty available\"),$I$7,IF(VLOOKUP(W88,Lookups!$A$130:$B$135,2,FALSE)<VLOOKUP(U88,Lookups!$A$130:$B$135,2,FALSE),$I$8,IF(AND(VLOOKUP(W88,Lookups!$A$130:$B$135,2,FALSE)>=VLOOKUP(U88,Lookups!$A$130:$B$135,2,FALSE),VLOOKUP(W88,Lookups!$A$130:$B$135,2,FALSE)<0.8*VLOOKUP(V88,Lookups!$A$130:$B$135,2,FALSE)),$I$9,IF(AND(VLOOKUP(W88,Lookups!$A$130:$B$135,2,FALSE)<=VLOOKUP(V88,Lookups!$A$130:$B$135,2,FALSE),VLOOKUP(W88,Lookups!$A$130:$B$135,2,FALSE)>=0.8*VLOOKUP(V88,Lookups!$A$130:$B$135,2,FALSE)),$I$10,IF(VLOOKUP(W88,Lookups!$A$130:$B$135,2,FALSE)>VLOOKUP(V88,Lookups!$A$130:$B$135,2,FALSE),$I$11,\"\")))))","v":0},null,3,5,null,{"$f":"IF(OR(AB88=\"\",AB88=\"No NBD warranty available\"),$I$7,IF(VLOOKUP(AB88,Lookups!$A$130:$B$135,2,FALSE)<VLOOKUP(Z88,Lookups!$A$130:$B$135,2,FALSE),$I$8,IF(AND(VLOOKUP(AB88,Lookups!$A$130:$B$135,2,FALSE)>=VLOOKUP(Z88,Lookups!$A$130:$B$135,2,FALSE),VLOOKUP(AB88,Lookups!$A$130:$B$135,2,FALSE)<0.8*VLOOKUP(AA88,Lookups!$A$130:$B$135,2,FALSE)),$I$9,IF(AND(VLOOKUP(AB88,Lookups!$A$130:$B$135,2,FALSE)<=VLOOKUP(AA88,Lookups!$A$130:$B$135,2,FALSE),VLOOKUP(AB88,Lookups!$A$130:$B$135,2,FALSE)>=0.8*VLOOKUP(AA88,Lookups!$A$130:$B$135,2,FALSE)),$I$10,IF(VLOOKUP(AB88,Lookups!$A$130:$B$135,2,FALSE)>VLOOKUP(AA88,Lookups!$A$130:$B$135,2,FALSE),$I$11,\"\")))))","v":0},null,null,"Next Business Day (NBD) Warranty Included in the Proposed Device for the device",null,{"v":0.07,"d":"7.0%"},null,3,5,null,{"$f":"IF(OR(AL88=\"\",AL88=\"No NBD warranty available\"),$I$7,IF(VLOOKUP(AL88,Lookups!$A$130:$B$135,2,FALSE)<VLOOKUP(AJ88,Lookups!$A$130:$B$135,2,FALSE),$I$8,IF(AND(VLOOKUP(AL88,Lookups!$A$130:$B$135,2,FALSE)>=VLOOKUP(AJ88,Lookups!$A$130:$B$135,2,FALSE),VLOOKUP(AL88,Lookups!$A$130:$B$135,2,FALSE)<0.8*VLOOKUP(AK88,Lookups!$A$130:$B$135,2,FALSE)),$I$9,IF(AND(VLOOKUP(AL88,Lookups!$A$130:$B$135,2,FALSE)<=VLOOKUP(AK88,Lookups!$A$130:$B$135,2,FALSE),VLOOKUP(AL88,Lookups!$A$130:$B$135,2,FALSE)>=0.8*VLOOKUP(AK88,Lookups!$A$130:$B$135,2,FALSE)),$I$10,IF(VLOOKUP(AL88,Lookups!$A$130:$B$135,2,FALSE)>VLOOKUP(AK88,Lookups!$A$130:$B$135,2,FALSE),$I$11,\"\")))))","v":0},null,3,5,null,{"$f":"IF(OR(AQ88=\"\",AQ88=\"No NBD warranty available\"),$I$7,IF(VLOOKUP(AQ88,Lookups!$A$130:$B$135,2,FALSE)<VLOOKUP(AO88,Lookups!$A$130:$B$135,2,FALSE),$I$8,IF(AND(VLOOKUP(AQ88,Lookups!$A$130:$B$135,2,FALSE)>=VLOOKUP(AO88,Lookups!$A$130:$B$135,2,FALSE),VLOOKUP(AQ88,Lookups!$A$130:$B$135,2,FALSE)<0.8*VLOOKUP(AP88,Lookups!$A$130:$B$135,2,FALSE)),$I$9,IF(AND(VLOOKUP(AQ88,Lookups!$A$130:$B$135,2,FALSE)<=VLOOKUP(AP88,Lookups!$A$130:$B$135,2,FALSE),VLOOKUP(AQ88,Lookups!$A$130:$B$135,2,FALSE)>=0.8*VLOOKUP(AP88,Lookups!$A$130:$B$135,2,FALSE)),$I$10,IF(VLOOKUP(AQ88,Lookups!$A$130:$B$135,2,FALSE)>VLOOKUP(AP88,Lookups!$A$130:$B$135,2,FALSE),$I$11,\"\")))))","v":0},null,5,7,null,{"$f":"IF(OR(AV88=\"\",AV88=\"No NBD warranty available\"),$I$7,IF(VLOOKUP(AV88,Lookups!$A$130:$B$135,2,FALSE)<VLOOKUP(AT88,Lookups!$A$130:$B$135,2,FALSE),$I$8,IF(AND(VLOOKUP(AV88,Lookups!$A$130:$B$135,2,FALSE)>=VLOOKUP(AT88,Lookups!$A$130:$B$135,2,FALSE),VLOOKUP(AV88,Lookups!$A$130:$B$135,2,FALSE)<0.8*VLOOKUP(AU88,Lookups!$A$130:$B$135,2,FALSE)),$I$9,IF(AND(VLOOKUP(AV88,Lookups!$A$130:$B$135,2,FALSE)<=VLOOKUP(AU88,Lookups!$A$130:$B$135,2,FALSE),VLOOKUP(AV88,Lookups!$A$130:$B$135,2,FALSE)>=0.8*VLOOKUP(AU88,Lookups!$A$130:$B$135,2,FALSE)),$I$10,IF(VLOOKUP(AV88,Lookups!$A$130:$B$135,2,FALSE)>VLOOKUP(AU88,Lookups!$A$130:$B$135,2,FALSE),$I$11,\"\")))))","v":0}]
[null,"Next Business Day (NBD) Warranty Included in the Proposed Device for the BATTERY",null,{"v":0.035,"d":"3.5%"},null,3,5,null,{"$f":"IF(OR(H89=\"\",H89=\"No NBD warranty available\"),$I$7,IF(VLOOKUP(H89,Lookups!$A$130:$B$135,2,FALSE)<VLOOKUP(F89,Lookups!$A$130:$B$135,2,FALSE),$I$8,IF(AND(VLOOKUP(H89,Lookups!$A$130:$B$135,2,FALSE)>=VLOOKUP(F89,Lookups!$A$130:$B$135,2,FALSE),VLOOKUP(H89,Lookups!$A$130:$B$135,2,FALSE)<0.8*VLOOKUP(G89,Lookups!$A$130:$B$135,2,FALSE)),$I$9,IF(AND(VLOOKUP(H89,Lookups!$A$130:$B$135,2,FALSE)<=VLOOKUP(G89,Lookups!$A$130:$B$135,2,FALSE),VLOOKUP(H89,Lookups!$A$130:$B$135,2,FALSE)>=0.8*VLOOKUP(G89,Lookups!$A$130:$B$135,2,FALSE)),$I$10,IF(VLOOKUP(H89,Lookups!$A$130:$B$135,2,FALSE)>VLOOKUP(G89,Lookups!$A$130:$B$135,2,FALSE),$I$11,\"\")))))","v":0},null,3,5,null,{"$f":"IF(OR(M89=\"\",M89=\"No NBD warranty available\"),$I$7,IF(VLOOKUP(M89,Lookups!$A$130:$B$135,2,FALSE)<VLOOKUP(K89,Lookups!$A$130:$B$135,2,FALSE),$I$8,IF(AND(VLOOKUP(M89,Lookups!$A$130:$B$135,2,FALSE)>=VLOOKUP(K89,Lookups!$A$130:$B$135,2,FALSE),VLOOKUP(M89,Lookups!$A$130:$B$135,2,FALSE)<0.8*VLOOKUP(L89,Lookups!$A$130:$B$135,2,FALSE)),$I$9,IF(AND(VLOOKUP(M89,Lookups!$A$130:$B$135,2,FALSE)<=VLOOKUP(L89,Lookups!$A$130:$B$135,2,FALSE),VLOOKUP(M89,Lookups!$A$130:$B$135,2,FALSE)>=0.8*VLOOKUP(L89,Lookups!$A$130:$B$135,2,FALSE)),$I$10,IF(VLOOKUP(M89,Lookups!$A$130:$B$135,2,FALSE)>VLOOKUP(L89,Lookups!$A$130:$B$135,2,FALSE),$I$11,\"\")))))","v":0},null,3,5,null,{"$f":"IF(OR(R89=\"\",R89=\"No NBD warranty available\"),$I$7,IF(VLOOKUP(R89,Lookups!$A$130:$B$135,2,FALSE)<VLOOKUP(P89,Lookups!$A$130:$B$135,2,FALSE),$I$8,IF(AND(VLOOKUP(R89,Lookups!$A$130:$B$135,2,FALSE)>=VLOOKUP(P89,Lookups!$A$130:$B$135,2,FALSE),VLOOKUP(R89,Lookups!$A$130:$B$135,2,FALSE)<0.8*VLOOKUP(Q89,Lookups!$A$130:$B$135,2,FALSE)),$I$9,IF(AND(VLOOKUP(R89,Lookups!$A$130:$B$135,2,FALSE)<=VLOOKUP(Q89,Lookups!$A$130:$B$135,2,FALSE),VLOOKUP(R89,Lookups!$A$130:$B$135,2,FALSE)>=0.8*VLOOKUP(Q89,Lookups!$A$130:$B$135,2,FALSE)),$I$10,IF(VLOOKUP(R89,Lookups!$A$130:$B$135,2,FALSE)>VLOOKUP(Q89,Lookups!$A$130:$B$135,2,FALSE),$I$11,\"\")))))","v":0},null,3,5,null,{"$f":"IF(OR(W89=\"\",W89=\"No NBD warranty available\"),$I$7,IF(VLOOKUP(W89,Lookups!$A$130:$B$135,2,FALSE)<VLOOKUP(U89,Lookups!$A$130:$B$135,2,FALSE),$I$8,IF(AND(VLOOKUP(W89,Lookups!$A$130:$B$135,2,FALSE)>=VLOOKUP(U89,Lookups!$A$130:$B$135,2,FALSE),VLOOKUP(W89,Lookups!$A$130:$B$135,2,FALSE)<0.8*VLOOKUP(V89,Lookups!$A$130:$B$135,2,FALSE)),$I$9,IF(AND(VLOOKUP(W89,Lookups!$A$130:$B$135,2,FALSE)<=VLOOKUP(V89,Lookups!$A$130:$B$135,2,FALSE),VLOOKUP(W89,Lookups!$A$130:$B$135,2,FALSE)>=0.8*VLOOKUP(V89,Lookups!$A$130:$B$135,2,FALSE)),$I$10,IF(VLOOKUP(W89,Lookups!$A$130:$B$135,2,FALSE)>VLOOKUP(V89,Lookups!$A$130:$B$135,2,FALSE),$I$11,\"\")))))","v":0},null,3,5,null,{"$f":"IF(OR(AB89=\"\",AB89=\"No NBD warranty available\"),$I$7,IF(VLOOKUP(AB89,Lookups!$A$130:$B$135,2,FALSE)<VLOOKUP(Z89,Lookups!$A$130:$B$135,2,FALSE),$I$8,IF(AND(VLOOKUP(AB89,Lookups!$A$130:$B$135,2,FALSE)>=VLOOKUP(Z89,Lookups!$A$130:$B$135,2,FALSE),VLOOKUP(AB89,Lookups!$A$130:$B$135,2,FALSE)<0.8*VLOOKUP(AA89,Lookups!$A$130:$B$135,2,FALSE)),$I$9,IF(AND(VLOOKUP(AB89,Lookups!$A$130:$B$135,2,FALSE)<=VLOOKUP(AA89,Lookups!$A$130:$B$135,2,FALSE),VLOOKUP(AB89,Lookups!$A$130:$B$135,2,FALSE)>=0.8*VLOOKUP(AA89,Lookups!$A$130:$B$135,2,FALSE)),$I$10,IF(VLOOKUP(AB89,Lookups!$A$130:$B$135,2,FALSE)>VLOOKUP(AA89,Lookups!$A$130:$B$135,2,FALSE),$I$11,\"\")))))","v":0},null,null,"Next Business Day (NBD) Warranty Included in the Proposed Device for the BATTERY",null,{"v":0,"d":"0.0%"},{"$nulls":9},{"$f":"IF(OR(AQ89=\"\",AQ89=\"No NBD warranty available\"),$I$7,IF(VLOOKUP(AQ89,Lookups!$A$130:$B$135,2,FALSE)<VLOOKUP(AO89,Lookups!$A$130:$B$135,2,FALSE),$I$8,IF(AND(VLOOKUP(AQ89,Lookups!$A$130:$B$135,2,FALSE)>=VLOOKUP(AO89,Lookups!$A$130:$B$135,2,FALSE),VLOOKUP(AQ89,Lookups!$A$130:$B$135,2,FALSE)<0.8*VLOOKUP(AP89,Lookups!$A$130:$B$135,2,FALSE)),$I$9,IF(AND(VLOOKUP(AQ89,Lookups!$A$130:$B$135,2,FALSE)<=VLOOKUP(AP89,Lookups!$A$130:$B$135,2,FALSE),VLOOKUP(AQ89,Lookups!$A$130:$B$135,2,FALSE)>=0.8*VLOOKUP(AP89,Lookups!$A$130:$B$135,2,FALSE)),$I$10,IF(VLOOKUP(AQ89,Lookups!$A$130:$B$135,2,FALSE)>VLOOKUP(AP89,Lookups!$A$130:$B$135,2,FALSE),$I$11,\"\")))))","v":0}]
[{"$f":"SUM(D90:D90)","v":{"v":0.07,"d":"7%"}},"Minimum months from model introduction to model end-of-sale",null,{"v":0.07,"d":"7.0%"},null,15,18,null,{"$f":"IF(OR(H90=\"\",H90=\"No NBD warranty available\"),$I$7,IF(VLOOKUP(H90,Lookups!$A$138:$B$144,2,FALSE)<VLOOKUP(F90,Lookups!$A$138:$B$144,2,FALSE),$I$8,IF(AND(VLOOKUP(H90,Lookups!$A$138:$B$144,2,FALSE)>=VLOOKUP(F90,Lookups!$A$138:$B$144,2,FALSE),VLOOKUP(H90,Lookups!$A$138:$B$144,2,FALSE)<0.8*VLOOKUP(G90,Lookups!$A$138:$B$144,2,FALSE)),$I$9,IF(AND(VLOOKUP(H90,Lookups!$A$138:$B$144,2,FALSE)<=VLOOKUP(G90,Lookups!$A$138:$B$144,2,FALSE),VLOOKUP(H90,Lookups!$A$138:$B$144,2,FALSE)>=0.8*VLOOKUP(G90,Lookups!$A$138:$B$144,2,FALSE)),$I$10,IF(VLOOKUP(H90,Lookups!$A$138:$B$144,2,FALSE)>VLOOKUP(G90,Lookups!$A$138:$B$144,2,FALSE),$I$11,\"\")))))","v":0},null,15,18,null,{"$f":"IF(OR(M90=\"\",M90=\"No NBD warranty available\"),$I$7,IF(VLOOKUP(M90,Lookups!$A$138:$B$144,2,FALSE)<VLOOKUP(K90,Lookups!$A$138:$B$144,2,FALSE),$I$8,IF(AND(VLOOKUP(M90,Lookups!$A$138:$B$144,2,FALSE)>=VLOOKUP(K90,Lookups!$A$138:$B$144,2,FALSE),VLOOKUP(M90,Lookups!$A$138:$B$144,2,FALSE)<0.8*VLOOKUP(L90,Lookups!$A$138:$B$144,2,FALSE)),$I$9,IF(AND(VLOOKUP(M90,Lookups!$A$138:$B$144,2,FALSE)<=VLOOKUP(L90,Lookups!$A$138:$B$144,2,FALSE),VLOOKUP(M90,Lookups!$A$138:$B$144,2,FALSE)>=0.8*VLOOKUP(L90,Lookups!$A$138:$B$144,2,FALSE)),$I$10,IF(VLOOKUP(M90,Lookups!$A$138:$B$144,2,FALSE)>VLOOKUP(L90,Lookups!$A$138:$B$144,2,FALSE),$I$11,\"\")))))","v":0},null,15,18,null,{"$f":"IF(OR(R90=\"\",R90=\"No NBD warranty available\"),$I$7,IF(VLOOKUP(R90,Lookups!$A$138:$B$144,2,FALSE)<VLOOKUP(P90,Lookups!$A$138:$B$144,2,FALSE),$I$8,IF(AND(VLOOKUP(R90,Lookups!$A$138:$B$144,2,FALSE)>=VLOOKUP(P90,Lookups!$A$138:$B$144,2,FALSE),VLOOKUP(R90,Lookups!$A$138:$B$144,2,FALSE)<0.8*VLOOKUP(Q90,Lookups!$A$138:$B$144,2,FALSE)),$I$9,IF(AND(VLOOKUP(R90,Lookups!$A$138:$B$144,2,FALSE)<=VLOOKUP(Q90,Lookups!$A$138:$B$144,2,FALSE),VLOOKUP(R90,Lookups!$A$138:$B$144,2,FALSE)>=0.8*VLOOKUP(Q90,Lookups!$A$138:$B$144,2,FALSE)),$I$10,IF(VLOOKUP(R90,Lookups!$A$138:$B$144,2,FALSE)>VLOOKUP(Q90,Lookups!$A$138:$B$144,2,FALSE),$I$11,\"\")))))","v":0},null,15,18,null,{"$f":"IF(OR(W90=\"\",W90=\"No NBD warranty available\"),$I$7,IF(VLOOKUP(W90,Lookups!$A$138:$B$144,2,FALSE)<VLOOKUP(U90,Lookups!$A$138:$B$144,2,FALSE),$I$8,IF(AND(VLOOKUP(W90,Lookups!$A$138:$B$144,2,FALSE)>=VLOOKUP(U90,Lookups!$A$138:$B$144,2,FALSE),VLOOKUP(W90,Lookups!$A$138:$B$144,2,FALSE)<0.8*VLOOKUP(V90,Lookups!$A$138:$B$144,2,FALSE)),$I$9,IF(AND(VLOOKUP(W90,Lookups!$A$138:$B$144,2,FALSE)<=VLOOKUP(V90,Lookups!$A$138:$B$144,2,FALSE),VLOOKUP(W90,Lookups!$A$138:$B$144,2,FALSE)>=0.8*VLOOKUP(V90,Lookups!$A$138:$B$144,2,FALSE)),$I$10,IF(VLOOKUP(W90,Lookups!$A$138:$B$144,2,FALSE)>VLOOKUP(V90,Lookups!$A$138:$B$144,2,FALSE),$I$11,\"\")))))","v":0},null,15,18,null,{"$f":"IF(OR(AB90=\"\",AB90=\"No NBD warranty available\"),$I$7,IF(VLOOKUP(AB90,Lookups!$A$138:$B$144,2,FALSE)<VLOOKUP(Z90,Lookups!$A$138:$B$144,2,FALSE),$I$8,IF(AND(VLOOKUP(AB90,Lookups!$A$138:$B$144,2,FALSE)>=VLOOKUP(Z90,Lookups!$A$138:$B$144,2,FALSE),VLOOKUP(AB90,Lookups!$A$138:$B$144,2,FALSE)<0.8*VLOOKUP(AA90,Lookups!$A$138:$B$144,2,FALSE)),$I$9,IF(AND(VLOOKUP(AB90,Lookups!$A$138:$B$144,2,FALSE)<=VLOOKUP(AA90,Lookups!$A$138:$B$144,2,FALSE),VLOOKUP(AB90,Lookups!$A$138:$B$144,2,FALSE)>=0.8*VLOOKUP(AA90,Lookups!$A$138:$B$144,2,FALSE)),$I$10,IF(VLOOKUP(AB90,Lookups!$A$138:$B$144,2,FALSE)>VLOOKUP(AA90,Lookups!$A$138:$B$144,2,FALSE),$I$11,\"\")))))","v":0},null,{"$f":"SUM(AH90:AH90)","v":{"v":0.07,"d":"7%"}},"Minimum months from model introduction to model end-of-sale",null,{"v":0.07,"d":"7.0%"},null,15,18,null,{"$f":"IF(OR(AL90=\"\",AL90=\"No NBD warranty available\"),$I$7,IF(VLOOKUP(AL90,Lookups!$A$138:$B$144,2,FALSE)<VLOOKUP(AJ90,Lookups!$A$138:$B$144,2,FALSE),$I$8,IF(AND(VLOOKUP(AL90,Lookups!$A$138:$B$144,2,FALSE)>=VLOOKUP(AJ90,Lookups!$A$138:$B$144,2,FALSE),VLOOKUP(AL90,Lookups!$A$138:$B$144,2,FALSE)<0.8*VLOOKUP(AK90,Lookups!$A$138:$B$144,2,FALSE)),$I$9,IF(AND(VLOOKUP(AL90,Lookups!$A$138:$B$144,2,FALSE)<=VLOOKUP(AK90,Lookups!$A$138:$B$144,2,FALSE),VLOOKUP(AL90,Lookups!$A$138:$B$144,2,FALSE)>=0.8*VLOOKUP(AK90,Lookups!$A$138:$B$144,2,FALSE)),$I$10,IF(VLOOKUP(AL90,Lookups!$A$138:$B$144,2,FALSE)>VLOOKUP(AK90,Lookups!$A$138:$B$144,2,FALSE),$I$11,\"\")))))","v":0},null,15,18,null,{"$f":"IF(OR(AQ90=\"\",AQ90=\"No NBD warranty available\"),$I$7,IF(VLOOKUP(AQ90,Lookups!$A$138:$B$144,2,FALSE)<VLOOKUP(AO90,Lookups!$A$138:$B$144,2,FALSE),$I$8,IF(AND(VLOOKUP(AQ90,Lookups!$A$138:$B$144,2,FALSE)>=VLOOKUP(AO90,Lookups!$A$138:$B$144,2,FALSE),VLOOKUP(AQ90,Lookups!$A$138:$B$144,2,FALSE)<0.8*VLOOKUP(AP90,Lookups!$A$138:$B$144,2,FALSE)),$I$9,IF(AND(VLOOKUP(AQ90,Lookups!$A$138:$B$144,2,FALSE)<=VLOOKUP(AP90,Lookups!$A$138:$B$144,2,FALSE),VLOOKUP(AQ90,Lookups!$A$138:$B$144,2,FALSE)>=0.8*VLOOKUP(AP90,Lookups!$A$138:$B$144,2,FALSE)),$I$10,IF(VLOOKUP(AQ90,Lookups!$A$138:$B$144,2,FALSE)>VLOOKUP(AP90,Lookups!$A$138:$B$144,2,FALSE),$I$11,\"\")))))","v":0},null,15,18,null,{"$f":"IF(OR(AV90=\"\",AV90=\"No NBD warranty available\"),$I$7,IF(VLOOKUP(AV90,Lookups!$A$138:$B$144,2,FALSE)<VLOOKUP(AT90,Lookups!$A$138:$B$144,2,FALSE),$I$8,IF(AND(VLOOKUP(AV90,Lookups!$A$138:$B$144,2,FALSE)>=VLOOKUP(AT90,Lookups!$A$138:$B$144,2,FALSE),VLOOKUP(AV90,Lookups!$A$138:$B$144,2,FALSE)<0.8*VLOOKUP(AU90,Lookups!$A$138:$B$144,2,FALSE)),$I$9,IF(AND(VLOOKUP(AV90,Lookups!$A$138:$B$144,2,FALSE)<=VLOOKUP(AU90,Lookups!$A$138:$B$144,2,FALSE),VLOOKUP(AV90,Lookups!$A$138:$B$144,2,FALSE)>=0.8*VLOOKUP(AU90,Lookups!$A$138:$B$144,2,FALSE)),$I$10,IF(VLOOKUP(AV90,Lookups!$A$138:$B$144,2,FALSE)>VLOOKUP(AU90,Lookups!$A$138:$B$144,2,FALSE),$I$11,\"\")))))","v":0}]
[{"$f":"SUM(A22:A90)","v":{"v":0.9950000000000003,"d":"100%"}},null,null,{"$f":"SUM(D22:D90)","v":{"v":0.9950000000000006,"d":"100%"}},{"$nulls":3},"Model Score",{"$f":"IF(H85=\"No\",0,ROUNDUP(SUMPRODUCT($D22:$D90,I22:I90)*10,0))","v":3},{"$nulls":3},"Model Score",{"$f":"IF(M85=\"No\",0,ROUNDUP(SUMPRODUCT($D22:$D90,N22:N90)*10,0))","v":0},{"$nulls":3},"Model Score",{"$f":"IF(R85=\"No\",0,ROUNDUP(SUMPRODUCT($D22:$D90,S22:S90)*10,0))","v":0},{"$nulls":3},"Model Score",{"$f":"IF(W85=\"No\",0,ROUNDUP(SUMPRODUCT($D22:$D90,X22:X90)*10,0))","v":0},{"$nulls":3},"Model Score",{"$f":"IF(AB85=\"No\",0,ROUNDUP(SUMPRODUCT($D22:$D90,AC22:AC90)*10,0))","v":0},null,{"$f":"SUM(AE22:AE90)","v":{"v":1.0000000000000002,"d":"100%"}},null,null,{"$f":"SUM(AH22:AH90)","v":{"v":1.0000000000000004,"d":"100%"}},{"$nulls":3},"Model Score",{"$f":"IF(AL85=\"No\",0,ROUNDUP(SUMPRODUCT($D22:$D90,AM22:AM90)*10,0))","v":0},{"$nulls":3},"Model Score",{"$f":"IF(AQ85=\"No\",0,ROUNDUP(SUMPRODUCT($D22:$D90,AR22:AR90)*10,0))","v":0},{"$nulls":3},"Model Score",{"$f":"IF(AV85=\"No\",0,ROUNDUP(SUMPRODUCT($D22:$D90,AW22:AW90)*10,0))","v":0}]
[]
["Weight","Maximum annual failure per 100 devices for years 4,5,6 and 7",{"$nulls":5},"Number of Failures",{"$nulls":4},"Number of Failures",{"$nulls":4},"Number of Failures",{"$nulls":4},"Number of Failures",{"$nulls":4},"Number of Failures",null,null,"Weight","Failure per 100 devices over a five year period",{"$nulls":5},"Number of Failures",{"$nulls":4},"Number of Failures",{"$nulls":4},"Number of Failures"]
[{"v":0.02734375,"d":"3%"},"Adapter, AC",{"$nulls":28},{"v":0.02734375,"d":"3%"},"Adapter, AC"]
[{"v":0.27734375,"d":"28%"},"Base Unit/Chasis",{"$nulls":28},{"v":0.27734375,"d":"28%"},"Base Unit/Chasis"]
[{"v":0.06640625,"d":"7%"},"Battery (Notebook)",{"$nulls":4}," ",{"$nulls":23},{"v":0.06640625,"d":"7%"},"Battery (Notebook)"]
[{"v":0.03125,"d":"3%"},"Camera",{"$nulls":28},{"v":0.03125,"d":"3%"},"Camera"]
[{"v":0.01953125,"d":"2%"},"Fan Assembly",{"$nulls":28},{"v":0.01953125,"d":"2%"},"Fan Assembly"]
[{"v":0.03515625,"d":"4%"},"Hard Drive",{"$nulls":28},{"v":0.03515625,"d":"4%"},"Hard Drive"]
[{"v":0.05078125,"d":"5%"},"Heatsink",{"$nulls":28},{"v":0.05078125,"d":"5%"},"Heatsink"]
[{"v":0.09375,"d":"9%"},"Keyboard",{"$nulls":28},{"v":0.09375,"d":"9%"},"Keyboard"]
[{"v":0.12109375,"d":"12%"},"LCD Panel",{"$nulls":28},{"v":0.12109375,"d":"12%"},"LCD Panel"]
[{"v":0.01953125,"d":"2%"},"Memory",{"$nulls":28},{"v":0.01953125,"d":"2%"},"Memory"]
[{"v":0.2109375,"d":"21%"},"Motherboard",{"$nulls":28},{"v":0.2109375,"d":"21%"},"Motherboard"]
[{"v":0.02734375,"d":"3%"},"Speaker",{"$nulls":28},{"v":0.02734375,"d":"3%"},"Speaker"]
[{"v":0.01953125,"d":"2%"},"Port Replicator/Docks",{"$nulls":28},{"v":0.01953125,"d":"2%"},"Port Replicator/Docks"]
[{"$nulls":6},"Failure Index",{"$f":"IF(OR(H94=\"\",H95=\"\",H96=\"\",H97=\"\",H98=\"\",H99=\"\",H100=\"\",H101=\"\",H102=\"\",H103=\"\",H104=\"\",H106=\"\",H105=\"\"),0,ROUND(SUMPRODUCT($A94:$A106,H94:H106),0))","v":0},{"$nulls":3},"Failure Index",{"$f":"IF(OR(M94=\"\",M95=\"\",M96=\"\",M97=\"\",M98=\"\",M99=\"\",M100=\"\",M101=\"\",M102=\"\",M103=\"\",M104=\"\",M106=\"\",M105=\"\"),0,ROUND(SUMPRODUCT($A94:$A106,M94:M106),0))","v":0},{"$nulls":3},"Failure Index",{"$f":"IF(OR(R94=\"\",R95=\"\",R96=\"\",R97=\"\",R98=\"\",R99=\"\",R100=\"\",R101=\"\",R102=\"\",R103=\"\",R104=\"\",R106=\"\",R105=\"\"),0,ROUND(SUMPRODUCT($A94:$A106,R94:R106),0))","v":0},{"$nulls":3},"Failure Index",{"$f":"IF(OR(W94=\"\",W95=\"\",W96=\"\",W97=\"\",W98=\"\",W99=\"\",W100=\"\",W101=\"\",W102=\"\",W103=\"\",W104=\"\",W106=\"\",W105=\"\"),0,ROUND(SUMPRODUCT($A94:$A106,W94:W106),0))","v":0},{"$nulls":3},"Failure Index",{"$f":"IF(OR(AB94=\"\",AB95=\"\",AB96=\"\",AB97=\"\",AB98=\"\",AB99=\"\",AB100=\"\",AB101=\"\",AB102=\"\",AB103=\"\",AB104=\"\",AB106=\"\",AB105=\"\"),0,ROUND(SUMPRODUCT($A94:$A106,AB94:AB106),0))","v":0},{"$nulls":8},"Failure Index",{"$f":"IF(OR(AL94=\"\",AL95=\"\",AL96=\"\",AL97=\"\",AL98=\"\",AL99=\"\",AL100=\"\",AL101=\"\",AL102=\"\",AL103=\"\",AL104=\"\",AL106=\"\",AL105=\"\"),0,ROUND(SUMPRODUCT($A94:$A106,AL94:AL106),0))","v":0},{"$nulls":3},"Failure Index",{"$f":"IF(OR(AQ94=\"\",AQ95=\"\",AQ96=\"\",AQ97=\"\",AQ98=\"\",AQ99=\"\",AQ100=\"\",AQ101=\"\",AQ102=\"\",AQ103=\"\",AQ104=\"\",AQ106=\"\",AQ105=\"\"),0,ROUND(SUMPRODUCT($A94:$A106,AQ94:AQ106),0))","v":0},{"$nulls":3},"Failure Index",{"$f":"IF(OR(AV94=\"\",AV95=\"\",AV96=\"\",AV97=\"\",AV98=\"\",AV99=\"\",AV100=\"\",AV101=\"\",AV102=\"\",AV103=\"\",AV104=\"\",AV106=\"\",AV105=\"\"),0,ROUND(SUMPRODUCT($A94:$A106,AV94:AV106),0))","v":0}]
[]
["Weight","Docking Station/Port Replicator Configuration",null,"Weight",null,"Mainstream Docking Station/Port Replicator",{"$nulls":4},"High-End Docking Station/Port Replicator"]
[{"$nulls":5},"Make",{"$nulls":4},"Make"]
[{"$nulls":5},"Model",{"$nulls":4},"Model"]
[{"$nulls":5},"Required","Desired","Proposed","Score",null,"Required","Desired","Proposed","Score"]
[{"$f":"SUM(D113:D115)","v":{"v":0.325,"d":"33%"}},"Video Out ","HDMI 2",{"v":0.15,"d":"15.0%"},null,1,2,null,{"$f":"IF(OR(H113=\"\",H113=0),$I$7,IF(H113<F113,$I$8,IF(AND(H113>=F113,H113<0.9*G113),$I$9,IF(AND(H113<=G113,H113>=0.9*G113),$I$10,IF(H113>G113,$I$11,\"\")))))","v":0},null,2,6,null,{"$f":"IF(OR(M113=\"\",M113=0),$I$7,IF(M113<K113,$I$8,IF(AND(M113>=K113,M113<0.9*L113),$I$9,IF(AND(M113<=L113,M113>=0.9*L113),$I$10,IF(M113>L113,$I$11,\"\")))))","v":0}]
[null,"Number of ports","DisplayPort 1.4 (mini or std)",{"v":0.15,"d":"15.0%"},null,1,2,null,0,null,2,2,null,0]
[null,null,"VGA",{"v":0.025,"d":"2.5%"},{"$nulls":4},0,{"$nulls":4},0]
[{"$f":"SUM(D116:D118)","v":{"v":0.32499999999999996,"d":"33%"}},"Number of USB Ports","USB 2",{"v":0.025,"d":"2.5%"},{"$nulls":4},0,{"$nulls":4},0]
[null,null,"USB 3 Gen 1",{"v":0.15,"d":"15.0%"},null,2,4,null,0,null,4,6,null,0]
[null,null,"USB type C",{"v":0.15,"d":"15.0%"},null,1,2,null,0,null,1,2,null,0]
[{"$f":"SUM(D119:D120)","v":{"v":0.2,"d":"20%"}},"Connectivity","Line in/out/mic/headphone",{"v":0.05,"d":"5.0%"},null,"Yes","Yes",null,{"$f":"IF(H119=\"\",$I$7,IF(AND(H119=G119,H119=\"Yes\"),$I$10,IF(AND(H119=F119,H119=\"Yes\"),$I$9,3)))","v":0},null,"Yes","Yes",null,{"$f":"IF(M119=\"\",$I$7,IF(AND(M119=L119,M119=\"Yes\"),$I$10,IF(AND(M119=K119,M119=\"Yes\"),$I$9,3)))","v":0}]
[null,null,"RJ45 Gigabit LAN (Built-in)",{"v":0.15,"d":"15.0%"},null,"Yes","Yes",null,{"$f":"IF(H120=\"\",$I$7,IF(AND(H120=G120,H120=\"Yes\"),8,IF(AND(H120=F120,H120=\"Yes\"),$I$9,3)))","v":0},null,"Yes","Yes",null,{"$f":"IF(M120=\"\",$I$7,IF(AND(M120=L120,M120=\"Yes\"),8,IF(AND(M120=K120,M120=\"Yes\"),$I$9,3)))","v":0}]
[{"$f":"SUM(D121:D122)","v":{"v":0.15,"d":"15%"}},"Maximum Next Business Day (NBD) Warranty in Years Available at Point of Sale for the device",null,{"v":0.075,"d":"7.5%"},null,3,5,null,{"$f":"IF(OR(H121=\"\",H121=\"No NBD warranty available\"),$I$7,IF(VLOOKUP(H121,Lookups!$A$130:$B$135,2,FALSE)<VLOOKUP(F121,Lookups!$A$130:$B$135,2,FALSE),$I$8,IF(AND(VLOOKUP(H121,Lookups!$A$130:$B$135,2,FALSE)>=VLOOKUP(F121,Lookups!$A$130:$B$135,2,FALSE),VLOOKUP(H121,Lookups!$A$130:$B$135,2,FALSE)<0.8*VLOOKUP(G121,Lookups!$A$130:$B$135,2,FALSE)),$I$9,IF(AND(VLOOKUP(H121,Lookups!$A$130:$B$135,2,FALSE)<=VLOOKUP(G121,Lookups!$A$130:$B$135,2,FALSE),VLOOKUP(H121,Lookups!$A$130:$B$135,2,FALSE)>=0.8*VLOOKUP(G121,Lookups!$A$130:$B$135,2,FALSE)),$I$10,IF(VLOOKUP(H121,Lookups!$A$130:$B$135,2,FALSE)>VLOOKUP(G121,Lookups!$A$130:$B$135,2,FALSE),$I$11,\"\")))))","v":0},null,3,5,null,{"$f":"IF(OR(M121=\"\",M121=\"No NBD warranty available\"),$I$7,IF(VLOOKUP(M121,Lookups!$A$130:$B$135,2,FALSE)<VLOOKUP(K121,Lookups!$A$130:$B$135,2,FALSE),$I$8,IF(AND(VLOOKUP(M121,Lookups!$A$130:$B$135,2,FALSE)>=VLOOKUP(K121,Lookups!$A$130:$B$135,2,FALSE),VLOOKUP(M121,Lookups!$A$130:$B$135,2,FALSE)<0.8*VLOOKUP(L121,Lookups!$A$130:$B$135,2,FALSE)),$I$9,IF(AND(VLOOKUP(M121,Lookups!$A$130:$B$135,2,FALSE)<=VLOOKUP(L121,Lookups!$A$130:$B$135,2,FALSE),VLOOKUP(M121,Lookups!$A$130:$B$135,2,FALSE)>=0.8*VLOOKUP(L121,Lookups!$A$130:$B$135,2,FALSE)),$I$10,IF(VLOOKUP(M121,Lookups!$A$130:$B$135,2,FALSE)>VLOOKUP(L121,Lookups!$A$130:$B$135,2,FALSE),$I$11,\"\")))))","v":0}]
[null,"Next Business Day (NBD) Warranty Included in the Proposed Device for the device",null,{"v":0.075,"d":"7.5%"},null,3,5,null,{"$f":"IF(OR(H122=\"\",H122=\"No NBD warranty available\"),$I$7,IF(VLOOKUP(H122,Lookups!$A$130:$B$135,2,FALSE)<VLOOKUP(F122,Lookups!$A$130:$B$135,2,FALSE),$I$8,IF(AND(VLOOKUP(H122,Lookups!$A$130:$B$135,2,FALSE)>=VLOOKUP(F122,Lookups!$A$130:$B$135,2,FALSE),VLOOKUP(H122,Lookups!$A$130:$B$135,2,FALSE)<0.8*VLOOKUP(G122,Lookups!$A$130:$B$135,2,FALSE)),$I$9,IF(AND(VLOOKUP(H122,Lookups!$A$130:$B$135,2,FALSE)<=VLOOKUP(G122,Lookups!$A$130:$B$135,2,FALSE),VLOOKUP(H122,Lookups!$A$130:$B$135,2,FALSE)>=0.8*VLOOKUP(G122,Lookups!$A$130:$B$135,2,FALSE)),$I$10,IF(VLOOKUP(H122,Lookups!$A$130:$B$135,2,FALSE)>VLOOKUP(G122,Lookups!$A$130:$B$135,2,FALSE),$I$11,\"\")))))","v":0},null,3,5,null,{"$f":"IF(OR(M122=\"\",M122=\"No NBD warranty available\"),$I$7,IF(VLOOKUP(M122,Lookups!$A$130:$B$135,2,FALSE)<VLOOKUP(K122,Lookups!$A$130:$B$135,2,FALSE),$I$8,IF(AND(VLOOKUP(M122,Lookups!$A$130:$B$135,2,FALSE)>=VLOOKUP(K122,Lookups!$A$130:$B$135,2,FALSE),VLOOKUP(M122,Lookups!$A$130:$B$135,2,FALSE)<0.8*VLOOKUP(L122,Lookups!$A$130:$B$135,2,FALSE)),$I$9,IF(AND(VLOOKUP(M122,Lookups!$A$130:$B$135,2,FALSE)<=VLOOKUP(L122,Lookups!$A$130:$B$135,2,FALSE),VLOOKUP(M122,Lookups!$A$130:$B$135,2,FALSE)>=0.8*VLOOKUP(L122,Lookups!$A$130:$B$135,2,FALSE)),$I$10,IF(VLOOKUP(M122,Lookups!$A$130:$B$135,2,FALSE)>VLOOKUP(L122,Lookups!$A$130:$B$135,2,FALSE),$I$11,\"\")))))","v":0}]
[{"$f":"SUM(A113:A122)","v":{"v":0.9999999999999999,"d":"100%"}},null,null,{"$f":"SUM(D113:D122)","v":{"v":1,"d":"100%"}},{"$nulls":3},"Option 1 Score",{"$f":"SUMPRODUCT($D113:$D120*I113:I120)*10","v":0},{"$nulls":3},"Option 2 Score",{"$f":"SUMPRODUCT($D113:$D120*N113:N120)*10","v":0}]
{"$rows_empty":1048128}
[{"v":0.05,"d":"5%"}]

{"sheet":"Annex A Technical req 2","index":3,"n_rows":71,"n_cols":5,"rows_kept":71,"merged":[[0,1,0,3],[1,1,1,3],[2,1,2,3],[3,1,3,3],[5,1,5,4],[6,2,6,4]]}
[null,"Instructions to complete:"]
[null,"1. Please complete only the green cells"]
[null,"2. The project plan and sub-sections will become part of the contracted agreement, should the Bidder be successful, and also   \n     provides the evaluation committee with a view of the ability of the Bidder to execute on the contract."]
[null,"3. By answering yes, the Bidder binds themselves to deliver on each corresponding aspect of the project."]
[]
[null,"Annex A Technical spec 2"]
[null,"Bidder Name:",{"$f":"IF('Annex A Technical req 1'!C4=\"\",\"\",'Annex A Technical req 1'!C4)","v":"hkjg nb"}]
[null,"Criteria","Yes  /No","Score allocation: \n0: Unable to meet requirement \n10: Able to meet requirement","Comments"]
[1,"Order fulfilment"]
[1.1," The bidder must establish a mechanism to generate quotes and time to fulfil"]
["1.1.1","Requirement: Self-help portal to generate immediate quotes",null,{"$f":"IF(C11=\"yes\",10,0)","v":0}]
["1.1.2","Requirement: Generating Manual quotes via e-Mail and call-in, requires acknowledgement within 2 hours, and 4-hour time to receive the quote ",null,0]
[1.2,"Time to process an order"]
["1.2.1","Requirement: An acknowledgement e-mail must be returned within 2 hours of orders received, including the expected delivery date for Laptops, Desktops, and Accessories for upgrades, as well as status updates sent via e-mail to the CSIR Procurement department and ordering user.",null,0]
["1.2.1","Requirement: Integration with the CSIR procurement system with that of the OEM/Supplier, to streamline the ordering process",null,0]
[1.3,"Lead time to deliver"]
["1.3.1","The bidder must have the ability to fulfil all orders for standard models within at least 10 days, irrespective of the number of devices ordered.",null,{"$f":"IF(C17=\"yes\",10,0)","v":0}]
["1.3.2","Modern mainstream and highly mobile class Notebooks to be delivered within at least 3 days from order.",null,{"$f":"IF(C18=\"yes\",10,0)","v":0}]
["1.3.3","Desktop modern mainstream to be delivered in at least 3 days.",null,{"$f":"IF(C19=\"yes\",10,0)","v":0}]
["1.3.4","Orders are to be fulfilled for Nonstandard models within at least 21 days.",null,{"$f":"IF(C20=\"yes\",10,0)","v":0}]
[2,"Enterprise portal "]
[null,"Requirement: An enterprise portal must be enabled with a reporting feature, which includes the following fields:"]
[2.1,"·         Asset reports: Containing, Inventory information, containing the model, drivers, and parts detail, as well as the serial numbers of each. ",null,0]
[2.2,"·         Purchase Report: Containing, Purchasing date, CSIR order number, Delivery date, and Vendor order number",null,0]
[2.3,"·         SLA performance report: Containing, MTTR, Mean time between failures (MTBF), Time from order to delivery of all orders, warranty, and parts replaced.",null,0]
[3,"Enterprise-level Hardware Quality "]
[3.1,"All models are of equal quality, and the longevity of models are similar for all releases.",null,0]
[3.2,"If problematic parts, due to poor design or quality, result in failures, the Bidder will replace all affected (i.e. batteries, screens, keyboards, motherboards, fans).",null,0]
[4," Local Hardware Storage/Warehousing "]
[4.1,"The bidder is be able to provide a warehousing facility.",null,0]
[5,"OEM Future Product/Service Strategy and Roadmap "]
[5.1,"All parts for all models to be supplied and supported for at least 7 years",null,0]
[5.2,"Models supplied should not reach the end of life within less than 24 months",null,0]
[5.3,"Configuration changes are to be maintained for a minimum period of 24 months",null,0]
[6,"Readily available enterprise-grade asset life cycle management information  "]
[null,"The OEMs and potential bidders must make the following information available through an online portal for a minimum period of seven years: "]
[6.1,"Statistics (volume, specifications, and cost) related to buying patterns, including deviations from the CSIR standard ",null,0]
[6.2,"Real-time tracking of orders and their delivery ",null,0]
[6.3,"Detailed asset configuration information down to component levels including a serial number when available, for each component",null,0]
[6.4,"Integration between the CSIR procurement system and the supplier online ordering",null,0]
[6.5,"The ability to “burn” CSIR asset info in the bios and to affix an asset tag at the time of shipment.",null,0]
[6.6," Include CSIR order and asset info in the reporting and online query system(s)",null,0]
[6.7,"Provisioning of LAB machines at cost ( 2 of each of the new and evaluation models). For every mode renewal cycle, the number of machines supplied at cost will not exceed 10",null,0]
[7,"Backward compatibility of Docking stations"]
[7.1,"OEM to guarantee the backward compatibility of docking stations",null,{"$f":"IF(C45=\"yes\",10,0)","v":0}]
[8,"LAB Infrastructure and Imaging of new models  "]
[8.1,"Provisioning of LAB machines at cost ( 2 of each of the new models)",null,0]
[8.2," Images to be preloaded and certified",null,0]
[8.3,"New drivers to be automatically added to the image by the supplier",null,0]
[9,"Equipment management "]
[9.1,"The supplier must confirm all models to be in working order, by testing at the time of delivery at the CSIR.",null,0]
[9.2,"Proposal submitted to manage the CSIR equipment and parts storerooms on the CSIR premises",null,0]
[9.3,"All equipment to be returned to the storerooms, with the intent to be e-wasted by the bidder, on behalf of the OEM. ",null,0]
[9.4,"It is expected that equipment destined for e-waste, must be collected on a monthly basis, and a rebate paid to the CSIR, through a credit",null,0]
[{"$nulls":3},{"$f":"IF(SUM(D9:D54)=0,0,SUM(D9:D54)/320*10)","v":{"v":0,"d":"0.00"}}]
[null,null,"Points",320]
[null,"Annex A Technical requirement 2",{"$f":"IF(D55<=D57,\"Do not proceed\",\"Proceed\")","v":"Do not proceed"},240]
[]
[null,"Certify correctness"]
[]
[null,"On behalf of the Bidder"]
[]
[]
[]
[]
[]
[null,"Signature"]
[]
[null,"Name and Surname"]
[]
[null,"Designation or Role "]

{"sheet":"Annex B SLA Perf requirements","index":4,"n_rows":39,"n_cols":7,"rows_kept":39,"merged":[[1,0,1,6],[2,1,2,6],[3,0,19,0],[5,1,8,1],[6,2,8,2],[10,1,13,1],[12,2,13,2],[12,3,13,3]]}
[]
["Annexure B: SLA Performance requirements"]
["Bidder Name:",{"$f":"IF('Annex A Technical req 1'!C4=\"\",\"\",'Annex A Technical req 1'!C4)","v":"hkjg nb"}]
[null,"SLA call resolution requirements","Expected service delivery criteria ","Performance level","Reporting requirements","Met (yes or no)","Score"]
[null,"Same day for high priority calls","365 x 24 x 7 x 2hr to replace","95% on average","Monthly SLA reporting to include the following:"]
[null,null,"Defined as: days of the year x hours x days of the week x resolution time","95% on average","Number of calls logged per month",null,{"$f":"IF(F6=\"yes\",10,0)","v":0}]
[{"$nulls":4},"MTTR ",null,{"$f":"IF(F7=\"yes\",10,0)","v":0}]
[{"$nulls":4},"Root Cause Analysis report for all incidents/requests.",null,{"$f":"IF(F8=\"yes\",10,0)","v":0}]
[{"$nulls":4},"Summary of maintenance and support actions undertaken per month",null,{"$f":"IF(F9=\"yes\",10,0)","v":0}]
[null,"Next business day (NBD) resolution for medium priority calls","Expected service delivery criteria ","Performance level","Monthly SLA reporting to include the following:"]
[null,null,"365 x 24 x 7 x NBD to replace","95% on average","Number of calls logged per month",null,{"$f":"IF(F11=\"yes\",10,0)","v":0}]
[null,null,"Defined as: days of the year x hours x days of the week x resolution time","95% on average","MTTR ",null,{"$f":"IF(F12=\"yes\",10,0)","v":0}]
[{"$nulls":4},"Root Cause Analysis report for all incidents/requests.",null,{"$f":"IF(F13=\"yes\",10,0)","v":0}]
[{"$nulls":4},"Summary of maintenance and support actions undertaken per month",null,{"$f":"IF(F14=\"yes\",10,0)","v":0}]
[null,"Average delivery time requirement","Expected service delivery criteria ","Performance level","Reporting requirements"]
[null,"Highly Mobile Notebook/desktops (Mobile, Connector)","Delivery on average: within 12 days","No more than 10% over 15 days","A report containing the delivery time per order, and\na report containing the average delivery times of all orders",null,{"$f":"IF(F16=\"yes\",10,0)","v":0}]
[null,"Traditional Mainstream Notebook and Desktop (Connector, Collaborator)","Delivery on average: within 7 days","No more than 10% over 10 days","A report containing the delivery time per order, and\na report containing the average delivery times of all orders",null,{"$f":"IF(F17=\"yes\",10,0)","v":0}]
[null,"Modern Mainstream Notebook  (Connector, Collaborator)","Delivery on average: within 7 days","No more than 10% over 10 days","A report containing the delivery time per order, and\na report containing the average delivery times of all orders",null,{"$f":"IF(F18=\"yes\",10,0)","v":0}]
[null,"High-End Notebook  (Connector, Collaborator)- 15\" screen","Delivery on average: within 7 days","No more than 10% over 10 days","A report containing the delivery time per order, and\na report containing the average delivery times of all orders",null,{"$f":"IF(F19=\"yes\",10,0)","v":0}]
[null,"High-End Notebook (Connector, Collaborator) - 17\" screen","Delivery on average: within 7 days","No more than 10% over 10 days","A report containing the delivery time per order, and\na report containing the average delivery times of all orders",null,{"$f":"IF(F20=\"yes\",10,0)","v":0}]
[{"$nulls":5},"Total score",{"$f":"SUM(G5:G20)","v":0}]
[{"$nulls":5},"Maximum points",130]
[null,"SLA Performance requirements",{"$f":"IF(G23<G21,\"Proceed\",\"Do not proceed\")","v":"Do not proceed"},null,null,"Minimum required",{"$f":"G22*0.75","v":{"v":97.5,"d":"98"}}]
[{"$nulls":5},"Score out of 10",{"$f":"G21/G22*10","v":{"v":0,"d":"0.00"}}]
[]
[]
["Certify correctness"]
[]
["On behalf of the Bidder"]
[]
[]
[]
[]
[]
["Signature"]
[]
["Name and Surname"]
[]
["Designation or Role "]

{"sheet":"Annex C Company Info","index":5,"n_rows":23,"n_cols":5,"rows_kept":23,"merged":[[3,1,3,4]]}
[]
["Annexure C: Company Informaton"]
[]
["Bidder Name:",{"$f":"IF('Annex A Technical req 1'!C4=\"\",\"\",'Annex A Technical req 1'!C4)","v":"hkjg nb"}]
[]
[]
["                                                      OEM Presence\n\n          Region","OEM Office(s)","24x7x365 Call Centre","Number of Next Business Day On-site Repair Agents","Number Spares Stores"]
["GAUTENG",null,null,{"$f":"SUM(D9:D13)","v":0}]
["CSIR Pretoria"]
["CSIR Kloppersbos (Pretoria North)"]
["CSIR Paardefontein (Pretoria North)"]
["CSIR Johannesburg: Frost Avenue (Cottesloe)"]
["CSIR Johannesburg: Carlow Road "]
["WESTERN CAPE ",null,null,{"$f":"SUM(D15:D16)","v":0}]
["CSIR Rosebank (Cape Town)"]
["CSIR Stellenbosch"]
["KWAZULU NATAL",null,null,{"$f":"D18","v":0}]
["CSIR Durban"]
["INTERNATIONAL","Not Applicable",null,"Not Applicable","Not Applicable"]
["Invidual Totals",{"$f":"IF(OR(B8=\"yes\",B14=\"yes\",B17=\"yes\"),100,0)","v":0},{"$f":"IF(AND(COUNTIF(C8:C18,\"24x7x365\")>=1,C19=\"24x7x365\"),100,IF(AND(COUNTIF(C8:C18,\"Office Hours\")>=1,C19=\"24x7x365\"),80,IF(COUNTIF(C8:C18,\"24x7x365\")>=1,90,IF(C19=\"24x7x365\",70,IF(COUNTIF(C8:C18,\"Office Hours\")>=1,60,IF(C19=\"Office Hours\",50,0))))))","v":0},{"$f":"IF(AND(D8>=1,D14>=1,D17>=1),100,0)","v":0},{"$f":"IF(AND(E8>=1,E14>=1,E17>=1),100,IF(OR(AND(E8>=1,E14>=1),AND(E8>=1,E17>=1)),50,0))","v":0}]
["Weight",{"v":0.2,"d":"20%"},{"v":0.2,"d":"20%"},{"v":0.3,"d":"30%"},{"v":0.3,"d":"30%"}]
["Individual Weighted Score",{"$f":"B21*B20","v":0},{"$f":"C21*C20","v":0},{"$f":"D21*D20","v":0},{"$f":"E21*E20","v":0}]
["Total Weighted Score",{"$f":"SUM(B22:E22)","v":0}]

{"sheet":"PART 2 Pricing Schedule","index":6,"n_rows":78,"n_cols":50,"rows_kept":78,"merged":[[3,1,3,7],[5,0,5,1],[5,3,5,7],[5,9,5,13],[5,15,5,19],[5,21,5,25],[5,27,5,31],[5,33,5,37],[5,39,5,43],[5,45,5,49],[6,0,6,1],[6,3,6,7],[6,9,6,13],[6,15,6,19],[6,21,6,25],[6,27,6,31],[6,33,6,37],[6,39,6,43],[6,45,6,49],[7,0,7,1],[7,3,7,7],[7,9,7,13],[7,15,7,19],[7,21,7,25],[7,27,7,31],[7,33,7,37],[7,39,7,43],[7,45,7,49],[8,0,8,1],[8,3,8,7],[8,9,8,13],[8,15,8,19],[8,21,8,25],[8,27,8,31],[8,33,8,37],[8,39,8,43],[8,45,8,49],[9,0,11,0],[9,3,9,7],[9,9,9,13],[9,15,9,19],[9,21,9,25],[9,27,9,31],[9,33,9,37],[9,39,9,43],[9,45,9,49],[10,1,11,1],[12,0,14,0],[12,3,12,7],[12,9,12,13],[12,15,12,19],[12,21,12,25],[12,27,12,31],[12,33,12,37],[12,39,12,43],[12,45,12,49],[13,1,14,1],[15,0,17,0],[15,3,15,7],[15,9,15,13],[15,15,15,19],[15,21,15,25],[15,27,15,31],[15,33,15,37],[15,39,15,43],[15,45,15,49],[16,1,17,1],[19,0,19,1],[19,3,19,7],[19,9,19,13],[19,15,19,19],[19,21,19,25],[19,27,19,31],[19,33,19,37],[19,39,19,43],[19,45,19,49],[20,0,20,1],[20,3,20,7],[20,9,20,13],[20,15,20,19],[20,21,20,25],[20,27,20,31],[20,33,20,37],[20,39,20,43],[20,45,20,49],[21,0,21,1],[21,3,21,7],[21,9,21,13],[21,15,21,19],[21,21,21,25],[21,27,21,31],[21,33,21,37],[21,39,21,43],[21,45,21,49],[22,0,22,1],[22,3,22,7],[22,9,22,13],[22,15,22,19],[22,21,22,25],[22,27,22,31],[22,33,22,37],[22,39,22,43],[22,45,22,49],[23,0,23,1],[23,3,23,7],[23,9,23,13],[23,15,23,19],[23,21,23,25],[23,27,23,31],[23,33,23,37],[23,39,23,43],[23,45,23,49],[24,0,24,1],[24,3,24,7],[24,9,24,13],[24,15,24,19],[24,21,24,25],[24,27,24,31],[24,33,24,37],[24,39,24,43],[24,45,24,49],[25,0,25,1],[25,3,25,7],[25,9,25,13],[25,15,25,19],[25,21,25,25],[25,27,25,31],[25,33,25,37],[25,39,25,43],[25,45,25,49],[26,0,26,1],[26,3,26,7],[26,9,26,13],[26,15,26,19],[26,21,26,25],[26,27,26,31],[26,33,26,37],[26,39,26,43],[26,45,26,49],[27,0,27,1],[27,3,27,7],[27,9,27,13],[27,15,27,19],[27,21,27,25],[27,27,27,31],[27,33,27,37],[27,39,27,43],[27,45,27,49],[28,0,28,1],[28,3,28,7],[28,9,28,13],[28,15,28,19],[28,21,28,25],[28,27,28,31],[28,33,28,37],[28,39,28,43],[28,45,28,49],[29,0,29,1],[29,3,29,7],[29,9,29,13],[29,15,29,19],[29,21,29,25],[29,27,29,31],[29,33,29,37],[29,39,29,43],[29,45,29,49],[30,0,30,1],[30,3,30,7],[30,9,30,13],[30,15,30,19],[30,21,30,25],[30,27,30,31],[30,33,30,37],[30,39,30,43],[30,45,30,49],[31,0,31,1],[31,3,31,7],[31,9,31,13],[31,15,31,19],[31,21,31,25],[31,27,31,31],[31,33,31,37],[31,39,31,43],[31,45,31,49],[32,0,32,1],[32,3,32,7],[32,9,32,13],[32,15,32,19],[32,21,32,25],[32,27,32,31],[32,33,32,37],[32,39,32,43],[32,45,32,49],[33,0,33,1],[33,3,33,7],[33,9,33,13],[33,15,33,19],[33,21,33,25],[33,27,33,31],[33,33,33,37],[33,39,33,43],[33,45,33,49],[34,0,34,1],[34,3,34,7],[34,9,34,13],[34,15,34,19],[34,21,34,25],[34,27,34,31],[34,33,34,37],[34,39,34,43],[34,45,34,49],[35,0,36,1],[38,0,38,1],[38,3,38,7],[38,9,38,13],[39,0,39,1],[39,3,39,7],[39,9,39,13],[40,0,40,1],[40,3,40,7],[40,9,40,13],[41,0,41,1],[41,3,41,7],[41,9,41,13],[42,0,44,0],[42,3,42,7],[42,9,42,13],[43,1,44,1],[45,0,47,0],[45,3,45,7],[45,9,45,13],[46,1,47,1],[48,0,50,0],[48,3,48,7],[48,9,48,13],[49,1,50,1],[52,0,52,1],[52,3,52,7],[52,9,52,13],[52,15,52,19],[52,21,52,25],[53,0,56,1],[53,3,53,4],[53,5,53,7],[53,9,53,10],[53,11,53,13],[53,15,53,16],[53,17,53,19],[53,21,53,22],[53,23,53,25],[54,3,54,4],[54,5,54,7],[54,9,54,10],[54,11,54,13],[54,15,54,16],[54,17,54,19],[54,21,54,22],[54,23,54,25],[55,3,55,4],[55,5,55,7],[55,9,55,10],[55,11,55,13],[55,15,55,16],[55,17,55,19],[55,21,55,22],[55,23,55,25],[56,5,56,7],[56,11,56,13],[56,17,56,19],[56,23,56,25],[57,0,59,0],[57,3,57,7],[57,9,57,13],[57,15,57,19],[57,21,57,25],[58,1,59,1],[60,0,62,0],[60,3,60,7],[60,9,60,13],[60,15,60,19],[60,21,60,25],[61,1,62,1],[63,0,65,0],[63,3,63,7],[63,9,63,13],[63,15,63,19],[63,21,63,25],[64,1,65,1],[67,0,67,1],[67,3,67,7],[68,0,68,1],[68,3,68,7],[69,0,71,0],[69,3,69,7],[70,1,71,1],[72,0,74,0],[72,3,72,7],[73,1,74,1],[75,0,77,0],[75,3,75,7],[76,1,77,1]]}
[]
["PRICING SCHEDULE"]
[]
["Bidder Name:",{"$f":"IF('Annex A Technical req 1'!C4=\"\",\"\",'Annex A Technical req 1'!C4)","v":"hkjg nb"}]
[]
["Notebook/Desktops Pricing in ZAR",null,null,"Highly Mobile Notebook (Mobile, Connector)",{"$nulls":5},"Traditional Mainstream Notebook  (Connector, Collaborator)",{"$nulls":5},"Modern Mainstream Notebook  (Connector, Collaborator)",{"$nulls":5},"High-End Notebook  (Connector, Collaborator)- 15\" screen",{"$nulls":5},"High-End Notebook (Connector, Collaborator) - 17\" screen",{"$nulls":5},"Traditional Mainstream Desktop (Connector, Collaborator)",{"$nulls":5},"Modern Mainstream Desktop (Connector, Collaborator)",{"$nulls":5},"High-End Desktop with Xeon CPU (Connector, Collaborator)"]
["Make",null,null,{"$f":"IF('Annex A Technical req 1'!G19=\"\",\"\",'Annex A Technical req 1'!G19)","v":""},{"$nulls":5},{"$f":"IF('Annex A Technical req 1'!L19=\"\",\"\",'Annex A Technical req 1'!L19)","v":""},{"$nulls":5},{"$f":"IF('Annex A Technical req 1'!Q19=\"\",\"\",'Annex A Technical req 1'!Q19)","v":""},{"$nulls":5},{"$f":"IF('Annex A Technical req 1'!V19=\"\",\"\",'Annex A Technical req 1'!V19)","v":""},{"$nulls":5},{"$f":"IF('Annex A Technical req 1'!AA19=\"\",\"\",'Annex A Technical req 1'!AA19)","v":""},{"$nulls":5},{"$f":"IF('Annex A Technical req 1'!AK19=\"\",\"\",'Annex A Technical req 1'!AK19)","v":""},{"$nulls":5},{"$f":"IF('Annex A Technical req 1'!AP19=\"\",\"\",'Annex A Technical req 1'!AP19)","v":""},{"$nulls":5},{"$f":"IF('Annex A Technical req 1'!AU19=\"\",\"\",'Annex A Technical req 1'!AU19)","v":""}]
["Model",null,null,{"$f":"IF('Annex A Technical req 1'!G20=\"\",\"\",'Annex A Technical req 1'!G20)","v":""},{"$nulls":5},{"$f":"IF('Annex A Technical req 1'!L20=\"\",\"\",'Annex A Technical req 1'!L20)","v":""},{"$nulls":5},{"$f":"IF('Annex A Technical req 1'!Q20=\"\",\"\",'Annex A Technical req 1'!Q20)","v":""},{"$nulls":5},{"$f":"IF('Annex A Technical req 1'!V20=\"\",\"\",'Annex A Technical req 1'!V20)","v":""},{"$nulls":5},{"$f":"IF('Annex A Technical req 1'!AA20=\"\",\"\",'Annex A Technical req 1'!AA20)","v":""},{"$nulls":5},{"$f":"IF('Annex A Technical req 1'!AK20=\"\",\"\",'Annex A Technical req 1'!AK20)","v":""},{"$nulls":5},{"$f":"IF('Annex A Technical req 1'!AP20=\"\",\"\",'Annex A Technical req 1'!AP20)","v":""},{"$nulls":5},{"$f":"IF('Annex A Technical req 1'!AU20=\"\",\"\",'Annex A Technical req 1'!AU20)","v":""}]
["Next Business Day (NBD) Warranty Included",null,null,{"$f":"IF('Annex A Technical req 1'!H89=\"\",\"\",'Annex A Technical req 1'!H89)","v":""},{"$nulls":5},{"$f":"IF('Annex A Technical req 1'!M89=\"\",\"\",'Annex A Technical req 1'!M89)","v":""},{"$nulls":5},{"$f":"IF('Annex A Technical req 1'!R89=\"\",\"\",'Annex A Technical req 1'!R89)","v":""},{"$nulls":5},{"$f":"IF('Annex A Technical req 1'!W89=\"\",\"\",'Annex A Technical req 1'!W89)","v":""},{"$nulls":5},{"$f":"IF('Annex A Technical req 1'!AB89=\"\",\"\",'Annex A Technical req 1'!AB89)","v":""},{"$nulls":5},{"$f":"IF('Annex A Technical req 1'!AL89=\"\",\"\",'Annex A Technical req 1'!AL89)","v":""},{"$nulls":5},{"$f":"IF('Annex A Technical req 1'!AQ89=\"\",\"\",'Annex A Technical req 1'!AQ89)","v":""},{"$nulls":5},{"$f":"IF('Annex A Technical req 1'!AN89=\"\",\"\",'Annex A Technical req 1'!AN89)","v":""}]
["Outright purchase","Purchase Price"]
[null,"Maximum % Increase for the equivalent replacement model at the time of release",null,"Year 1","Year 2","Year 3","Year 4","Year 5",null,"Year 1","Year 2","Year 3","Year 4","Year 5",null,"Year 1","Year 2","Year 3","Year 4","Year 5",null,"Year 1","Year 2","Year 3","Year 4","Year 5",null,"Year 1","Year 2","Year 3","Year 4","Year 5",null,"Year 1","Year 2","Year 3","Year 4","Year 5",null,"Year 1","Year 2","Year 3","Year 4","Year 5",null,"Year 1","Year 2","Year 3","Year 4","Year 5"]
[{"$nulls":3},{"v":0,"d":"0%"},{"$nulls":5},{"v":0,"d":"0%"},{"$nulls":5},{"v":0,"d":"0%"},{"$nulls":5},{"v":0,"d":"0%"},{"$nulls":5},{"v":0,"d":"0%"},{"$nulls":5},{"v":0,"d":"0%"},{"$nulls":5},{"v":0,"d":"0%"},{"$nulls":5},{"v":0,"d":"0%"}]
["36 Month Rental","Annual Rental Cost"]
[null,"Maximum % Increase for the equivalent replacement model at the time of release",null,"Year 1","Year 2","Year 3","Year 4","Year 5",null,"Year 1","Year 2","Year 3","Year 4","Year 5",null,"Year 1","Year 2","Year 3","Year 4","Year 5",null,"Year 1","Year 2","Year 3","Year 4","Year 5",null,"Year 1","Year 2","Year 3","Year 4","Year 5",null,"Year 1","Year 2","Year 3","Year 4","Year 5",null,"Year 1","Year 2","Year 3","Year 4","Year 5",null,"Year 1","Year 2","Year 3","Year 4","Year 5"]
[{"$nulls":3},{"v":0,"d":"0%"},{"$nulls":5},{"v":0,"d":"0%"},{"$nulls":5},{"v":0,"d":"0%"},{"$nulls":5},{"v":0,"d":"0%"},{"$nulls":5},{"v":0,"d":"0%"},{"$nulls":5},{"v":0,"d":"0%"},{"$nulls":5},{"v":0,"d":"0%"},{"$nulls":5},{"v":0,"d":"0%"}]
["60 Month Rental","Annual Rental Cost"]
[null,"Maximum % Increase for the equivalent replacement model at the time of release",null,"Year 1","Year 2","Year 3","Year 4","Year 5",null,"Year 1","Year 2","Year 3","Year 4","Year 5",null,"Year 1","Year 2","Year 3","Year 4","Year 5",null,"Year 1","Year 2","Year 3","Year 4","Year 5",null,"Year 1","Year 2","Year 3","Year 4","Year 5",null,"Year 1","Year 2","Year 3","Year 4","Year 5",null,"Year 1","Year 2","Year 3","Year 4","Year 5",null,"Year 1","Year 2","Year 3","Year 4","Year 5"]
[{"$nulls":3},{"v":0,"d":"0%"},{"$nulls":5},{"v":0,"d":"0%"},{"$nulls":5},{"v":0,"d":"0%"},{"$nulls":5},{"v":0,"d":"0%"},{"$nulls":5},{"v":0,"d":"0%"},{"$nulls":5},{"v":0,"d":"0%"},{"$nulls":5},{"v":0,"d":"0%"},{"$nulls":5},{"v":0,"d":"0%"}]
[]
["Out of Warranty  Component and Installation Cost in ZAR",null,null,"Highly Mobile Notebook (Mobile, Connector)",{"$nulls":5},"Traditional Mainstream Notebook  (Connector, Collaborator)",{"$nulls":5},"Modern Mainstream Notebook  (Connector, Collaborator)",{"$nulls":5},"High-End Notebook  (Connector, Collaborator)- 15\" screen",{"$nulls":5},"High-End Notebook (Connector, Collaborator) - 17\" screen",{"$nulls":5},"Traditional Mainstream Desktop (Connector, Collaborator)",{"$nulls":5},"Modern Mainstream Desktop (Connector, Collaborator)",{"$nulls":5},"High-End Desktop with Xeon CPU (Connector, Collaborator)"]
["Adapter, AC"]
["Base Unit/Chasis"]
["Battery (Notebook)"]
["Camera"]
["Fan Assembly"]
["Hard Drive"]
["Heatsink"]
["Keyboard"]
["LCD Panel"]
["Memory"]
["Motherboard"]
["Speaker"]
["Port Replicator/Docks"]
["Projected total out-of-warranty repair cost for years 1 to 5",null,null,{"$f":"ROUNDUP(SUMPRODUCT('Annex A Technical req 1'!H94:H105,D21:D32),0)","v":0},{"$nulls":5},{"$f":"ROUNDUP(SUMPRODUCT('Annex A Technical req 1'!M94:M105,$J21:$J32),0)","v":0},{"$nulls":5},{"$f":"ROUNDUP(SUMPRODUCT('Annex A Technical req 1'!R94:R105,P21:P32),0)","v":0},{"$nulls":5},{"$f":"ROUNDUP(SUMPRODUCT('Annex A Technical req 1'!W94:W105,V21:V32),0)","v":0},{"$nulls":5},{"$f":"ROUNDUP(SUMPRODUCT('Annex A Technical req 1'!AB94:AB105,AB21:AB32),0)","v":0},{"$nulls":5},{"$f":"ROUNDUP(SUMPRODUCT('Annex A Technical req 1'!AL94:AL105,AH21:AH32),0)","v":0},{"$nulls":5},{"$f":"ROUNDUP(SUMPRODUCT('Annex A Technical req 1'!AQ94:AQ105,AN21:AN32),0)","v":0},{"$nulls":5},{"$f":"ROUNDUP(SUMPRODUCT('Annex A Technical req 1'!AV94:AV105,AT21:AT32),0)","v":0}]
["Projected total out-of-warranty repair cost for years 1 to 5",null,null,{"$f":"ROUNDUP('Annex A Technical req 1'!H106*D33,0)","v":0},{"$nulls":5},{"$f":"ROUNDUP('Annex A Technical req 1'!M106*$J33,0)","v":0},{"$nulls":5},{"$f":"ROUNDUP('Annex A Technical req 1'!R106*P33,0)","v":0},{"$nulls":5},{"$f":"ROUNDUP('Annex A Technical req 1'!W106*V33,0)","v":0},{"$nulls":5},{"$f":"ROUNDUP('Annex A Technical req 1'!AB106*AB33,0)","v":0},{"$nulls":5},{"$f":"ROUNDUP('Annex A Technical req 1'!AL106*AH33,0)","v":0},{"$nulls":5},{"$f":"ROUNDUP('Annex A Technical req 1'!AQ106*AN33,0)","v":0},{"$nulls":5},{"$f":"ROUNDUP('Annex A Technical req 1'!AV106*AT33,0)","v":0}]
["Average Maximum Annual % Increase for All Components Above",null,null,"Year 1","Year 2","Year 3","Year 4","Year 5",null,"Year 1","Year 2","Year 3","Year 4","Year 5",null,"Year 1","Year 2","Year 3","Year 4","Year 5",null,"Year 1","Year 2","Year 3","Year 4","Year 5",null,"Year 1","Year 2","Year 3","Year 4","Year 5",null,"Year 1","Year 2","Year 3","Year 4","Year 5",null,"Year 1","Year 2","Year 3","Year 4","Year 5",null,"Year 1","Year 2","Year 3","Year 4","Year 5"]
[{"$nulls":3},{"v":0,"d":"0%"},{"$nulls":5},{"v":0,"d":"0%"},{"$nulls":5},{"v":0,"d":"0%"},{"$nulls":5},{"v":0,"d":"0%"},{"$nulls":5},{"v":0,"d":"0%"},{"$nulls":5},{"v":0,"d":"0%"},{"$nulls":5},{"v":0,"d":"0%"},{"$nulls":5},{"v":0,"d":"0%"}]
[]
["Docking Station/Port Replicator Pricing in ZAR",null,null,"Mainstream Docking Station/Port Replicator",{"$nulls":5},"High-end Docking Station/Port Replicator"]
["Make",null,null,{"$f":"IF('Annex A Technical req 1'!G110=\"\",\"\",'Annex A Technical req 1'!G110)","v":""},{"$nulls":5},{"$f":"IF('Annex A Technical req 1'!L110=\"\",\"\",'Annex A Technical req 1'!L110)","v":""}]
["Model",null,null,{"$f":"IF('Annex A Technical req 1'!G111=\"\",\"\",'Annex A Technical req 1'!G111)","v":""},{"$nulls":5},{"$f":"IF('Annex A Technical req 1'!L111=\"\",\"\",'Annex A Technical req 1'!L111)","v":""}]
["Next Business Day (NBD) Warranty Included",null,null,{"$f":"IF('Annex A Technical req 1'!H122=\"\",\"\",'Annex A Technical req 1'!H122)","v":""},{"$nulls":5},{"$f":"IF('Annex A Technical req 1'!M122=\"\",\"\",'Annex A Technical req 1'!M122)","v":""}]
["Outright purchase","Purchase Price"]
[null,"Maximum % Increase for the equivalent replacement model at the time of release",null,"Year 1","Year 2","Year 3","Year 4","Year 5",null,"Year 1","Year 2","Year 3","Year 4","Year 5"]
[{"$nulls":3},{"v":0,"d":"0%"},{"$nulls":5},{"v":0,"d":"0%"}]
["36 Month Rental","Annual Rental Cost"]
[null,"Maximum % Increase for the equivalent replacement model at the time of release",null,"Year 1","Year 2","Year 3","Year 4","Year 5",null,"Year 1","Year 2","Year 3","Year 4","Year 5"]
[{"$nulls":3},{"v":0,"d":"0%"},{"$nulls":5},{"v":0,"d":"0%"}]
["60 Month Rental","Annual Rental Cost"]
[null,"Maximum % Increase for the equivalent replacement model at the time of release",null,"Year 1","Year 2","Year 3","Year 4","Year 5",null,"Year 1","Year 2","Year 3","Year 4","Year 5"]
[{"$nulls":3},{"v":0,"d":"0%"},{"$nulls":5},{"v":0,"d":"0%"}]
[]
["Screen Cost in ZAR",null,null,"Traditional Mainstream Screen",{"$nulls":5},"Modern Mainstream Screen",{"$nulls":5},"High-End 27\" Screen",{"$nulls":5},"High-End 32\" Screen"]
["Minimum Screen Specification",null,null,"Screen Size - 22\"",null,"Native Resolution - 1920 x 1080",{"$nulls":3},"Screen Size - 24\"",null,"Native Resolution - 1920 x 1080",{"$nulls":3},"Screen Size - 27\"",null,"Native Resolution - 2560 x 1440",{"$nulls":3},"Screen Size - 32\"",null,"Native Resolution - 3840 x 2160"]
[{"$nulls":3},"Brightness - 250 Nits",null,"Refresh Rate at 1920 x 1080 - 60Hz",{"$nulls":3},"SDR IPS LCD Panel",null,"Refresh Rate at 1820 x1080 - 60Hz",{"$nulls":3},"HDR IPS LCD Panel",null,"Refresh Rate at 2560 x 1440 - 75Hz",{"$nulls":3},"HDR IPS LCD Panel",null,"Refresh Rate at 3840 2160 - 100Hz"]
[{"$nulls":3},"SDR VA LCD Panel",null,"Contrast Ratio - 1000:1 to 3000:1",{"$nulls":3},"Brightness - 300 Nits",null,"Contrast Ratio - 1000:1 to 3000:1",{"$nulls":3},"Brightness - 350 Nits",null,"Contrast Ratio - Greater than 3000:1",{"$nulls":3},"Brightness - 350 Nits",null,"Contrast Ratio - Greater than 3000:1"]
[{"$nulls":3},"Warranty",{"$f":"CONCATENATE(TEXT(D42,0),\" Years\")","v":" Years"},"No Blue light Filter or Touch Screen",{"$nulls":3},"Warranty",{"$f":"CONCATENATE(TEXT(D42,0),\" Years\")","v":" Years"},"No Blue light Filter or Touch Screen",{"$nulls":3},"Warranty",{"$f":"CONCATENATE(TEXT(J42,0),\" Years\")","v":" Years"},"No Blue light Filter or Touch Screen",{"$nulls":3},"Warranty",{"$f":"CONCATENATE(TEXT(J42,0),\" Years\")","v":" Years"},"No Blue light Filter or Touch Screen"]
["Outright purchase","Purchase Price"]
[null,"Maximum % Increase for the equivalent replacement model at the time of release",null,"Year 1","Year 2","Year 3","Year 4","Year 5",null,"Year 1","Year 2","Year 3","Year 4","Year 5",null,"Year 1","Year 2","Year 3","Year 4","Year 5",null,"Year 1","Year 2","Year 3","Year 4","Year 5"]
[{"$nulls":3},{"v":0,"d":"0%"},{"$nulls":5},{"v":0,"d":"0%"},{"$nulls":5},{"v":0,"d":"0%"},{"$nulls":5},{"v":0,"d":"0%"}]
["36 Month Rental","Annual Rental Cost"]
[null,"Maximum % Increase for the equivalent replacement model at the time of release",null,"Year 1","Year 2","Year 3","Year 4","Year 5",null,"Year 1","Year 2","Year 3","Year 4","Year 5",null,"Year 1","Year 2","Year 3","Year 4","Year 5",null,"Year 1","Year 2","Year 3","Year 4","Year 5"]
[{"$nulls":3},{"v":0,"d":"0%"},{"$nulls":5},{"v":0,"d":"0%"},{"$nulls":5},{"v":0,"d":"0%"},{"$nulls":5},{"v":0,"d":"0%"}]
["60 Month Rental","Annual Rental Cost"]
[null,"Maximum % Increase for the equivalent replacement model at the time of release",null,"Year 1","Year 2","Year 3","Year 4","Year 5",null,"Year 1","Year 2","Year 3","Year 4","Year 5",null,"Year 1","Year 2","Year 3","Year 4","Year 5",null,"Year 1","Year 2","Year 3","Year 4","Year 5"]
[{"$nulls":3},{"v":0,"d":"0%"},{"$nulls":5},{"v":0,"d":"0%"},{"$nulls":5},{"v":0,"d":"0%"},{"$nulls":5},{"v":0,"d":"0%"}]
[]
["Minimum Keyboard and Mouse Cost in ZAR",null,null,"Standard Keyboard and Mouse"]
["Minimum Keyboard and Mouse Specification",null,null,"Full-Size QUERTY keyboard with Numpad, laptop-like keys which are backlit.\nOptical tracking mouse with a minimum 800 dpi resolution, two buttons and a scroll wheel.\nBoth devices must be able to connect using bluetooth and a single wireless dongle."]
["Outright purchase","Purchase Price"]
[null,"Maximum % Increase for the equivalent replacement model at the time of release",null,"Year 1","Year 2","Year 3","Year 4","Year 5"]
[{"$nulls":3},{"v":0,"d":"0%"}]
["36 Month Rental","Annual Rental Cost"]
[null,"Maximum % Increase for the equivalent replacement model at the time of release",null,"Year 1","Year 2","Year 3","Year 4","Year 5"]
[{"$nulls":3},{"v":0,"d":"0%"}]
["60 Month Rental","Annual Rental Cost"]
[null,"Maximum % Increase for the equivalent replacement model at the time of release",null,"Year 1","Year 2","Year 3","Year 4","Year 5"]
[{"$nulls":3},{"v":0,"d":"0%"}]

{"sheet":"TCO","index":7,"n_rows":111,"n_cols":50,"rows_kept":111,"merged":[[3,1,3,7],[5,0,5,1],[5,3,5,4],[5,5,5,7],[6,0,6,1],[6,3,6,4],[6,5,6,7],[7,0,7,1],[7,3,7,4],[7,5,7,7],[8,0,8,1],[8,3,8,4],[8,5,8,7],[10,0,10,1],[11,0,11,1],[11,3,11,7],[11,9,11,13],[11,15,11,19],[11,21,11,25],[11,27,11,31],[11,33,11,37],[11,39,11,43],[11,45,11,49],[12,0,12,1],[12,3,12,7],[12,9,12,13],[12,15,12,19],[12,21,12,25],[12,27,12,31],[12,33,12,37],[12,39,12,43],[12,45,12,49],[13,0,13,1],[13,3,13,7],[13,9,13,13],[13,15,13,19],[13,21,13,25],[13,27,13,31],[13,33,13,37],[13,39,13,43],[13,45,13,49],[14,0,19,0],[14,3,14,7],[14,9,14,13],[14,15,14,19],[14,21,14,25],[14,27,14,31],[14,33,14,37],[14,39,14,43],[14,45,14,49],[15,3,15,7],[15,9,15,13],[15,15,15,19],[15,21,15,25],[15,27,15,31],[15,33,15,37],[15,39,15,43],[15,45,15,49],[16,3,16,7],[16,9,16,13],[16,15,16,19],[16,21,16,25],[16,27,16,31],[16,33,16,37],[16,39,16,43],[16,45,16,49],[17,3,17,7],[17,9,17,13],[17,15,17,19],[17,21,17,25],[17,27,17,31],[17,33,17,37],[17,39,17,43],[17,45,17,49],[18,3,18,7],[18,9,18,13],[18,15,18,19],[18,21,18,25],[18,27,18,31],[18,33,18,37],[18,39,18,43],[18,45,18,49],[19,3,19,7],[19,9,19,13],[19,15,19,19],[19,21,19,25],[19,27,19,31],[19,33,19,37],[19,39,19,43],[19,45,19,49],[20,0,25,0],[20,3,20,7],[20,9,20,13],[20,15,20,19],[20,21,20,25],[20,27,20,31],[20,33,20,37],[20,39,20,43],[20,45,20,49],[21,3,21,7],[21,9,21,13],[21,15,21,19],[21,21,21,25],[21,27,21,31],[21,33,21,37],[21,39,21,43],[21,45,21,49],[22,3,22,7],[22,9,22,13],[22,15,22,19],[22,21,22,25],[22,27,22,31],[22,33,22,37],[22,39,22,43],[22,45,22,49],[23,3,23,7],[23,9,23,13],[23,15,23,19],[23,21,23,25],[23,27,23,31],[23,33,23,37],[23,39,23,43],[23,45,23,49],[24,3,24,7],[24,9,24,13],[24,15,24,19],[24,21,24,25],[24,27,24,31],[24,33,24,37],[24,39,24,43],[24,45,24,49],[25,3,25,7],[25,9,25,13],[25,15,25,19],[25,21,25,25],[25,27,25,31],[25,33,25,37],[25,39,25,43],[25,45,25,49],[26,0,31,0],[26,3,26,7],[26,9,26,13],[26,15,26,19],[26,21,26,25],[26,27,26,31],[26,33,26,37],[26,39,26,43],[26,45,26,49],[27,3,27,7],[27,9,27,13],[27,15,27,19],[27,21,27,25],[27,27,27,31],[27,33,27,37],[27,39,27,43],[27,45,27,49],[28,3,28,7],[28,9,28,13],[28,15,28,19],[28,21,28,25],[28,27,28,31],[28,33,28,37],[28,39,28,43],[28,45,28,49],[29,3,29,7],[29,9,29,13],[29,15,29,19],[29,21,29,25],[29,27,29,31],[29,33,29,37],[29,39,29,43],[29,45,29,49],[30,3,30,7],[30,9,30,13],[30,15,30,19],[30,21,30,25],[30,27,30,31],[30,33,30,37],[30,39,30,43],[30,45,30,49],[31,3,31,7],[31,9,31,13],[31,15,31,19],[31,21,31,25],[31,27,31,31],[31,33,31,37],[31,39,31,43],[31,45,31,49],[33,0,33,1],[34,0,34,1],[34,3,34,7],[34,9,34,13],[34,15,34,19],[34,21,34,25],[34,27,34,31],[34,33,34,37],[34,39,34,43],[34,45,34,49],[35,0,35,1],[35,3,35,7],[35,9,35,13],[35,15,35,19],[35,21,35,25],[35,27,35,31],[35,33,35,37],[35,39,35,43],[35,45,35,49],[36,0,36,1],[36,3,36,7],[36,9,36,13],[36,15,36,19],[36,21,36,25],[36,27,36,31],[36,33,36,37],[36,39,36,43],[36,45,36,49],[38,0,38,1],[39,0,44,0],[45,0,50,0],[52,0,52,1],[53,0,53,1],[55,0,55,1],[56,0,56,1],[56,3,56,7],[56,9,56,13],[57,0,57,1],[57,3,57,7],[57,9,57,13],[58,0,58,1],[58,3,58,7],[58,9,58,13],[60,0,60,1],[61,0,66,0],[67,0,72,0],[75,0,75,1],[75,3,75,7],[75,9,75,13],[75,15,75,19],[75,21,75,25],[76,0,79,1],[76,3,76,4],[76,5,76,7],[76,9,76,10],[76,11,76,13],[76,15,76,16],[76,17,76,19],[76,21,76,22],[76,23,76,25],[77,3,77,4],[77,5,77,7],[77,9,77,10],[77,11,77,13],[77,15,77,16],[77,17,77,19],[77,21,77,22],[77,23,77,25],[78,3,78,4],[78,5,78,7],[78,9,78,10],[78,11,78,13],[78,15,78,16],[78,17,78,19],[78,21,78,22],[78,23,78,25],[79,5,79,7],[79,11,79,13],[79,17,79,19],[79,23,79,25],[80,0,80,1],[81,0,81,1],[82,0,87,0],[88,0,93,0],[95,0,95,1],[95,3,95,7],[96,0,96,1],[96,3,96,7],[98,0,98,1],[99,0,104,0],[105,0,110,0]]}
[]
["Total Cost of Ownership"]
[]
["Bidder Name:",{"$f":"IF('Annex A Technical req 1'!C4=\"\",\"\",'Annex A Technical req 1'!C4)","v":"hkjg nb"}]
[]
["Overall TCOE",null,null,"Total",null,"Normalized per year under Warranty"]
["Outright purchase",null,null,{"$f":"SUM(D15:AX15)","v":0},null,{"$f":"D15/D$14+J15/J$14+P15/P$14+V15/V$14+AB15/AB$14+AH15/AH$14+AN15/AN$14+AT15/AT$14","v":{"$error":"#VALUE!"}}]
["36 Month Rental",null,null,{"$f":"SUM(D21:AX21)","v":0},null,{"$f":"D21/D$14+J21/J$14+P21/P$14+V21/V$14+AB21/AB$14+AH21/AH$14+AN21/AN$14+AT21/AT$14","v":{"$error":"#VALUE!"}}]
["60 Month Rental",null,null,{"$f":"SUM(D27:AX27)","v":0},null,{"$f":"D27/D$14+J27/J$14+P27/P$14+V27/V$14+AB27/AB$14+AH27/AH$14+AN27/AN$14+AT27/AT$14","v":{"$error":"#VALUE!"}}]
[]
["TCOE per Model",null,null,"Highly Mobile Notebook (Mobile, Connector)",{"$nulls":5},"Traditional Mainstream Notebook  (Connector, Collaborator)",{"$nulls":5},"Modern Mainstream Notebook  (Connector, Collaborator)",{"$nulls":5},"High-End Notebook  (Connector, Collaborator)- 15\" screen",{"$nulls":5},"High-End Notebook (Connector, Collaborator) - 17\" screen",{"$nulls":5},"Traditional Mainstream Desktop (Connector, Collaborator)",{"$nulls":5},"Modern Mainstream Desktop (Connector, Collaborator)",{"$nulls":5},"High-End Desktop with Xeon CPU (Connector, Collaborator)"]
["Make",null,null,{"$f":"D35","v":""},{"$nulls":5},{"$f":"J35","v":""},{"$nulls":5},{"$f":"P35","v":""},{"$nulls":5},{"$f":"V35","v":""},{"$nulls":5},{"$f":"AB35","v":""},{"$nulls":5},{"$f":"AH35","v":""},{"$nulls":5},{"$f":"AN35","v":""},{"$nulls":5},{"$f":"AT35","v":""}]
["Model",null,null,{"$f":"D36","v":""},{"$nulls":5},{"$f":"J36","v":""},{"$nulls":5},{"$f":"P36","v":""},{"$nulls":5},{"$f":"V36","v":""},{"$nulls":5},{"$f":"AB36","v":""},{"$nulls":5},{"$f":"AH36","v":""},{"$nulls":5},{"$f":"AN36","v":""},{"$nulls":5},{"$f":"AT36","v":""}]
["Next Business Day (NBD) Warranty Included",null,null,{"$f":"D37","v":3},{"$nulls":5},{"$f":"J37","v":""},{"$nulls":5},{"$f":"P37","v":""},{"$nulls":5},{"$f":"V37","v":""},{"$nulls":5},{"$f":"AB37","v":""},{"$nulls":5},{"$f":"AH37","v":""},{"$nulls":5},{"$f":"AN37","v":""},{"$nulls":5},{"$f":"AT37","v":""}]
["Outright purchase","Total Cost per Model",null,{"$f":"SUM(D16:H20)","v":0},{"$nulls":5},{"$f":"SUM(J16:N20)","v":0},{"$nulls":5},{"$f":"SUM(P16:T20)","v":0},{"$nulls":5},{"$f":"SUM(V16:Z20)","v":0},{"$nulls":5},{"$f":"SUM(AB16:AF20)","v":0},{"$nulls":5},{"$f":"SUM(AH16:AL20)","v":0},{"$nulls":5},{"$f":"SUM(AN16:AR20)","v":0},{"$nulls":5},{"$f":"SUM(AT16:AX20)","v":0}]
[null,"Notebook/Desktop Cost",null,{"$f":"SUM(D39:H39)","v":0},{"$nulls":5},{"$f":"SUM(J39:N39)","v":0},{"$nulls":5},{"$f":"SUM(P39:T39)","v":0},{"$nulls":5},{"$f":"SUM(V39:Z39)","v":0},{"$nulls":5},{"$f":"SUM(AB39:AF39)","v":0},{"$nulls":5},{"$f":"SUM(AH39:AL39)","v":0},{"$nulls":5},{"$f":"SUM(AN39:AR39)","v":0},{"$nulls":5},{"$f":"SUM(AT39:AX39)","v":0}]
[null,"Docking Station Cost",null,{"$f":"$J$61*Lookups!$J$3/5+$K$61*Lookups!$J$3/5+$L$61*Lookups!$J$3/5+$M$61*Lookups!$J$3/5+$N$61*Lookups!$J$3/5","v":0},{"$nulls":5},{"$f":"$D$61*Lookups!$J$4/5+$E$61*Lookups!$J$4/5+$F$61*Lookups!$J$4/5+$G$61*Lookups!$J$4/5+$H$61*Lookups!$J$4/5","v":0},{"$nulls":5},{"$f":"$J$61*Lookups!$J$5/5+$K$61*Lookups!$J$5/5+$L$61*Lookups!$J$5/5+$M$61*Lookups!$J$5/5+$N$61*Lookups!$J$5/5","v":0},{"$nulls":5},{"$f":"$J$61*Lookups!$J$6/5+$K$61*Lookups!$J$6/5+$L$61*Lookups!$J$6/5+$M$61*Lookups!$J$6/5+$N$61*Lookups!$J$6/5","v":0},{"$nulls":5},{"$f":"$J$61*Lookups!$J$7/5+$K$61*Lookups!$J$7/5+$L$61*Lookups!$J$7/5+$M$61*Lookups!$J$7/5+$N$61*Lookups!$J$7/5","v":0}]
[null,"Display Screen Cost",null,{"$f":"$P$82*Lookups!$J$3/5+$Q$82*Lookups!$J$3/5+$R$82*Lookups!$J$3/5+$S$82*Lookups!$J$3/5+$T$82*Lookups!$J$3/5","v":0},{"$nulls":5},{"$f":"$D$82*Lookups!$J$4/5+$E$82*Lookups!$J$4/5+$F$82*Lookups!$J$4/5+$G$82*Lookups!$J$4/5+$H$82*Lookups!$J$4/5","v":0},{"$nulls":5},{"$f":"$P$82*Lookups!$J$5/5+$Q$82*Lookups!$J$5/5+$R$82*Lookups!$J$5/5+$S$82*Lookups!$J$5/5+$T$82*Lookups!$J$5/5","v":0},{"$nulls":5},{"$f":"$P$82*Lookups!$J$6/5+$Q$82*Lookups!$J$6/5+$R$82*Lookups!$J$6/5+$S$82*Lookups!$J$6/5+$T$82*Lookups!$J$6/5","v":0},{"$nulls":5},{"$f":"$P$82*Lookups!$J$7/5+$Q$82*Lookups!$J$7/5+$R$82*Lookups!$J$7/5+$S$82*Lookups!$J$7/5+$T$82*Lookups!$J$7/5","v":0},{"$nulls":5},{"$f":"$J$82*Lookups!$J$8/5+$K$82*Lookups!$J$8/5+$L$82*Lookups!$J$8/5+$M$82*Lookups!$J$8/5+$N$82*Lookups!$J$8/5","v":0},{"$nulls":5},{"$f":"$P$82*Lookups!$J$9/5+$Q$82*Lookups!$J$9/5+$R$82*Lookups!$J$9/5+$S$82*Lookups!$J$9/5+$T$82*Lookups!$J$9/5","v":0},{"$nulls":5},{"$f":"$V$82*Lookups!$J$10/5+$W$82*Lookups!$J$10/5+$X$82*Lookups!$J$10/5+$Y$82*Lookups!$J$10/5+$Z$82*Lookups!$J$10/5","v":0}]
[null,"Keyboard and Mouse Cost",null,{"$f":"$D$99*Lookups!$J$3/5+$E$99*Lookups!$J$3/5+$F$99*Lookups!$J$3/5+$G$99*Lookups!$J$3/5+$H$99*Lookups!$J$3/5","v":0},{"$nulls":5},{"$f":"$D$99*Lookups!$J$3/5+$E$99*Lookups!$J$3/5+$F$99*Lookups!$J$3/5+$G$99*Lookups!$J$3/5+$H$99*Lookups!$J$3/5","v":0},{"$nulls":5},{"$f":"$D$99*Lookups!$J$5/5+$E$99*Lookups!$J$5/5+$F$99*Lookups!$J$5/5+$G$99*Lookups!$J$5/5+$H$99*Lookups!$J$5/5","v":0},{"$nulls":5},{"$f":"$D$99*Lookups!$J$6/5+$E$99*Lookups!$J$6/5+$F$99*Lookups!$J$6/5+$G$99*Lookups!$J$6/5+$H$99*Lookups!$J$6/5","v":0},{"$nulls":5},{"$f":"$D$99*Lookups!$J$7/5+$E$99*Lookups!$J$7/5+$F$99*Lookups!$J$7/5+$G$99*Lookups!$J$7/5+$H$99*Lookups!$J$7/5","v":0},{"$nulls":5},{"$f":"$D$99*Lookups!$J$8/5+$E$99*Lookups!$J$8/5+$F$99*Lookups!$J$8/5+$G$99*Lookups!$J$8/5+$H$99*Lookups!$J$8/5","v":0},{"$nulls":5},{"$f":"$D$99*Lookups!$J$9/5+$E$99*Lookups!$J$9/5+$F$99*Lookups!$J$9/5+$G$99*Lookups!$J$9/5+$H$99*Lookups!$J$9/5","v":0},{"$nulls":5},{"$f":"$D$99*Lookups!$J$10/5+$E$99*Lookups!$J$10/5+$F$99*Lookups!$J$10/5+$G$99*Lookups!$J$10/5+$H$99*Lookups!$J$10/5","v":0}]
[null,"Out-of-Warranty Repair Cost",null,{"$f":"SUM(D$53:H$54)","v":0},{"$nulls":5},{"$f":"SUM(J$53:N$54)","v":0},{"$nulls":5},{"$f":"SUM(P$53:T$54)","v":0},{"$nulls":5},{"$f":"SUM(V$53:Z$54)","v":0},{"$nulls":5},{"$f":"SUM(AB$53:AF$54)","v":0},{"$nulls":5},{"$f":"SUM(AH$53:AL$54)","v":0},{"$nulls":5},{"$f":"SUM(AN$53:AR$54)","v":0},{"$nulls":5},{"$f":"SUM(AT$53:AX$54)","v":0}]
["36 Month Rental","Total Cost per Model",null,{"$f":"SUM(D22:H26)","v":0},{"$nulls":5},{"$f":"SUM(J22:N26)","v":0},{"$nulls":5},{"$f":"SUM(P22:T26)","v":0},{"$nulls":5},{"$f":"SUM(V22:Z26)","v":0},{"$nulls":5},{"$f":"SUM(AB22:AF26)","v":0},{"$nulls":5},{"$f":"SUM(AH22:AL26)","v":0},{"$nulls":5},{"$f":"SUM(AN22:AR26)","v":0},{"$nulls":5},{"$f":"SUM(AT22:AX26)","v":0}]
[null,"Notebook/Desktop Cost",null,{"$f":"SUM(D40:H40)","v":0},{"$nulls":5},{"$f":"SUM(J40:N40)","v":0},{"$nulls":5},{"$f":"SUM(P40:T40)","v":0},{"$nulls":5},{"$f":"SUM(V40:Z40)","v":0},{"$nulls":5},{"$f":"SUM(AB40:AF40)","v":0},{"$nulls":5},{"$f":"SUM(AH40:AL40)","v":0},{"$nulls":5},{"$f":"SUM(AN40:AR40)","v":0},{"$nulls":5},{"$f":"SUM(AT40:AX40)","v":0}]
[null,"Docking Station Cost",null,{"$f":"$J$62*Lookups!$J$3/5+$K$62*Lookups!$J$3/5+$L$62*Lookups!$J$3/5+$M$62*Lookups!$J$3/5+$N$62*Lookups!$J$3/5","v":0},{"$nulls":5},{"$f":"$D$62*Lookups!$J$4/5+$E$62*Lookups!$J$4/5+$F$62*Lookups!$J$4/5+$G$62*Lookups!$J$4/5+$H$62*Lookups!$J$4/5","v":0},{"$nulls":5},{"$f":"$J$62*Lookups!$J$5/5+$K$62*Lookups!$J$5/5+$L$62*Lookups!$J$5/5+$M$62*Lookups!$J$5/5+$N$62*Lookups!$J$5/5","v":0},{"$nulls":5},{"$f":"$J$62*Lookups!$J$6/5+$K$62*Lookups!$J$6/5+$L$62*Lookups!$J$6/5+$M$62*Lookups!$J$6/5+$N$62*Lookups!$J$6/5","v":0},{"$nulls":5},{"$f":"$J$62*Lookups!$J$7/5+$K$62*Lookups!$J$7/5+$L$62*Lookups!$J$7/5+$M$62*Lookups!$J$7/5+$N$62*Lookups!$J$7/5","v":0}]
[null,"Display Screen Cost",null,{"$f":"$P$83*Lookups!$J$3/5+$Q$83*Lookups!$J$3/5+$R$83*Lookups!$J$3/5+$S$83*Lookups!$J$3/5+$T$83*Lookups!$J$3/5","v":0},{"$nulls":5},{"$f":"$D$83*Lookups!$J$4/5+$E$83*Lookups!$J$4/5+$F$83*Lookups!$J$4/5+$G$83*Lookups!$J$4/5+$H$83*Lookups!$J$4/5","v":0},{"$nulls":5},{"$f":"$P$83*Lookups!$J$5/5+$Q$83*Lookups!$J$5/5+$R$83*Lookups!$J$5/5+$S$83*Lookups!$J$5/5+$T$83*Lookups!$J$5/5","v":0},{"$nulls":5},{"$f":"$P$83*Lookups!$J$6/5+$Q$83*Lookups!$J$6/5+$R$83*Lookups!$J$6/5+$S$83*Lookups!$J$6/5+$T$83*Lookups!$J$6/5","v":0},{"$nulls":5},{"$f":"$P$83*Lookups!$J$7/5+$Q$83*Lookups!$J$7/5+$R$83*Lookups!$J$7/5+$S$83*Lookups!$J$7/5+$T$83*Lookups!$J$7/5","v":0},{"$nulls":5},{"$f":"$J$83*Lookups!$J$8/5+$K$83*Lookups!$J$8/5+$L$83*Lookups!$J$8/5+$M$83*Lookups!$J$8/5+$N$83*Lookups!$J$8/5","v":0},{"$nulls":5},{"$f":"$P$83*Lookups!$J$9/5+$Q$83*Lookups!$J$9/5+$R$83*Lookups!$J$9/5+$S$83*Lookups!$J$9/5+$T$83*Lookups!$J$9/5","v":0},{"$nulls":5},{"$f":"$V$83*Lookups!$J$10/5+$W$83*Lookups!$J$10/5+$X$83*Lookups!$J$10/5+$Y$83*Lookups!$J$10/5+$Z$83*Lookups!$J$10/5","v":0}]
[null,"Keyboard and Mouse Cost",null,{"$f":"$D$100*Lookups!$J$3/5+$E$100*Lookups!$J$3/5+$F$100*Lookups!$J$3/5+$G$100*Lookups!$J$3/5+$H$100*Lookups!$J$3/5","v":0},{"$nulls":5},{"$f":"$D$100*Lookups!$J$3/5+$E$100*Lookups!$J$3/5+$F$100*Lookups!$J$3/5+$G$100*Lookups!$J$3/5+$H$100*Lookups!$J$3/5","v":0},{"$nulls":5},{"$f":"$D$100*Lookups!$J$5/5+$E$100*Lookups!$J$5/5+$F$100*Lookups!$J$5/5+$G$100*Lookups!$J$5/5+$H$100*Lookups!$J$5/5","v":0},{"$nulls":5},{"$f":"$D$100*Lookups!$J$6/5+$E$100*Lookups!$J$6/5+$F$100*Lookups!$J$6/5+$G$100*Lookups!$J$6/5+$H$100*Lookups!$J$6/5","v":0},{"$nulls":5},{"$f":"$D$100*Lookups!$J$7/5+$E$100*Lookups!$J$7/5+$F$100*Lookups!$J$7/5+$G$100*Lookups!$J$7/5+$H$100*Lookups!$J$7/5","v":0},{"$nulls":5},{"$f":"$D$100*Lookups!$J$8/5+$E$100*Lookups!$J$8/5+$F$100*Lookups!$J$8/5+$G$100*Lookups!$J$8/5+$H$100*Lookups!$J$8/5","v":0},{"$nulls":5},{"$f":"$D$100*Lookups!$J$9/5+$E$100*Lookups!$J$9/5+$F$100*Lookups!$J$9/5+$G$100*Lookups!$J$9/5+$H$100*Lookups!$J$9/5","v":0},{"$nulls":5},{"$f":"$D$100*Lookups!$J$10/5+$E$100*Lookups!$J$10/5+$F$100*Lookups!$J$10/5+$G$100*Lookups!$J$10/5+$H$100*Lookups!$J$10/5","v":0}]
[null,"Out-of-Warranty Repair Cost",null,{"$f":"SUM(D$53:H$54)","v":0},{"$nulls":5},{"$f":"SUM(J$53:N$54)","v":0},{"$nulls":5},{"$f":"SUM(P$53:T$54)","v":0},{"$nulls":5},{"$f":"SUM(V$53:Z$54)","v":0},{"$nulls":5},{"$f":"SUM(AB$53:AF$54)","v":0},{"$nulls":5},{"$f":"SUM(AH$53:AL$54)","v":0},{"$nulls":5},{"$f":"SUM(AN$53:AR$54)","v":0},{"$nulls":5},{"$f":"SUM(AT$53:AX$54)","v":0}]
["60 Month Rental","Total Cost per Model",null,{"$f":"SUM(D28:H32)","v":0},{"$nulls":5},{"$f":"SUM(J28:N32)","v":0},{"$nulls":5},{"$f":"SUM(P28:T32)","v":0},{"$nulls":5},{"$f":"SUM(V28:Z32)","v":0},{"$nulls":5},{"$f":"SUM(AB28:AF32)","v":0},{"$nulls":5},{"$f":"SUM(AH28:AL32)","v":0},{"$nulls":5},{"$f":"SUM(AN28:AR32)","v":0},{"$nulls":5},{"$f":"SUM(AT28:AX32)","v":0}]
[null,"Notebook/Desktop Cost",null,{"$f":"SUM(D46:H46)","v":0},{"$nulls":5},{"$f":"SUM(J46:N46)","v":0},{"$nulls":5},{"$f":"SUM(P46:T46)","v":0},{"$nulls":5},{"$f":"SUM(V46:Z46)","v":0},{"$nulls":5},{"$f":"SUM(AB46:AF46)","v":0},{"$nulls":5},{"$f":"SUM(AH46:AL46)","v":0},{"$nulls":5},{"$f":"SUM(AN46:AR46)","v":0},{"$nulls":5},{"$f":"SUM(AT46:AX46)","v":0}]
[null,"Docking Station Cost",null,{"$f":"$J$68*Lookups!$J$3/5+$K$68*Lookups!$J$3/5+$L$68*Lookups!$J$3/5+$M$68*Lookups!$J$3/5+$N$68*Lookups!$J$3/5","v":0},{"$nulls":5},{"$f":"$D$68*Lookups!$J$4/5+$E$68*Lookups!$J$4/5+$F$68*Lookups!$J$4/5+$G$68*Lookups!$J$4/5+$H$68*Lookups!$J$4/5","v":0},{"$nulls":5},{"$f":"$J$68*Lookups!$J$5/5+$K$68*Lookups!$J$5/5+$L$68*Lookups!$J$5/5+$M$68*Lookups!$J$5/5+$N$68*Lookups!$J$5/5","v":0},{"$nulls":5},{"$f":"$J$68*Lookups!$J$6/5+$K$68*Lookups!$J$6/5+$L$68*Lookups!$J$6/5+$M$68*Lookups!$J$6/5+$N$68*Lookups!$J$6/5","v":0},{"$nulls":5},{"$f":"$J$61*Lookups!$J$7/5+$K$61*Lookups!$J$7/5+$L$61*Lookups!$J$7/5+$M$61*Lookups!$J$7/5+$N$61*Lookups!$J$7/5","v":0}]
[null,"Display Screen Cost",null,{"$f":"$P$89*Lookups!$J$3/5+$Q$89*Lookups!$J$3/5+$R$89*Lookups!$J$3/5+$S$89*Lookups!$J$3/5+$T$89*Lookups!$J$3/5","v":0},{"$nulls":5},{"$f":"$D$89*Lookups!$J$4/5+$E$89*Lookups!$J$4/5+$F$89*Lookups!$J$4/5+$G$89*Lookups!$J$4/5+$H$89*Lookups!$J$4/5","v":0},{"$nulls":5},{"$f":"$P$89*Lookups!$J$5/5+$Q$89*Lookups!$J$5/5+$R$89*Lookups!$J$5/5+$S$89*Lookups!$J$5/5+$T$89*Lookups!$J$5/5","v":0},{"$nulls":5},{"$f":"$P$89*Lookups!$J$6/5+$Q$89*Lookups!$J$6/5+$R$89*Lookups!$J$6/5+$S$89*Lookups!$J$6/5+$T$89*Lookups!$J$6/5","v":0},{"$nulls":5},{"$f":"$P$89*Lookups!$J$7/5+$Q$89*Lookups!$J$7/5+$R$89*Lookups!$J$7/5+$S$89*Lookups!$J$7/5+$T$89*Lookups!$J$7/5","v":0},{"$nulls":5},{"$f":"$J$89*Lookups!$J$8/5+$K$89*Lookups!$J$8/5+$L$89*Lookups!$J$8/5+$M$89*Lookups!$J$8/5+$N$89*Lookups!$J$8/5","v":0},{"$nulls":5},{"$f":"$P$89*Lookups!$J$9/5+$Q$89*Lookups!$J$9/5+$R$89*Lookups!$J$9/5+$S$89*Lookups!$J$9/5+$T$89*Lookups!$J$9/5","v":0},{"$nulls":5},{"$f":"$V$89*Lookups!$J$10/5+$W$89*Lookups!$J$10/5+$X$89*Lookups!$J$10/5+$Y$89*Lookups!$J$10/5+$Z$89*Lookups!$J$10/5","v":0}]
[null,"Keyboard and Mouse Cost",null,{"$f":"$D$106*Lookups!$J$3/5+$E$106*Lookups!$J$3/5+$F$106*Lookups!$J$3/5+$G$106*Lookups!$J$3/5+$H$106*Lookups!$J$3/5","v":0},{"$nulls":5},{"$f":"$D$106*Lookups!$J$3/5+$E$106*Lookups!$J$3/5+$F$106*Lookups!$J$3/5+$G$106*Lookups!$J$3/5+$H$106*Lookups!$J$3/5","v":0},{"$nulls":5},{"$f":"$D$106*Lookups!$J$5/5+$E$106*Lookups!$J$5/5+$F$106*Lookups!$J$5/5+$G$106*Lookups!$J$5/5+$H$106*Lookups!$J$5/5","v":0},{"$nulls":5},{"$f":"$D$106*Lookups!$J$6/5+$E$106*Lookups!$J$6/5+$F$106*Lookups!$J$6/5+$G$106*Lookups!$J$6/5+$H$106*Lookups!$J$6/5","v":0},{"$nulls":5},{"$f":"$D$106*Lookups!$J$7/5+$E$106*Lookups!$J$7/5+$F$106*Lookups!$J$7/5+$G$106*Lookups!$J$7/5+$H$106*Lookups!$J$7/5","v":0},{"$nulls":5},{"$f":"$D$106*Lookups!$J$8/5+$E$106*Lookups!$J$8/5+$F$106*Lookups!$J$8/5+$G$106*Lookups!$J$8/5+$H$106*Lookups!$J$8/5","v":0},{"$nulls":5},{"$f":"$D$106*Lookups!$J$9/5+$E$106*Lookups!$J$9/5+$F$106*Lookups!$J$9/5+$G$106*Lookups!$J$9/5+$H$106*Lookups!$J$9/5","v":0},{"$nulls":5},{"$f":"$D$106*Lookups!$J$10/5+$E$106*Lookups!$J$10/5+$F$106*Lookups!$J$10/5+$G$106*Lookups!$J$10/5+$H$106*Lookups!$J$10/5","v":0}]
[null,"Out-of-Warranty Repair Cost",null,{"$f":"SUM(D$53:H$54)","v":0},{"$nulls":5},{"$f":"SUM(J$53:N$54)","v":0},{"$nulls":5},{"$f":"SUM(P$53:T$54)","v":0},{"$nulls":5},{"$f":"SUM(V$53:Z$54)","v":0},{"$nulls":5},{"$f":"SUM(AB$53:AF$54)","v":0},{"$nulls":5},{"$f":"SUM(AH$53:AL$54)","v":0},{"$nulls":5},{"$f":"SUM(AN$53:AR$54)","v":0},{"$nulls":5},{"$f":"SUM(AT$53:AX$54)","v":0}]
[]
["Annual Cost per Notebook/Desktop",null,null,"Highly Mobile Notebook (Mobile, Connector)",{"$nulls":5},"Traditional Mainstream Notebook  (Connector, Collaborator)",{"$nulls":5},"Modern Mainstream Notebook  (Connector, Collaborator)",{"$nulls":5},"High-End Notebook  (Connector, Collaborator)- 15\" screen",{"$nulls":5},"High-End Notebook (Connector, Collaborator) - 17\" screen",{"$nulls":5},"Traditional Mainstream Desktop (Connector, Collaborator)",{"$nulls":5},"Modern Mainstream Desktop (Connector, Collaborator)",{"$nulls":5},"High-End Desktop with Xeon CPU (Connector, Collaborator)"]
["Make",null,null,{"$f":"IF('Annex A Technical req 1'!G$19=\"\",\"\",'Annex A Technical req 1'!G$19)","v":""},{"$nulls":5},{"$f":"IF('Annex A Technical req 1'!L$19=\"\",\"\",'Annex A Technical req 1'!L$19)","v":""},{"$nulls":5},{"$f":"IF('Annex A Technical req 1'!Q$19=\"\",\"\",'Annex A Technical req 1'!Q$19)","v":""},{"$nulls":5},{"$f":"IF('Annex A Technical req 1'!V$19=\"\",\"\",'Annex A Technical req 1'!V$19)","v":""},{"$nulls":5},{"$f":"IF('Annex A Technical req 1'!AA$19=\"\",\"\",'Annex A Technical req 1'!AA$19)","v":""},{"$nulls":5},{"$f":"IF('Annex A Technical req 1'!AK$19=\"\",\"\",'Annex A Technical req 1'!AK$19)","v":""},{"$nulls":5},{"$f":"IF('Annex A Technical req 1'!AP$19=\"\",\"\",'Annex A Technical req 1'!AP$19)","v":""},{"$nulls":5},{"$f":"IF('Annex A Technical req 1'!AU$19=\"\",\"\",'Annex A Technical req 1'!AU$19)","v":""}]
["Model",null,null,{"$f":"IF('Annex A Technical req 1'!G$20=\"\",\"\",'Annex A Technical req 1'!G$20)","v":""},{"$nulls":5},{"$f":"IF('Annex A Technical req 1'!L$20=\"\",\"\",'Annex A Technical req 1'!L$20)","v":""},{"$nulls":5},{"$f":"IF('Annex A Technical req 1'!Q$20=\"\",\"\",'Annex A Technical req 1'!Q$20)","v":""},{"$nulls":5},{"$f":"IF('Annex A Technical req 1'!V$20=\"\",\"\",'Annex A Technical req 1'!V$20)","v":""},{"$nulls":5},{"$f":"IF('Annex A Technical req 1'!AA$20=\"\",\"\",'Annex A Technical req 1'!AA$20)","v":""},{"$nulls":5},{"$f":"IF('Annex A Technical req 1'!AK$20=\"\",\"\",'Annex A Technical req 1'!AK$20)","v":""},{"$nulls":5},{"$f":"IF('Annex A Technical req 1'!AP$20=\"\",\"\",'Annex A Technical req 1'!AP$20)","v":""},{"$nulls":5},{"$f":"IF('Annex A Technical req 1'!AU$20=\"\",\"\",'Annex A Technical req 1'!AU$20)","v":""}]
["Next Business Day (NBD) Warranty Included",null,null,3,{"$nulls":5},{"$f":"IF('Annex A Technical req 1'!M$88=\"\",\"\",'Annex A Technical req 1'!M$88)","v":""},{"$nulls":5},{"$f":"IF('Annex A Technical req 1'!R$88=\"\",\"\",'Annex A Technical req 1'!R$88)","v":""},{"$nulls":5},{"$f":"IF('Annex A Technical req 1'!W$88=\"\",\"\",'Annex A Technical req 1'!W$88)","v":""},{"$nulls":5},{"$f":"IF('Annex A Technical req 1'!AB$88=\"\",\"\",'Annex A Technical req 1'!AB$88)","v":""},{"$nulls":5},{"$f":"IF('Annex A Technical req 1'!AL$88=\"\",\"\",'Annex A Technical req 1'!AL$88)","v":""},{"$nulls":5},{"$f":"IF('Annex A Technical req 1'!AQ$88=\"\",\"\",'Annex A Technical req 1'!AQ$88)","v":""},{"$nulls":5},{"$f":"IF('Annex A Technical req 1'!AV$88=\"\",\"\",'Annex A Technical req 1'!AV$88)","v":""}]
[{"$nulls":3},"Year 1","Year 2","Year 3","Year 4","Year 5",null,"Year 1","Year 2","Year 3","Year 4","Year 5",null,"Year 1","Year 2","Year 3","Year 4","Year 5",null,"Year 1","Year 2","Year 3","Year 4","Year 5",null,"Year 1","Year 2","Year 3","Year 4","Year 5",null,"Year 1","Year 2","Year 3","Year 4","Year 5",null,"Year 1","Year 2","Year 3","Year 4","Year 5",null,"Year 1","Year 2","Year 3","Year 4","Year 5"]
["Outright purchase",null,null,{"$f":"'PART 2 Pricing Schedule'!$D10*Lookups!$J$3/5","v":0},{"$f":"D39*(1+'PART 2 Pricing Schedule'!E$12)","v":0},{"$f":"E39*(1+'PART 2 Pricing Schedule'!F$12)","v":0},{"$f":"F39*(1+'PART 2 Pricing Schedule'!G$12)","v":0},{"$f":"G39*(1+'PART 2 Pricing Schedule'!H$12)","v":0},null,{"$f":"'PART 2 Pricing Schedule'!J10*Lookups!$J$4/5","v":0},{"$f":"J39*(1+'PART 2 Pricing Schedule'!K$12)","v":0},{"$f":"K39*(1+'PART 2 Pricing Schedule'!L$12)","v":0},{"$f":"L39*(1+'PART 2 Pricing Schedule'!M$12)","v":0},{"$f":"M39*(1+'PART 2 Pricing Schedule'!N$12)","v":0},null,{"$f":"'PART 2 Pricing Schedule'!P10*Lookups!$J$5/5","v":0},{"$f":"P39*(1+'PART 2 Pricing Schedule'!Q$12)","v":0},{"$f":"Q39*(1+'PART 2 Pricing Schedule'!R$12)","v":0},{"$f":"R39*(1+'PART 2 Pricing Schedule'!S$12)","v":0},{"$f":"S39*(1+'PART 2 Pricing Schedule'!T$12)","v":0},null,{"$f":"'PART 2 Pricing Schedule'!V10*Lookups!$J$6/5","v":0},{"$f":"V39*(1+'PART 2 Pricing Schedule'!W$12)","v":0},{"$f":"W39*(1+'PART 2 Pricing Schedule'!X$12)","v":0},{"$f":"X39*(1+'PART 2 Pricing Schedule'!Y$12)","v":0},{"$f":"Y39*(1+'PART 2 Pricing Schedule'!Z$12)","v":0},null,{"$f":"'PART 2 Pricing Schedule'!AB10*Lookups!$J$7/5","v":0},{"$f":"AB39*(1+'PART 2 Pricing Schedule'!AC$12)","v":0},{"$f":"AC39*(1+'PART 2 Pricing Schedule'!AD$12)","v":0},{"$f":"AD39*(1+'PART 2 Pricing Schedule'!AE$12)","v":0},{"$f":"AE39*(1+'PART 2 Pricing Schedule'!AF$12)","v":0},null,{"$f":"'PART 2 Pricing Schedule'!AH10*Lookups!$J$8/5","v":0},{"$f":"AH39*(1+'PART 2 Pricing Schedule'!AI$12)","v":0},{"$f":"AI39*(1+'PART 2 Pricing Schedule'!AJ$12)","v":0},{"$f":"AJ39*(1+'PART 2 Pricing Schedule'!AK$12)","v":0},{"$f":"AK39*(1+'PART 2 Pricing Schedule'!AL$12)","v":0},null,{"$f":"'PART 2 Pricing Schedule'!AN10*Lookups!$J$9/5","v":0},{"$f":"AN39*(1+'PART 2 Pricing Schedule'!AO$12)","v":0},{"$f":"AO39*(1+'PART 2 Pricing Schedule'!AP$12)","v":0},{"$f":"AP39*(1+'PART 2 Pricing Schedule'!AQ$12)","v":0},{"$f":"AQ39*(1+'PART 2 Pricing Schedule'!AR$12)","v":0},null,{"$f":"'PART 2 Pricing Schedule'!AT10*Lookups!$J$10/5","v":0},{"$f":"AT39*(1+'PART 2 Pricing Schedule'!AU$12)","v":0},{"$f":"AU39*(1+'PART 2 Pricing Schedule'!AV$12)","v":0},{"$f":"AV39*(1+'PART 2 Pricing Schedule'!AW$12)","v":0},{"$f":"AW39*(1+'PART 2 Pricing Schedule'!AX$12)","v":0}]
["36 Month Rental","Total",null,{"$f":"SUM(D41:D45)","v":0},{"$f":"SUM(E41:E45)","v":0},0,0,0,null,{"$f":"SUM(J41:J45)","v":0},{"$f":"SUM(K41:K45)","v":0},{"$f":"SUM(L41:L45)","v":0},{"$f":"SUM(M41:M45)","v":0},{"$f":"SUM(N41:N45)","v":0},null,{"$f":"SUM(P41:P45)","v":0},{"$f":"SUM(Q41:Q45)","v":0},{"$f":"SUM(R41:R45)","v":0},{"$f":"SUM(S41:S45)","v":0},{"$f":"SUM(T41:T45)","v":0},null,{"$f":"SUM(V41:V45)","v":0},{"$f":"SUM(W41:W45)","v":0},{"$f":"SUM(X41:X45)","v":0},{"$f":"SUM(Y41:Y45)","v":0},{"$f":"SUM(Z41:Z45)","v":0},null,{"$f":"SUM(AB41:AB45)","v":0},{"$f":"SUM(AC41:AC45)","v":0},{"$f":"SUM(AD41:AD45)","v":0},{"$f":"SUM(AE41:AE45)","v":0},{"$f":"SUM(AF41:AF45)","v":0},null,{"$f":"SUM(AH41:AH45)","v":0},{"$f":"SUM(AI41:AI45)","v":0},{"$f":"SUM(AJ41:AJ45)","v":0},{"$f":"SUM(AK41:AK45)","v":0},{"$f":"SUM(AL41:AL45)","v":0},null,{"$f":"SUM(AN41:AN45)","v":0},{"$f":"SUM(AO41:AO45)","v":0},{"$f":"SUM(AP41:AP45)","v":0},{"$f":"SUM(AQ41:AQ45)","v":0},{"$f":"SUM(AR41:AR45)","v":0},null,{"$f":"SUM(AT41:AT45)","v":0},{"$f":"SUM(AU41:AU45)","v":0},{"$f":"SUM(AV41:AV45)","v":0},{"$f":"SUM(AW41:AW45)","v":0},{"$f":"SUM(AX41:AX45)","v":0}]
[null,"Year 1 Cost",null,{"$f":"'PART 2 Pricing Schedule'!$D13*Lookups!$J$3/5","v":0},{"$f":"D41","v":0},{"$f":"E41","v":0},{"$nulls":3},{"$f":"'PART 2 Pricing Schedule'!J13*Lookups!$J$4/5","v":0},{"$f":"J41","v":0},{"$f":"K41","v":0},{"$nulls":3},{"$f":"'PART 2 Pricing Schedule'!P13*Lookups!$J$5/5","v":0},{"$f":"P41","v":0},{"$f":"Q41","v":0},{"$nulls":3},{"$f":"'PART 2 Pricing Schedule'!V13*Lookups!$J$6/5","v":0},{"$f":"V41","v":0},{"$f":"W41","v":0},{"$nulls":3},{"$f":"'PART 2 Pricing Schedule'!AB13*Lookups!$J$7/5","v":0},{"$f":"AB41","v":0},{"$f":"AC41","v":0},{"$nulls":3},{"$f":"'PART 2 Pricing Schedule'!AH13*Lookups!$J$8/5","v":0},{"$f":"AH41","v":0},{"$f":"AI41","v":0},{"$nulls":3},{"$f":"'PART 2 Pricing Schedule'!AN13*Lookups!$J$9/5","v":0},{"$f":"AN41","v":0},{"$f":"AO41","v":0},{"$nulls":3},{"$f":"'PART 2 Pricing Schedule'!AT13*Lookups!$J$10/5","v":0},{"$f":"AT41","v":0},{"$f":"AU41","v":0}]
[null,"Year 2 Cost",null,null,{"$f":"D41*(1+'PART 2 Pricing Schedule'!E$15)","v":0},{"$f":"E42","v":0},{"$f":"F42","v":0},{"$nulls":3},{"$f":"J41*(1+'PART 2 Pricing Schedule'!K$15)","v":0},{"$f":"K42","v":0},{"$f":"L42","v":0},{"$nulls":3},{"$f":"P41*(1+'PART 2 Pricing Schedule'!Q$15)","v":0},{"$f":"Q42","v":0},{"$f":"R42","v":0},{"$nulls":3},{"$f":"V41*(1+'PART 2 Pricing Schedule'!W$15)","v":0},{"$f":"W42","v":0},{"$f":"X42","v":0},{"$nulls":3},{"$f":"AB41*(1+'PART 2 Pricing Schedule'!AC$15)","v":0},{"$f":"AC42","v":0},{"$f":"AD42","v":0},{"$nulls":3},{"$f":"AH41*(1+'PART 2 Pricing Schedule'!AI$116)","v":0},{"$f":"AI42","v":0},{"$f":"AJ42","v":0},{"$nulls":3},{"$f":"AN41*(1+'PART 2 Pricing Schedule'!AO$15)","v":0},{"$f":"AO42","v":0},{"$f":"AP42","v":0},{"$nulls":3},{"$f":"AT41*(1+'PART 2 Pricing Schedule'!AU$15)","v":0},{"$f":"AU42","v":0},{"$f":"AV42","v":0}]
[null,"Year 3 Cost",{"$nulls":3},{"$f":"E42*(1+'PART 2 Pricing Schedule'!F$15)","v":0},{"$f":"F43","v":0},{"$f":"G43","v":0},{"$nulls":3},{"$f":"K42*(1+'PART 2 Pricing Schedule'!L$15)","v":0},{"$f":"L43","v":0},{"$f":"M43","v":0},{"$nulls":3},{"$f":"Q42*(1+'PART 2 Pricing Schedule'!R$15)","v":0},{"$f":"R43","v":0},{"$f":"S43","v":0},{"$nulls":3},{"$f":"W42*(1+'PART 2 Pricing Schedule'!X$15)","v":0},{"$f":"X43","v":0},{"$f":"Y43","v":0},{"$nulls":3},{"$f":"AC42*(1+'PART 2 Pricing Schedule'!AD$15)","v":0},{"$f":"AD43","v":0},{"$f":"AE43","v":0},{"$nulls":3},{"$f":"AI42*(1+'PART 2 Pricing Schedule'!AJ$116)","v":0},{"$f":"AJ43","v":0},{"$f":"AK43","v":0},{"$nulls":3},{"$f":"AO42*(1+'PART 2 Pricing Schedule'!AP$15)","v":0},{"$f":"AP43","v":0},{"$f":"AQ43","v":0},{"$nulls":3},{"$f":"AU42*(1+'PART 2 Pricing Schedule'!AV$15)","v":0},{"$f":"AV43","v":0},{"$f":"AW43","v":0}]
[null,"Year 4 Cost",{"$nulls":4},{"$f":"F43*(1+'PART 2 Pricing Schedule'!G$15)","v":0},{"$f":"G44","v":0},{"$nulls":4},{"$f":"L43*(1+'PART 2 Pricing Schedule'!M$15)","v":0},{"$f":"M44","v":0},{"$nulls":4},{"$f":"R43*(1+'PART 2 Pricing Schedule'!S$15)","v":0},{"$f":"S44","v":0},{"$nulls":4},{"$f":"X43*(1+'PART 2 Pricing Schedule'!Y$15)","v":0},{"$f":"Y44","v":0},{"$nulls":4},{"$f":"AD43*(1+'PART 2 Pricing Schedule'!AE$15)","v":0},{"$f":"AE44","v":0},{"$nulls":4},{"$f":"AJ43*(1+'PART 2 Pricing Schedule'!AK$116)","v":0},{"$f":"AK44","v":0},{"$nulls":4},{"$f":"AP43*(1+'PART 2 Pricing Schedule'!AQ$15)","v":0},{"$f":"AQ44","v":0},{"$nulls":4},{"$f":"AV43*(1+'PART 2 Pricing Schedule'!AW$15)","v":0},{"$f":"AW44","v":0}]
[null,"Year 5 Cost",{"$nulls":5},{"$f":"G44*(1+'PART 2 Pricing Schedule'!H$15)","v":0},{"$nulls":5},{"$f":"M44*(1+'PART 2 Pricing Schedule'!N$15)","v":0},{"$nulls":5},{"$f":"S44*(1+'PART 2 Pricing Schedule'!T$15)","v":0},{"$nulls":5},{"$f":"Y44*(1+'PART 2 Pricing Schedule'!Z$15)","v":0},{"$nulls":5},{"$f":"AE44*(1+'PART 2 Pricing Schedule'!AF$15)","v":0},{"$nulls":5},{"$f":"AK44*(1+'PART 2 Pricing Schedule'!AL$116)","v":0},{"$nulls":5},{"$f":"AQ44*(1+'PART 2 Pricing Schedule'!AR$15)","v":0},{"$nulls":5},{"$f":"AW44*(1+'PART 2 Pricing Schedule'!AX$15)","v":0}]
["60 Month Rental","Total",null,{"$f":"SUM(D47:D51)","v":0},{"$f":"SUM(E47:E51)","v":0},{"$f":"SUM(F47:F51)","v":0},{"$f":"SUM(G47:G51)","v":0},{"$f":"SUM(H47:H51)","v":0},null,{"$f":"SUM(J47:J51)","v":0},{"$f":"SUM(K47:K51)","v":0},{"$f":"SUM(L47:L51)","v":0},{"$f":"SUM(M47:M51)","v":0},{"$f":"SUM(N47:N51)","v":0},null,{"$f":"SUM(P47:P51)","v":0},{"$f":"SUM(Q47:Q51)","v":0},{"$f":"SUM(R47:R51)","v":0},{"$f":"SUM(S47:S51)","v":0},{"$f":"SUM(T47:T51)","v":0},null,{"$f":"SUM(V47:V51)","v":0},{"$f":"SUM(W47:W51)","v":0},{"$f":"SUM(X47:X51)","v":0},{"$f":"SUM(Y47:Y51)","v":0},{"$f":"SUM(Z47:Z51)","v":0},null,{"$f":"SUM(AB47:AB51)","v":0},{"$f":"SUM(AC47:AC51)","v":0},{"$f":"SUM(AD47:AD51)","v":0},{"$f":"SUM(AE47:AE51)","v":0},{"$f":"SUM(AF47:AF51)","v":0},null,{"$f":"SUM(AH47:AH51)","v":0},{"$f":"SUM(AI47:AI51)","v":0},{"$f":"SUM(AJ47:AJ51)","v":0},{"$f":"SUM(AK47:AK51)","v":0},{"$f":"SUM(AL47:AL51)","v":0},null,{"$f":"SUM(AN47:AN51)","v":0},{"$f":"SUM(AO47:AO51)","v":0},{"$f":"SUM(AP47:AP51)","v":0},{"$f":"SUM(AQ47:AQ51)","v":0},{"$f":"SUM(AR47:AR51)","v":0},null,{"$f":"SUM(AT47:AT51)","v":0},{"$f":"SUM(AU47:AU51)","v":0},{"$f":"SUM(AV47:AV51)","v":0},{"$f":"SUM(AW47:AW51)","v":0},{"$f":"SUM(AX47:AX51)","v":0}]
[null,"Year 1 Cost",null,{"$f":"'PART 2 Pricing Schedule'!$D16*Lookups!$J$3/5","v":0},{"$f":"D47","v":0},{"$f":"E47","v":0},0,0,null,{"$f":"'PART 2 Pricing Schedule'!J16*Lookups!$J$4/5","v":0},{"$f":"J47","v":0},{"$f":"K47","v":0},0,0,null,{"$f":"'PART 2 Pricing Schedule'!P16*Lookups!$J$5/5","v":0},{"$f":"P47","v":0},{"$f":"Q47","v":0},0,0,null,{"$f":"'PART 2 Pricing Schedule'!V16*Lookups!$J$6/5","v":0},{"$f":"V47","v":0},{"$f":"W47","v":0},0,0,null,{"$f":"'PART 2 Pricing Schedule'!AB16*Lookups!$J$7/5","v":0},{"$f":"AB47","v":0},{"$f":"AC47","v":0},{"$f":"AD47","v":0},{"$f":"AE47","v":0},null,{"$f":"'PART 2 Pricing Schedule'!AH16*Lookups!$J$8/5","v":0},{"$f":"AH47","v":0},{"$f":"AI47","v":0},0,0,null,{"$f":"'PART 2 Pricing Schedule'!AN16*Lookups!$J$9/5","v":0},{"$f":"AN47","v":0},{"$f":"AO47","v":0},0,0,null,{"$f":"'PART 2 Pricing Schedule'!AT16*Lookups!$J$10/5","v":0},{"$f":"AT47","v":0},{"$f":"AU47","v":0},0,0]
[null,"Year 2 Cost",null,null,{"$f":"D47*(1+'PART 2 Pricing Schedule'!E$18)","v":0},0,{"$f":"F48","v":0},{"$f":"G48","v":0},null,null,{"$f":"J47*(1+'PART 2 Pricing Schedule'!K$18)","v":0},0,{"$f":"L48","v":0},0,null,null,{"$f":"P47*(1+'PART 2 Pricing Schedule'!Q$18)","v":0},0,{"$f":"R48","v":0},0,null,null,{"$f":"V47*(1+'PART 2 Pricing Schedule'!W$18)","v":0},0,{"$f":"X48","v":0},{"$f":"Y48","v":0},null,null,{"$f":"AB47*(1+'PART 2 Pricing Schedule'!AC$18)","v":0},0,0,0,null,null,{"$f":"AH47*(1+'PART 2 Pricing Schedule'!AI$18)","v":0},0,{"$f":"AJ48","v":0},0,null,null,{"$f":"AN47*(1+'PART 2 Pricing Schedule'!AO$18)","v":0},0,{"$f":"AP48","v":0},0,null,null,{"$f":"AT47*(1+'PART 2 Pricing Schedule'!AU$18)","v":0},0,{"$f":"AV48","v":0},0]
[null,"Year 3 Cost",{"$nulls":3},{"$f":"E48*(1+'PART 2 Pricing Schedule'!F$18)","v":0},{"$f":"F49","v":0},{"$f":"G49","v":0},{"$nulls":3},{"$f":"K48*(1+'PART 2 Pricing Schedule'!L$18)","v":0},{"$f":"L49","v":0},0,{"$nulls":3},{"$f":"Q48*(1+'PART 2 Pricing Schedule'!R$18)","v":0},{"$f":"R49","v":0},0,{"$nulls":3},{"$f":"W48*(1+'PART 2 Pricing Schedule'!X$18)","v":0},{"$f":"X49","v":0},{"$f":"Y49","v":0},{"$nulls":3},{"$f":"AC48*(1+'PART 2 Pricing Schedule'!AD$18)","v":0},{"$f":"AD49","v":0},0,{"$nulls":3},{"$f":"AI48*(1+'PART 2 Pricing Schedule'!AJ$18)","v":0},{"$f":"AJ49","v":0},0,{"$nulls":3},{"$f":"AO48*(1+'PART 2 Pricing Schedule'!AP$18)","v":0},{"$f":"AP49","v":0},0,{"$nulls":3},{"$f":"AU48*(1+'PART 2 Pricing Schedule'!AV$18)","v":0},{"$f":"AV49","v":0},0]
[null,"Year 4 Cost",{"$nulls":4},{"$f":"F49*(1+'PART 2 Pricing Schedule'!G$18)","v":0},{"$f":"G50","v":0},{"$nulls":4},{"$f":"L49*(1+'PART 2 Pricing Schedule'!M$18)","v":0},{"$f":"M50","v":0},{"$nulls":4},{"$f":"R49*(1+'PART 2 Pricing Schedule'!S$18)","v":0},{"$f":"S50","v":0},{"$nulls":4},{"$f":"X49*(1+'PART 2 Pricing Schedule'!Y$18)","v":0},{"$f":"Y50","v":0},{"$nulls":4},{"$f":"AD49*(1+'PART 2 Pricing Schedule'!AE$18)","v":0},{"$f":"AE50","v":0},{"$nulls":4},{"$f":"AJ49*(1+'PART 2 Pricing Schedule'!AK$18)","v":0},{"$f":"AK50","v":0},{"$nulls":4},{"$f":"AP49*(1+'PART 2 Pricing Schedule'!AQ$18)","v":0},{"$f":"AQ50","v":0},{"$nulls":4},{"$f":"AV49*(1+'PART 2 Pricing Schedule'!AW$18)","v":0},{"$f":"AW50","v":0}]
[null,"Year 5 Cost",{"$nulls":5},{"$f":"G50*(1+'PART 2 Pricing Schedule'!H$18)","v":0},{"$nulls":5},{"$f":"M50*(1+'PART 2 Pricing Schedule'!N$18)","v":0},{"$nulls":5},{"$f":"S50*(1+'PART 2 Pricing Schedule'!T$18)","v":0},{"$nulls":5},{"$f":"Y50*(1+'PART 2 Pricing Schedule'!Z$18)","v":0},{"$nulls":5},{"$f":"AE50*(1+'PART 2 Pricing Schedule'!AF$18)","v":0},{"$nulls":5},{"$f":"AK50*(1+'PART 2 Pricing Schedule'!AL$18)","v":0},{"$nulls":5},{"$f":"AQ50*(1+'PART 2 Pricing Schedule'!AR$18)","v":0},{"$nulls":5},{"$f":"AW50*(1+'PART 2 Pricing Schedule'!AX$18)","v":0}]
[]
["Average out-of-warranty replacement costs for desktops/notebooks",null,null,{"$f":"IF(1<=D$37,0,'PART 2 Pricing Schedule'!D34*(Lookups!$J$3/100))","v":0},{"$f":"IF(2<=D$37,0,'PART 2 Pricing Schedule'!$D34*(Lookups!$J$3/100))*(1+'PART 2 Pricing Schedule'!E37)","v":0},{"$f":"IF(3<=D37,0,'PART 2 Pricing Schedule'!D34*(Lookups!$J$3/100))*(1+'PART 2 Pricing Schedule'!E37)*(1+'PART 2 Pricing Schedule'!F37)","v":0},{"$f":"IF(4<=D37,0,'PART 2 Pricing Schedule'!D34*(Lookups!$J$3/100))*(1+'PART 2 Pricing Schedule'!E37)*(1+'PART 2 Pricing Schedule'!F37)*(1+'PART 2 Pricing Schedule'!G37)","v":0},{"$f":"IF(5<=D37,0,'PART 2 Pricing Schedule'!D34*(Lookups!$J$3/100))*(1+'PART 2 Pricing Schedule'!E37)*(1+'PART 2 Pricing Schedule'!F37)*(1+'PART 2 Pricing Schedule'!G37)*(1+'PART 2 Pricing Schedule'!H37)","v":0},null,{"$f":"IF(1<=J$37,0,'PART 2 Pricing Schedule'!J34*(Lookups!$J$4/100))","v":0},{"$f":"IF(2<=J$37,0,'PART 2 Pricing Schedule'!$D34*(Lookups!$J$4/100))*(1+'PART 2 Pricing Schedule'!K37)","v":0},{"$f":"IF(3<=J37,0,'PART 2 Pricing Schedule'!J34*(Lookups!$J$4/100))*(1+'PART 2 Pricing Schedule'!K37)*(1+'PART 2 Pricing Schedule'!L37)","v":0},{"$f":"IF(4<=J37,0,'PART 2 Pricing Schedule'!J34*(Lookups!$J$4/100))*(1+'PART 2 Pricing Schedule'!K37)*(1+'PART 2 Pricing Schedule'!L37)*(1+'PART 2 Pricing Schedule'!M37)","v":0},{"$f":"IF(5<=J37,0,'PART 2 Pricing Schedule'!J34*(Lookups!$J$4/100))*(1+'PART 2 Pricing Schedule'!K37)*(1+'PART 2 Pricing Schedule'!L37)*(1+'PART 2 Pricing Schedule'!M37)*(1+'PART 2 Pricing Schedule'!N37)","v":0},null,{"$f":"IF(1<=P$37,0,'PART 2 Pricing Schedule'!P34*(Lookups!$J$5/100))","v":0},{"$f":"IF(2<=P$37,0,'PART 2 Pricing Schedule'!$D34*(Lookups!$J$5/100))*(1+'PART 2 Pricing Schedule'!Q37)","v":0},{"$f":"IF(3<=P37,0,'PART 2 Pricing Schedule'!P34*(Lookups!$J$5/100))*(1+'PART 2 Pricing Schedule'!Q37)*(1+'PART 2 Pricing Schedule'!R37)","v":0},{"$f":"IF(4<=P37,0,'PART 2 Pricing Schedule'!P34*(Lookups!$J$5/100))*(1+'PART 2 Pricing Schedule'!Q37)*(1+'PART 2 Pricing Schedule'!R37)*(1+'PART 2 Pricing Schedule'!S37)","v":0},{"$f":"IF(5<=P37,0,'PART 2 Pricing Schedule'!P34*(Lookups!$J$5/100))*(1+'PART 2 Pricing Schedule'!Q37)*(1+'PART 2 Pricing Schedule'!R37)*(1+'PART 2 Pricing Schedule'!S37)*(1+'PART 2 Pricing Schedule'!T37)","v":0},null,{"$f":"IF(1<=V$37,0,'PART 2 Pricing Schedule'!V34*(Lookups!$J$6/100))","v":0},{"$f":"IF(2<=V$37,0,'PART 2 Pricing Schedule'!$D34*(Lookups!$J$6/100))*(1+'PART 2 Pricing Schedule'!W37)","v":0},{"$f":"IF(3<=V37,0,'PART 2 Pricing Schedule'!V34*(Lookups!$J$6/100))*(1+'PART 2 Pricing Schedule'!W37)*(1+'PART 2 Pricing Schedule'!X37)","v":0},{"$f":"IF(4<=V37,0,'PART 2 Pricing Schedule'!V34*(Lookups!$J$6/100))*(1+'PART 2 Pricing Schedule'!W37)*(1+'PART 2 Pricing Schedule'!X37)*(1+'PART 2 Pricing Schedule'!Y37)","v":0},{"$f":"IF(5<=V37,0,'PART 2 Pricing Schedule'!V34*(Lookups!$J$6/100))*(1+'PART 2 Pricing Schedule'!W37)*(1+'PART 2 Pricing Schedule'!X37)*(1+'PART 2 Pricing Schedule'!Y37)*(1+'PART 2 Pricing Schedule'!Z37)","v":0},null,{"$f":"IF(1<=AB$37,0,'PART 2 Pricing Schedule'!AB34*(Lookups!$J$7/100))","v":0},{"$f":"IF(2<=AB$37,0,'PART 2 Pricing Schedule'!$D34*(Lookups!$J$7/100))*(1+'PART 2 Pricing Schedule'!AC37)","v":0},{"$f":"IF(3<=AB37,0,'PART 2 Pricing Schedule'!AB34*(Lookups!$J$7/100))*(1+'PART 2 Pricing Schedule'!AC37)*(1+'PART 2 Pricing Schedule'!AD37)","v":0},{"$f":"IF(4<=AB37,0,'PART 2 Pricing Schedule'!AB34*(Lookups!$J$7/100))*(1+'PART 2 Pricing Schedule'!AC37)*(1+'PART 2 Pricing Schedule'!AD37)*(1+'PART 2 Pricing Schedule'!AE37)","v":0},{"$f":"IF(5<=AB37,0,'PART 2 Pricing Schedule'!AB34*(Lookups!$J$7/100))*(1+'PART 2 Pricing Schedule'!AC37)*(1+'PART 2 Pricing Schedule'!AD37)*(1+'PART 2 Pricing Schedule'!AE37)*(1+'PART 2 Pricing Schedule'!AF37)","v":0},null,{"$f":"IF(1<=AH$37,0,'PART 2 Pricing Schedule'!AH34*(Lookups!$J$8/100))","v":0},{"$f":"IF(2<=AH$37,0,'PART 2 Pricing Schedule'!$D34*(Lookups!$J$8/100))*(1+'PART 2 Pricing Schedule'!AI37)","v":0},{"$f":"IF(3<=AH37,0,'PART 2 Pricing Schedule'!AH34*(Lookups!$J$8/100))*(1+'PART 2 Pricing Schedule'!AI37)*(1+'PART 2 Pricing Schedule'!AJ37)","v":0},{"$f":"IF(4<=AH37,0,'PART 2 Pricing Schedule'!AH34*(Lookups!$J$8/100))*(1+'PART 2 Pricing Schedule'!AI37)*(1+'PART 2 Pricing Schedule'!AJ37)*(1+'PART 2 Pricing Schedule'!AK37)","v":0},{"$f":"IF(5<=AH37,0,'PART 2 Pricing Schedule'!AH34*(Lookups!$J$8/100))*(1+'PART 2 Pricing Schedule'!AI37)*(1+'PART 2 Pricing Schedule'!AJ37)*(1+'PART 2 Pricing Schedule'!AK37)*(1+'PART 2 Pricing Schedule'!AL37)","v":0},null,{"$f":"IF(1<=AN$37,0,'PART 2 Pricing Schedule'!AN34*(Lookups!$J$9/100))","v":0},{"$f":"IF(2<=AN$37,0,'PART 2 Pricing Schedule'!$D34*(Lookups!$J$9/100))*(1+'PART 2 Pricing Schedule'!AO37)","v":0},{"$f":"IF(3<=AN37,0,'PART 2 Pricing Schedule'!AN34*(Lookups!$J$9/100))*(1+'PART 2 Pricing Schedule'!AO37)*(1+'PART 2 Pricing Schedule'!AP37)","v":0},{"$f":"IF(4<=AN37,0,'PART 2 Pricing Schedule'!AN34*(Lookups!$J$9/100))*(1+'PART 2 Pricing Schedule'!AO37)*(1+'PART 2 Pricing Schedule'!AP37)*(1+'PART 2 Pricing Schedule'!AQ37)","v":0},{"$f":"IF(5<=AN37,0,'PART 2 Pricing Schedule'!AN34*(Lookups!$J$9/100))*(1+'PART 2 Pricing Schedule'!AO37)*(1+'PART 2 Pricing Schedule'!AP37)*(1+'PART 2 Pricing Schedule'!AQ37)*(1+'PART 2 Pricing Schedule'!AR37)","v":0},null,{"$f":"IF(1<=AT$37,0,'PART 2 Pricing Schedule'!AT34*(Lookups!$J$10/100))","v":0},{"$f":"IF(2<=AT$37,0,'PART 2 Pricing Schedule'!$D34*(Lookups!$J$10/100))*(1+'PART 2 Pricing Schedule'!AU37)","v":0},{"$f":"IF(3<=AT37,0,'PART 2 Pricing Schedule'!AT34*(Lookups!$J$10/100))*(1+'PART 2 Pricing Schedule'!AU37)*(1+'PART 2 Pricing Schedule'!AV37)","v":0},{"$f":"IF(4<=AT37,0,'PART 2 Pricing Schedule'!AT34*(Lookups!$J$10/100))*(1+'PART 2 Pricing Schedule'!AU37)*(1+'PART 2 Pricing Schedule'!AV37)*(1+'PART 2 Pricing Schedule'!AW37)","v":0},{"$f":"IF(5<=AT37,0,'PART 2 Pricing Schedule'!AT34*(Lookups!$J$10/100))*(1+'PART 2 Pricing Schedule'!AU37)*(1+'PART 2 Pricing Schedule'!AV37)*(1+'PART 2 Pricing Schedule'!AW37)*(1+'PART 2 Pricing Schedule'!AX37)","v":0}]
["Average out-of-warranty replacement costs for docking stations",null,null,{"$f":"IF(1<=D37,0,'PART 2 Pricing Schedule'!D35*Lookups!$J$3/100)","v":0},{"$f":"IF(2<=D37,0,'PART 2 Pricing Schedule'!D35*Lookups!$J$3/100)*(1+'PART 2 Pricing Schedule'!E37)","v":0},{"$f":"IF(3<=D37,0,'PART 2 Pricing Schedule'!D35*Lookups!$J$3/100)*(1+'PART 2 Pricing Schedule'!E37)*(1+'PART 2 Pricing Schedule'!F37)","v":0},{"$f":"IF(4<=D37,0,'PART 2 Pricing Schedule'!D35*Lookups!$J$3/100)*(1+'PART 2 Pricing Schedule'!E37)*(1+'PART 2 Pricing Schedule'!F37)*(1+'PART 2 Pricing Schedule'!G37)","v":0},{"$f":"IF(5<=D37,0,'PART 2 Pricing Schedule'!D35*Lookups!$J$3/100)*(1+'PART 2 Pricing Schedule'!E37)*(1+'PART 2 Pricing Schedule'!F37)*(1+'PART 2 Pricing Schedule'!G37)*(1+'PART 2 Pricing Schedule'!H37)","v":0},null,{"$f":"IF(1<=J37,0,'PART 2 Pricing Schedule'!J35*Lookups!$J$4/100)","v":0},{"$f":"IF(2<=J37,0,'PART 2 Pricing Schedule'!J35*Lookups!$J$4/100)*(1+'PART 2 Pricing Schedule'!K37)","v":0},{"$f":"IF(3<=J37,0,'PART 2 Pricing Schedule'!J35*Lookups!$J$4/100)*(1+'PART 2 Pricing Schedule'!K37)*(1+'PART 2 Pricing Schedule'!L37)","v":0},{"$f":"IF(4<=J37,0,'PART 2 Pricing Schedule'!J35*Lookups!$J$4/100)*(1+'PART 2 Pricing Schedule'!K37)*(1+'PART 2 Pricing Schedule'!L37)*(1+'PART 2 Pricing Schedule'!M37)","v":0},{"$f":"IF(5<=J37,0,'PART 2 Pricing Schedule'!J35*Lookups!$J$4/100)*(1+'PART 2 Pricing Schedule'!K37)*(1+'PART 2 Pricing Schedule'!L37)*(1+'PART 2 Pricing Schedule'!M37)*(1+'PART 2 Pricing Schedule'!N37)","v":0},null,{"$f":"IF(1<=P37,0,'PART 2 Pricing Schedule'!P35*Lookups!$J$5/100)","v":0},{"$f":"IF(2<=P37,0,'PART 2 Pricing Schedule'!P35*Lookups!$J$5/100)*(1+'PART 2 Pricing Schedule'!Q37)","v":0},{"$f":"IF(3<=P37,0,'PART 2 Pricing Schedule'!P35*Lookups!$J$5/100)*(1+'PART 2 Pricing Schedule'!Q37)*(1+'PART 2 Pricing Schedule'!R37)","v":0},{"$f":"IF(4<=P37,0,'PART 2 Pricing Schedule'!P35*Lookups!$J$5/100)*(1+'PART 2 Pricing Schedule'!Q37)*(1+'PART 2 Pricing Schedule'!R37)*(1+'PART 2 Pricing Schedule'!S37)","v":0},{"$f":"IF(5<=P37,0,'PART 2 Pricing Schedule'!P35*Lookups!$J$5/100)*(1+'PART 2 Pricing Schedule'!Q37)*(1+'PART 2 Pricing Schedule'!R37)*(1+'PART 2 Pricing Schedule'!S37)*(1+'PART 2 Pricing Schedule'!T37)","v":0},null,{"$f":"IF(1<=V37,0,'PART 2 Pricing Schedule'!V35*Lookups!$J$6/100)","v":0},{"$f":"IF(2<=V37,0,'PART 2 Pricing Schedule'!V35*Lookups!$J$6/100)*(1+'PART 2 Pricing Schedule'!W37)","v":0},{"$f":"IF(3<=V37,0,'PART 2 Pricing Schedule'!V35*Lookups!$J$6/100)*(1+'PART 2 Pricing Schedule'!W37)*(1+'PART 2 Pricing Schedule'!X37)","v":0},{"$f":"IF(4<=V37,0,'PART 2 Pricing Schedule'!V35*Lookups!$J$6/100)*(1+'PART 2 Pricing Schedule'!W37)*(1+'PART 2 Pricing Schedule'!X37)*(1+'PART 2 Pricing Schedule'!Y37)","v":0},{"$f":"IF(5<=V37,0,'PART 2 Pricing Schedule'!V35*Lookups!$J$6/100)*(1+'PART 2 Pricing Schedule'!W37)*(1+'PART 2 Pricing Schedule'!X37)*(1+'PART 2 Pricing Schedule'!Y37)*(1+'PART 2 Pricing Schedule'!Z37)","v":0},null,{"$f":"IF(1<=AB37,0,'PART 2 Pricing Schedule'!AB35*Lookups!$J$7/100)","v":0},{"$f":"IF(2<=AB37,0,'PART 2 Pricing Schedule'!AB35*Lookups!$J$7/100)*(1+'PART 2 Pricing Schedule'!AC37)","v":0},{"$f":"IF(3<=AB37,0,'PART 2 Pricing Schedule'!AB35*Lookups!$J$7/100)*(1+'PART 2 Pricing Schedule'!AC37)*(1+'PART 2 Pricing Schedule'!AD37)","v":0},{"$f":"IF(4<=AB37,0,'PART 2 Pricing Schedule'!AB35*Lookups!$J$7/100)*(1+'PART 2 Pricing Schedule'!AC37)*(1+'PART 2 Pricing Schedule'!AD37)*(1+'PART 2 Pricing Schedule'!AE37)","v":0},{"$f":"IF(5<=AB37,0,'PART 2 Pricing Schedule'!AB35*Lookups!$J$7/100)*(1+'PART 2 Pricing Schedule'!AC37)*(1+'PART 2 Pricing Schedule'!AD37)*(1+'PART 2 Pricing Schedule'!AE37)*(1+'PART 2 Pricing Schedule'!AF37)","v":0},null,{"$f":"IF(1<=AH37,0,'PART 2 Pricing Schedule'!AH35*Lookups!$J$8/100)","v":0},{"$f":"IF(2<=AH37,0,'PART 2 Pricing Schedule'!AH35*Lookups!$J$8/100)*(1+'PART 2 Pricing Schedule'!AI37)","v":0},{"$f":"IF(3<=AH37,0,'PART 2 Pricing Schedule'!AH35*Lookups!$J$8/100)*(1+'PART 2 Pricing Schedule'!AI37)*(1+'PART 2 Pricing Schedule'!AJ37)","v":0},{"$f":"IF(4<=AH37,0,'PART 2 Pricing Schedule'!AH35*Lookups!$J$8/100)*(1+'PART 2 Pricing Schedule'!AI37)*(1+'PART 2 Pricing Schedule'!AJ37)*(1+'PART 2 Pricing Schedule'!AK37)","v":0},{"$f":"IF(5<=AH37,0,'PART 2 Pricing Schedule'!AH35*Lookups!$J$8/100)*(1+'PART 2 Pricing Schedule'!AI37)*(1+'PART 2 Pricing Schedule'!AJ37)*(1+'PART 2 Pricing Schedule'!AK37)*(1+'PART 2 Pricing Schedule'!AL37)","v":0},null,{"$f":"IF(1<=AN37,0,'PART 2 Pricing Schedule'!AN35*Lookups!$J$9/100)","v":0},{"$f":"IF(2<=AN37,0,'PART 2 Pricing Schedule'!AN35*Lookups!$J$9/100)*(1+'PART 2 Pricing Schedule'!AO37)","v":0},{"$f":"IF(3<=AN37,0,'PART 2 Pricing Schedule'!AN35*Lookups!$J$9/100)*(1+'PART 2 Pricing Schedule'!AO37)*(1+'PART 2 Pricing Schedule'!AP37)","v":0},{"$f":"IF(4<=AN37,0,'PART 2 Pricing Schedule'!AN35*Lookups!$J$9/100)*(1+'PART 2 Pricing Schedule'!AO37)*(1+'PART 2 Pricing Schedule'!AP37)*(1+'PART 2 Pricing Schedule'!AQ37)","v":0},{"$f":"IF(5<=AN37,0,'PART 2 Pricing Schedule'!AN35*Lookups!$J$9/100)*(1+'PART 2 Pricing Schedule'!AO37)*(1+'PART 2 Pricing Schedule'!AP37)*(1+'PART 2 Pricing Schedule'!AQ37)*(1+'PART 2 Pricing Schedule'!AR37)","v":0},null,{"$f":"IF(1<=AT37,0,'PART 2 Pricing Schedule'!AT35*Lookups!$J$10/100)","v":0},{"$f":"IF(2<=AT37,0,'PART 2 Pricing Schedule'!AT35*Lookups!$J$10/100)*(1+'PART 2 Pricing Schedule'!AU37)","v":0},{"$f":"IF(3<=AT37,0,'PART 2 Pricing Schedule'!AT35*Lookups!$J$10/100)*(1+'PART 2 Pricing Schedule'!AU37)*(1+'PART 2 Pricing Schedule'!AV37)","v":0},{"$f":"IF(4<=AT37,0,'PART 2 Pricing Schedule'!AT35*Lookups!$J$10/100)*(1+'PART 2 Pricing Schedule'!AU37)*(1+'PART 2 Pricing Schedule'!AV37)*(1+'PART 2 Pricing Schedule'!AW37)","v":0},{"$f":"IF(5<=AT37,0,'PART 2 Pricing Schedule'!AT35*Lookups!$J$10/100)*(1+'PART 2 Pricing Schedule'!AU37)*(1+'PART 2 Pricing Schedule'!AV37)*(1+'PART 2 Pricing Schedule'!AW37)*(1+'PART 2 Pricing Schedule'!AX37)","v":0}]
[]
["Annual Cost per Docking Station Option",null,null,"Option 1 (Basic)",{"$nulls":5},"Option 2 (Advanced)"]
["Make",null,null,{"$f":"IF('Annex A Technical req 1'!G$110=\"\",\"\",'Annex A Technical req 1'!G$110)","v":""},{"$nulls":5},{"$f":"IF('Annex A Technical req 1'!L$110=\"\",\"\",'Annex A Technical req 1'!L$110)","v":""}]
["Model",null,null,{"$f":"IF('Annex A Technical req 1'!G$111=\"\",\"\",'Annex A Technical req 1'!G$111)","v":""},{"$nulls":5},{"$f":"IF('Annex A Technical req 1'!L$111=\"\",\"\",'Annex A Technical req 1'!L$111)","v":""}]
["Next Business Day (NBD) Warranty Included",null,null,{"$f":"IF('Annex A Technical req 1'!H122=\"\",\"\",'Annex A Technical req 1'!H122)","v":""},{"$nulls":5},{"$f":"IF('Annex A Technical req 1'!M122=\"\",\"\",'Annex A Technical req 1'!M122)","v":""}]
[{"$nulls":3},"Year 1","Year 2","Year 3","Year 4","Year 5",null,"Year 1","Year 2","Year 3","Year 4","Year 5"]
["Outright purchase",null,null,{"$f":"'PART 2 Pricing Schedule'!$D43","v":0},{"$f":"D61*(1+'PART 2 Pricing Schedule'!E$45)","v":0},{"$f":"E61*(1+'PART 2 Pricing Schedule'!F$45)","v":0},{"$f":"F61*(1+'PART 2 Pricing Schedule'!G$45)","v":0},{"$f":"G61*(1+'PART 2 Pricing Schedule'!H$45)","v":0},null,{"$f":"'PART 2 Pricing Schedule'!$J43","v":0},{"$f":"J61*(1+'PART 2 Pricing Schedule'!K$45)","v":0},{"$f":"K61*(1+'PART 2 Pricing Schedule'!L$45)","v":0},{"$f":"L61*(1+'PART 2 Pricing Schedule'!M$45)","v":0},{"$f":"M61*(1+'PART 2 Pricing Schedule'!N$45)","v":0}]
["36 Month Rental","Total",null,{"$f":"SUM(D63:D67)","v":0},{"$f":"SUM(E63:E67)","v":0},{"$f":"SUM(F63:F67)","v":0},{"$f":"SUM(G63:G67)","v":0},{"$f":"SUM(H63:H67)","v":0},null,{"$f":"SUM(J63:J67)","v":0},{"$f":"SUM(K63:K67)","v":0},{"$f":"SUM(L63:L67)","v":0},{"$f":"SUM(M63:M67)","v":0},{"$f":"SUM(N63:N67)","v":0}]
[null,"Year 1 Cost",null,{"$f":"'PART 2 Pricing Schedule'!$D46","v":0},{"$f":"D63","v":0},{"$f":"E63","v":0},{"$nulls":3},{"$f":"'PART 2 Pricing Schedule'!$J46","v":0},{"$f":"J63","v":0},{"$f":"K63","v":0}]
[null,"Year 2 Cost",null,null,{"$f":"D63*(1+'PART 2 Pricing Schedule'!E$48)","v":0},{"$f":"E64","v":0},{"$f":"F64","v":0},{"$nulls":3},{"$f":"J63*(1+'PART 2 Pricing Schedule'!K$48)","v":0},{"$f":"K64","v":0},{"$f":"L64","v":0}]
[null,"Year 3 Cost",{"$nulls":3},{"$f":"E64*(1+'PART 2 Pricing Schedule'!F$48)","v":0},{"$f":"F65","v":0},{"$f":"G65","v":0},{"$nulls":3},{"$f":"K64*(1+'PART 2 Pricing Schedule'!L$48)","v":0},{"$f":"L65","v":0},{"$f":"M65","v":0}]
[null,"Year 4 Cost",{"$nulls":4},{"$f":"F65*(1+'PART 2 Pricing Schedule'!G$48)","v":0},{"$f":"G66","v":0},{"$nulls":4},{"$f":"L65*(1+'PART 2 Pricing Schedule'!M$48)","v":0},{"$f":"M66","v":0}]
[null,"Year 5 Cost",{"$nulls":5},{"$f":"G66*(1+'PART 2 Pricing Schedule'!H$48)","v":0},{"$nulls":5},{"$f":"M66*(1+'PART 2 Pricing Schedule'!N$48)","v":0}]
["60 Month Rental","Total",null,{"$f":"SUM(D69:D73)","v":0},{"$f":"SUM(E69:E73)","v":0},{"$f":"SUM(F69:F73)","v":0},{"$f":"SUM(G69:G73)","v":0},{"$f":"SUM(H69:H73)","v":0},null,{"$f":"SUM(J69:J73)","v":0},{"$f":"SUM(K69:K73)","v":0},{"$f":"SUM(L69:L73)","v":0},{"$f":"SUM(M69:M73)","v":0},{"$f":"SUM(N69:N73)","v":0}]
[null,"Year 1 Cost",null,{"$f":"'PART 2 Pricing Schedule'!$D49","v":0},{"$f":"D69","v":0},{"$f":"E69","v":0},0,0,null,{"$f":"'PART 2 Pricing Schedule'!$J49","v":0},{"$f":"J69","v":0},{"$f":"K69","v":0},0,0]
[null,"Year 2 Cost",null,null,{"$f":"D69*(1+'PART 2 Pricing Schedule'!E$51)","v":0},0,{"$f":"F70","v":0},0,null,null,{"$f":"J69*(1+'PART 2 Pricing Schedule'!K$51)","v":0},0,{"$f":"L70","v":0},0]
[null,"Year 3 Cost",{"$nulls":3},{"$f":"E70*(1+'PART 2 Pricing Schedule'!F$51)","v":0},{"$f":"F71","v":0},0,{"$nulls":3},{"$f":"K70*(1+'PART 2 Pricing Schedule'!L$51)","v":0},{"$f":"L71","v":0},0]
[null,"Year 4 Cost",{"$nulls":4},{"$f":"F71*(1+'PART 2 Pricing Schedule'!G$51)","v":0},{"$f":"G72","v":0},{"$nulls":4},{"$f":"L71*(1+'PART 2 Pricing Schedule'!M$51)","v":0},{"$f":"M72","v":0}]
[null,"Year 5 Cost",{"$nulls":5},{"$f":"G72*(1+'PART 2 Pricing Schedule'!H$51)","v":0},{"$nulls":5},{"$f":"M72*(1+'PART 2 Pricing Schedule'!N$51)","v":0}]
[]
[]
["Annual Screen Cost in ZAR",null,null,"Traditional Mainstream Screen",{"$nulls":5},"Modern Mainstream Screen",{"$nulls":5},"High-End 27\" Screen",{"$nulls":5},"High-End 32\" Screen"]
["Minimum Screen Specification",null,null,"Screen Size - 22\"",null,"Native Resolution - 1920 x 1080",{"$nulls":3},"Screen Size - 24\"",null,"Native Resolution - 1920 x 1080",{"$nulls":3},"Screen Size - 27\"",null,"Native Resolution - 2560 x 1440",{"$nulls":3},"Screen Size - 32\"",null,"Native Resolution - 3840 x 2160"]
[{"$nulls":3},"Brightness - 250 Nits",null,"Refresh Rate at 1920 x 1080 - 60Hz",{"$nulls":3},"SDR IPS LCD Panel",null,"Refresh Rate at 1820 x1080 - 60Hz",{"$nulls":3},"HDR IPS LCD Panel",null,"Refresh Rate at 2560 x 1440 - 75Hz",{"$nulls":3},"HDR IPS LCD Panel",null,"Refresh Rate at 3840 2160 - 100Hz"]
[{"$nulls":3},"SDR VA LCD Panel",null,"Contrast Ratio - 1000:1 to 3000:1",{"$nulls":3},"Brightness - 300 Nits",null,"Contrast Ratio - 1000:1 to 3000:1",{"$nulls":3},"Brightness - 350 Nits",null,"Contrast Ratio - Greater than 3000:1",{"$nulls":3},"Brightness - 350 Nits",null,"Contrast Ratio - Greater than 3000:1"]
[{"$nulls":3},"Warranty",{"$f":"CONCATENATE(TEXT(D58,0),\" Years\")","v":" Years"},"No Blue light Filter or Touch Screen",{"$nulls":3},"Warranty",{"$f":"CONCATENATE(TEXT(D58,0),\" Years\")","v":" Years"},"No Blue light Filter or Touch Screen",{"$nulls":3},"Warranty",{"$f":"CONCATENATE(TEXT(J58,0),\" Years\")","v":" Years"},"No Blue light Filter or Touch Screen",{"$nulls":3},"Warranty",{"$f":"CONCATENATE(TEXT(J58,0),\" Years\")","v":" Years"},"No Blue light Filter or Touch Screen"]
[{"$nulls":3},"Year 1","Year 2","Year 3","Year 4","Year 5",null,"Year 1","Year 2","Year 3","Year 4","Year 5",null,"Year 1","Year 2","Year 3","Year 4","Year 5",null,"Year 1","Year 2","Year 3","Year 4","Year 5"]
["Outright purchase",null,null,{"$f":"'PART 2 Pricing Schedule'!D58","v":0},{"$f":"D82*(1+'PART 2 Pricing Schedule'!E60)","v":0},{"$f":"E82*(1+'PART 2 Pricing Schedule'!F60)","v":0},{"$f":"F82*(1+'PART 2 Pricing Schedule'!G60)","v":0},{"$f":"G82*(1+'PART 2 Pricing Schedule'!H60)","v":0},null,{"$f":"'PART 2 Pricing Schedule'!J58","v":0},{"$f":"J82*(1+'PART 2 Pricing Schedule'!K60)","v":0},{"$f":"K82*(1+'PART 2 Pricing Schedule'!L60)","v":0},{"$f":"L82*(1+'PART 2 Pricing Schedule'!M60)","v":0},{"$f":"M82*(1+'PART 2 Pricing Schedule'!N60)","v":0},null,{"$f":"'PART 2 Pricing Schedule'!P58","v":0},{"$f":"P82*(1+'PART 2 Pricing Schedule'!Q60)","v":0},{"$f":"Q82*(1+'PART 2 Pricing Schedule'!R60)","v":0},{"$f":"R82*(1+'PART 2 Pricing Schedule'!S60)","v":0},{"$f":"S82*(1+'PART 2 Pricing Schedule'!T60)","v":0},null,{"$f":"'PART 2 Pricing Schedule'!V58","v":0},{"$f":"V82*(1+'PART 2 Pricing Schedule'!W60)","v":0},{"$f":"W82*(1+'PART 2 Pricing Schedule'!X60)","v":0},{"$f":"X82*(1+'PART 2 Pricing Schedule'!Y60)","v":0},{"$f":"Y82*(1+'PART 2 Pricing Schedule'!Z60)","v":0}]
["36 Month Rental","Total",null,{"$f":"SUM(D84:D88)","v":0},{"$f":"SUM(E84:E88)","v":0},{"$f":"SUM(F84:F88)","v":0},{"$f":"SUM(G84:G88)","v":0},{"$f":"SUM(H84:H88)","v":0},null,{"$f":"SUM(J84:J88)","v":0},{"$f":"SUM(K84:K88)","v":0},{"$f":"SUM(L84:L88)","v":0},{"$f":"SUM(M84:M88)","v":0},{"$f":"SUM(N84:N88)","v":0},null,{"$f":"SUM(P84:P88)","v":0},{"$f":"SUM(Q84:Q88)","v":0},{"$f":"SUM(R84:R88)","v":0},{"$f":"SUM(S84:S88)","v":0},{"$f":"SUM(T84:T88)","v":0},null,{"$f":"SUM(V84:V88)","v":0},{"$f":"SUM(W84:W88)","v":0},{"$f":"SUM(X84:X88)","v":0},{"$f":"SUM(Y84:Y88)","v":0},{"$f":"SUM(Z84:Z88)","v":0}]
[null,"Year 1 Cost",null,{"$f":"'PART 2 Pricing Schedule'!D61","v":0},{"$f":"D84","v":0},{"$f":"E84","v":0},{"$nulls":3},{"$f":"'PART 2 Pricing Schedule'!J61","v":0},{"$f":"J84","v":0},{"$f":"K84","v":0},{"$nulls":3},{"$f":"'PART 2 Pricing Schedule'!P61","v":0},{"$f":"P84","v":0},{"$f":"Q84","v":0},{"$nulls":3},{"$f":"'PART 2 Pricing Schedule'!V61","v":0},{"$f":"V84","v":0},{"$f":"W84","v":0}]
[null,"Year 2 Cost",null,null,{"$f":"D84*(1+'PART 2 Pricing Schedule'!E67)","v":0},{"$f":"E85","v":0},{"$f":"F85","v":0},{"$nulls":3},{"$f":"J84*(1+'PART 2 Pricing Schedule'!K67)","v":0},{"$f":"K85","v":0},{"$f":"L85","v":0},{"$nulls":3},{"$f":"P84*(1+'PART 2 Pricing Schedule'!Q67)","v":0},{"$f":"Q85","v":0},{"$f":"R85","v":0},{"$nulls":3},{"$f":"V84*(1+'PART 2 Pricing Schedule'!W67)","v":0},{"$f":"W85","v":0},{"$f":"X85","v":0}]
[null,"Year 3 Cost",{"$nulls":3},{"$f":"E85*(1+'PART 2 Pricing Schedule'!F67)","v":0},{"$f":"F86","v":0},{"$f":"G86","v":0},{"$nulls":3},{"$f":"K85*(1+'PART 2 Pricing Schedule'!L67)","v":0},{"$f":"L86","v":0},{"$f":"M86","v":0},{"$nulls":3},{"$f":"Q85*(1+'PART 2 Pricing Schedule'!R67)","v":0},{"$f":"R86","v":0},{"$f":"S86","v":0},{"$nulls":3},{"$f":"W85*(1+'PART 2 Pricing Schedule'!X67)","v":0},{"$f":"X86","v":0},{"$f":"Y86","v":0}]
[null,"Year 4 Cost",{"$nulls":4},{"$f":"F86*(1+'PART 2 Pricing Schedule'!G67)","v":0},{"$f":"G87","v":0},{"$nulls":4},{"$f":"L86*(1+'PART 2 Pricing Schedule'!M67)","v":0},{"$f":"M87","v":0},{"$nulls":4},{"$f":"R86*(1+'PART 2 Pricing Schedule'!S67)","v":0},{"$f":"S87","v":0},{"$nulls":4},{"$f":"X86*(1+'PART 2 Pricing Schedule'!Y67)","v":0},{"$f":"Y87","v":0}]
[null,"Year 5 Cost",{"$nulls":5},{"$f":"G87*(1+'PART 2 Pricing Schedule'!H67)","v":0},{"$nulls":5},{"$f":"M87*(1+'PART 2 Pricing Schedule'!N67)","v":0},{"$nulls":5},{"$f":"S87*(1+'PART 2 Pricing Schedule'!T67)","v":0},{"$nulls":5},{"$f":"Y87*(1+'PART 2 Pricing Schedule'!Z67)","v":0}]
["60 Month Rental","Total",null,{"$f":"SUM(D90:D94)","v":0},{"$f":"SUM(E90:E94)","v":0},{"$f":"SUM(F90:F94)","v":0},{"$f":"SUM(G90:G94)","v":0},{"$f":"SUM(H90:H94)","v":0},null,{"$f":"SUM(J90:J94)","v":0},{"$f":"SUM(K90:K94)","v":0},{"$f":"SUM(L90:L94)","v":0},{"$f":"SUM(M90:M94)","v":0},{"$f":"SUM(N90:N94)","v":0},null,{"$f":"SUM(P90:P94)","v":0},{"$f":"SUM(Q90:Q94)","v":0},{"$f":"SUM(R90:R94)","v":0},{"$f":"SUM(S90:S94)","v":0},{"$f":"SUM(T90:T94)","v":0},null,{"$f":"SUM(V90:V94)","v":0},{"$f":"SUM(W90:W94)","v":0},{"$f":"SUM(X90:X94)","v":0},{"$f":"SUM(Y90:Y94)","v":0},{"$f":"SUM(Z90:Z94)","v":0}]
[null,"Year 1 Cost",null,{"$f":"'PART 2 Pricing Schedule'!D64","v":0},{"$f":"D90","v":0},{"$f":"E90","v":0},0,0,null,{"$f":"'PART 2 Pricing Schedule'!J64","v":0},{"$f":"J90","v":0},{"$f":"K90","v":0},0,0,null,{"$f":"'PART 2 Pricing Schedule'!P64","v":0},{"$f":"P90","v":0},{"$f":"Q90","v":0},0,0,null,{"$f":"'PART 2 Pricing Schedule'!V64","v":0},{"$f":"V90","v":0},{"$f":"W90","v":0},0,0]
[null,"Year 2 Cost",null,null,{"$f":"D90*(1+'PART 2 Pricing Schedule'!E66)","v":0},0,{"$f":"F91","v":0},0,null,null,{"$f":"J90*(1+'PART 2 Pricing Schedule'!K66)","v":0},0,{"$f":"L91","v":0},0,null,null,{"$f":"P90*(1+'PART 2 Pricing Schedule'!Q66)","v":0},0,{"$f":"R91","v":0},0,null,null,{"$f":"V90*(1+'PART 2 Pricing Schedule'!W66)","v":0},0,{"$f":"X91","v":0},0]
[null,"Year 3 Cost",{"$nulls":3},{"$f":"E91*(1+'PART 2 Pricing Schedule'!F66)","v":0},{"$f":"F92","v":0},0,{"$nulls":3},{"$f":"K91*(1+'PART 2 Pricing Schedule'!L66)","v":0},{"$f":"L92","v":0},0,{"$nulls":3},{"$f":"Q91*(1+'PART 2 Pricing Schedule'!R66)","v":0},{"$f":"R92","v":0},0,{"$nulls":3},{"$f":"W91*(1+'PART 2 Pricing Schedule'!X66)","v":0},{"$f":"X92","v":0},0]
[null,"Year 4 Cost",{"$nulls":4},{"$f":"F92*(1+'PART 2 Pricing Schedule'!G66)","v":0},{"$f":"G93","v":0},{"$nulls":4},{"$f":"L92*(1+'PART 2 Pricing Schedule'!M66)","v":0},{"$f":"M93","v":0},{"$nulls":4},{"$f":"R92*(1+'PART 2 Pricing Schedule'!S66)","v":0},{"$f":"S93","v":0},{"$nulls":4},{"$f":"X92*(1+'PART 2 Pricing Schedule'!Y66)","v":0},{"$f":"Y93","v":0}]
[null,"Year 5 Cost",{"$nulls":5},{"$f":"G93*(1+'PART 2 Pricing Schedule'!H66)","v":0},{"$nulls":5},{"$f":"M93*(1+'PART 2 Pricing Schedule'!N66)","v":0},{"$nulls":5},{"$f":"S93*(1+'PART 2 Pricing Schedule'!T66)","v":0},{"$nulls":5},{"$f":"Y93*(1+'PART 2 Pricing Schedule'!Z66)","v":0}]
[]
["Minimum Keyboard and Mouse Cost in ZAR",null,null,"Standard Keyboard and Mouse"]
["Minimum Keyboard and Mouse Specification",null,null,"Full-Size QUERTY keyboard with Numpad, laptop-like keys which are backlit.\nOptical tracking mouse with a minimum 800 dpi resolution, two buttons and a scroll wheel.\nBoth devices must be able to connect using bluetooth and a single wireless dongle."]
[{"$nulls":3},"Year 1","Year 2","Year 3","Year 4","Year 5"]
["Outright purchase",null,null,{"$f":"'PART 2 Pricing Schedule'!D70","v":0},{"$f":"D99*(1+'PART 2 Pricing Schedule'!E72)","v":0},{"$f":"E99*(1+'PART 2 Pricing Schedule'!F72)","v":0},{"$f":"F99*(1+'PART 2 Pricing Schedule'!G72)","v":0},{"$f":"G99*(1+'PART 2 Pricing Schedule'!H72)","v":0}]
["36 Month Rental","Total",null,{"$f":"SUM(D101:D105)","v":0},{"$f":"SUM(E101:E105)","v":0},{"$f":"SUM(F101:F105)","v":0},{"$f":"SUM(G101:G105)","v":0},{"$f":"SUM(H101:H105)","v":0}]
[null,"Year 1 Cost",null,{"$f":"'PART 2 Pricing Schedule'!D73","v":0},{"$f":"D101","v":0},{"$f":"E101","v":0}]
[null,"Year 2 Cost",null,null,{"$f":"D101*(1+'PART 2 Pricing Schedule'!E75)","v":0},{"$f":"E102","v":0},{"$f":"F102","v":0}]
[null,"Year 3 Cost",{"$nulls":3},{"$f":"E102*(1+'PART 2 Pricing Schedule'!F75)","v":0},{"$f":"F103","v":0},{"$f":"G103","v":0}]
[null,"Year 4 Cost",{"$nulls":4},{"$f":"F103*(1+'PART 2 Pricing Schedule'!G75)","v":0},{"$f":"G104","v":0}]
[null,"Year 5 Cost",{"$nulls":5},{"$f":"G104*(1+'PART 2 Pricing Schedule'!H75)","v":0}]
["60 Month Rental","Total",null,{"$f":"SUM(D107:D111)","v":0},{"$f":"SUM(E107:E111)","v":0},{"$f":"SUM(F107:F111)","v":0},{"$f":"SUM(G107:G111)","v":0},{"$f":"SUM(H107:H111)","v":0}]
[null,"Year 1 Cost",null,{"$f":"'PART 2 Pricing Schedule'!D76","v":0},{"$f":"D107","v":0},{"$f":"E107","v":0},0,0]
[null,"Year 2 Cost",null,null,{"$f":"D107*(1+'PART 2 Pricing Schedule'!E78)","v":0},0,0,0]
[null,"Year 3 Cost",{"$nulls":3},{"$f":"E108*(1+'PART 2 Pricing Schedule'!F78)","v":0},0,0]
[null,"Year 4 Cost",{"$nulls":4},{"$f":"F109*(1+'PART 2 Pricing Schedule'!G78)","v":0},0]
[null,"Year 5 Cost",{"$nulls":5},{"$f":"G110*(1+'PART 2 Pricing Schedule'!H78)","v":0}]

{"sheet":"Lookups","index":8,"n_rows":160,"n_cols":17,"rows_kept":160,"hidden":true}
[]
[{"$nulls":8},"MODEL","UNITS","%",null,"Yes"]
["HD (1280x720)",1280,720,null,null,{"v":0.8,"d":"80%"},null,null,"Highly Mobile Notebook (Mobile, Connector)",489,{"$f":"J3/SUM($J$3:$J$10)","v":{"v":0.2660500544069641,"d":"27%"}},null,"No"]
["FHD (1920x1080)",1920,1080,{"$nulls":5},"Traditional Mainstream Notebook  (Connector, Collaborator)",75,{"$f":"J4/SUM($J$3:$J$10)","v":{"v":0.040805223068552776,"d":"4%"}}]
["QHD (2560x1440)",2560,1440,{"$nulls":5},"Modern Mainstream Notebook  (Connector, Collaborator)",710,{"v":0.3862894450489663,"d":"39%"}]
["UHD(3840x2160)",3840,2160,{"$nulls":5},"High-End Notebook  (Connector, Collaborator)- 15\" screen",{"$f":"ROUND(268*0.3,0)","v":80},{"v":0.04352557127312296,"d":"4%"}]
["UHD (7680x4320)",7680,4320,{"$nulls":5},"High-End Notebook (Connector, Collaborator) - 17\" screen",{"$f":"ROUND(268*0.7,0)","v":188},{"v":0.10228509249183895,"d":"10%"}]
[{"$nulls":8},"Traditional Mainstream Desktop (Connector, Collaborator)",118,{"v":0.06420021762785637,"d":"6%"}]
[{"$nulls":8},"Modern Mainstream Desktop (Connector, Collaborator)",164,{"v":0.08922742110990206,"d":"9%"}]
[{"$nulls":8},"High-End Desktop with Xeon CPU (Connector, Collaborator)",14,{"v":0.007616974972796518,"d":"1%"}]
[]
["SATA HDD",1]
["SATA SSD",2]
["M.2 PCIe SSD",3]
[]
[]
["SATA SSD",2]
["M.2 PCIe SSD",3]
[]
[]
["No",1]
["Yes - Passive",2]
["Yes - Active",3]
[]
[]
[0,0]
["Integrated",1]
["Discreet",2]
[]
[]
[0,0]
["No",1]
["Yes",2]
[{"$nulls":16},{"$f":"SUM(Q29:Q33)","v":0}]
[]
["Compact",0]
["Compact with numpad",1]
["Full",2]
["Full with numpad",3]
[]
[]
["Wired (PS/2)",1]
["Wired (USB)",2]
["Wireless (USB dedicated)",3]
["Wireless (USB Shared)",4]
["Wireless (BT) ",4]
["Built-in",5]
[]
[]
["Batteries",1]
["Rechareable batteries",1]
["Device",2]
[]
[]
["No Webcam",0]
["640x480",1]
["704x480",1]
["800x480",1]
["800x600",2]
["960x720",2]
["1024x768",2]
["1280x720",3]
["1280x800",3]
["1280x960",3]
["1280x1024",3]
["1600x1200",4]
["1920x1080",5]
["2048x1536",6]
["2560x2048",6]
["3200x2400",7]
["4096x2160",7]
["4096x3072",8]
[]
[]
["No built-in microphone",0]
["Yes, without noise cancelling",1]
["Yes, WITH noise cancelling",2]
[]
[]
["No pointing device",0]
["Mouse",1]
["Trackpad",2]
[]
[]
["Display Screen Technology"]
["TN LCD",1]
["VA LCD",2]
["IPS LCD",3]
["AMOLED",4]
[]
["Contrast Ratio"]
["Less than 1000:1",1]
["1000:1 to 3000:1",2]
["Greater than 3000:1",3]
[]
["Dynamic Range"]
["SDR",1]
["HDR",2]
[]
["Touch Screen"]
["No",1]
["Yes  - Resistive Touch Display",2]
["Yes - Capacitive Touch Display",3]
[]
["WiFi Generation"]
["Not included",1]
["Gen 4",2]
["Gen 5",3]
["Gen 6",4]
["Gen 7",5]
[]
["Bluetooth Version"]
["Not included",1]
[4,2]
[4.1,3]
[4.2,4]
[5,5]
[5.1,6]
[5.2,7]
[5.3,8]
[]
["4G/5G/6G"]
["Not included",0]
["4G",1]
["5G",2]
["6G",3]
[]
[]
["Warranty"]
["No NBD warranty available",0]
[1,1]
[2,2]
[3,3]
[5,4]
[7,5]
[]
["Model Availability"]
["Less than 12",0]
[12,1]
[15,2]
[18,3]
[21,4]
[24,5]
["Greater than 24",6]
[]
["Storage Class"]
[10,0]
[20,1]
[30,2]
[35,3]
[40,4]
[50,5]
[]
["Number of Screens"]
[1,1]
[2,2]
[3,3]
[4,4]
[5,5]
[6,6]

{"sheet":"References","index":9,"n_rows":21,"n_cols":25,"rows_kept":21,"hidden":true}
["References"]
[]
["CPU"]
["https://en.wikipedia.org/wiki/List_of_Intel_processors"]
["https://www.windowscentral.com/intel-12th-gen-p-u-series-officially-announced"]
[]
[]
[]
[]
[]
[{"$nulls":18},1,3,5,10,15,21,">21"]
[]
["https://www.anandtech.com/show/17259/intel-discloses-multigeneration-xeon-scalable-roadmap-new-ecore-only-xeons-in-2024"]
[]
[]
[]
[]
[{"$nulls":14},10,5,21,null,{"$f":"MATCH(O18,{\">21\",21,15,10,5,3,1},0)","v":4},{"$f":"MATCH(P18,{\">21\",21,15,10,5,3,1},0)","v":5},{"$f":"MATCH(Q18,{\">21\",21,15,10,5,3,1},0)","v":2}]
[]
[]
[{"$nulls":14},8,16,64,null,{"$f":"MATCH(O21,{8,12,16},-1)","v":1},{"$f":"MATCH(P21,{8,12,16},-1)","v":{"$error":"#N/A"}},{"$f":"MATCH(Q21,{8,12,16},-1)","v":{"$error":"#N/A"}}]