{"text_format":"3","workbook":"xlsx","n_sheets":10,"sheets":["Instructions to complete","PART 1 Technical Evaluation","Annex A Technical req 1","Annex A Technical req 2","Annex B SLA Perf requirements","Annex C Company Info","PART 2 Pricing Schedule","TCO","Lookups","References"],"not_rendered":{"images":1},"read":"whole","date_system":"1900"}

{"sheet":"Instructions to complete","index":0,"n_rows":5,"n_cols":1,"rows_kept":5,"merged":[[0,0,0,2],[1,0,1,2],[2,0,2,2],[3,0,3,2],[4,0,4,2]]}
["Instructions to complete:"]
["1. Please complete only the green cells in Sheets: \n      Annex B SLA Perf requirements, \n      Annex A Technical spec 1,\n      Annex A Technical spec 2,\n      Annex C Company Info, and \n      PART 2 Pricing Schedule"]
["2. The SLA Performance requirements and sub-sections will become part of the contracted agreement, should the Bidder be successful"]
["3. By answering yes, the Bidder binds themselves to deliver on each corresponding aspect of the project."]
["4. Scores for Annexure A, B, and C, will be automatically populated from the respective sheets. "]

{"sheet":"PART 1 Technical Evaluation","index":1,"n_rows":13,"n_cols":5,"rows_kept":13,"merged":[[3,0,3,4],[4,1,4,4],[10,1,10,2],[11,1,11,2],[12,1,12,2]]}
["Instructions to the evaluations committee:"]
["1. Scores for Annexure A, B, and C, will be automatically populated from the respective sheets. "]
[]
["PART 1: RFP Technical specifications"]
["Bidder Name:",{"$f":"IF('Annex A Technical req 1'!C4=\"\",\"\",'Annex A Technical req 1'!C4)","v":"hkjg nb"}]
["Functional Factors","Proof Required","Weight","Points achieved","Individual section result"]
["Annex A Technical Requirement 1","Bidder to submit a completed PART 1 TECHNICAL ROPOSAL.XLSX (Sheet: Annex A Technical Requirement 1)",{"v":0.6,"d":"60%"},{"$f":"'Annex A Technical req 1'!D10","v":{"v":0,"d":"0.00"}},{"$f":"IF(D7>=7.5,\"Proceed\",\"Do not proceed\")","v":"Do not proceed"}]
["Annex A Technical Requirement 2","Bidder to submit a completed PART 1 TECHNICAL ROPOSAL.XLSX (Sheet: Annex A Technical Requirement 2)",{"v":0.2,"d":"20%"},{"$f":"'Annex A Technical req 2'!D55","v":{"v":0,"d":"0.00"}},{"$f":"'Annex A Technical req 2'!C57","v":"Do not proceed"}]
["Annex B SLA Perf requirements","Bidder to submit a completed PART 1 TECHNICAL ROPOSAL.XLSX (Sheet: Annexure B: SLA Performance requirements)",{"v":0.1,"d":"10%"},{"$f":"'Annex B SLA Perf requirements'!G24","v":{"v":0,"d":"0.00"}},{"$f":"'Annex B SLA Perf requirements'!C23","v":"Do not proceed"}]
["Annex C Company Information","Annexure C: Company Information -Requirements: \na) Presence in all Geographical locations of the CSIR\nb) Call Centre presence and operating hours\nc) Number of Next Business Day On-site Repair Agents\nb) Parts and stock holding available at all Geographical locations of the CSIR",{"v":0.1,"d":"10%"},{"$f":"'Annex C Company Info'!B23/10","v":{"v":0,"d":"0.00"}},{"$f":"IF(D10>=7,\"Proceed\",\"Do not proceed\")","v":"Do not proceed"}]
{"$rows_left_out":4}
{"sheet":"Annex A Technical req 1","index":2,"n_rows":1048252,"n_cols":49,"rows_kept":1048252,"merged":[[3,0,3,1],[5,0,5,3],[6,1,6,2],[7,1,7,2],[8,1,8,2],[17,0,20,0],[17,1,20,2],[17,3,20,3],[17,30,20,30],[17,31,20,32],[17,33,20,33],[18,6,18,8],[18,11,18,13],[18,16,18,18],[18,21,18,23],[18,26,18,28],[18,36,18,38],[18,41,18,43],[18,46,18,48],[19,6,19,8],[19,11,19,13],[19,16,19,18],[19,21,19,23],[19,26,19,28],[19,36,19,38],[19,41,19,43],[19,46,19,48],[80,0,83,0],[80,30,83,30],[85,0,88,0],[85,1,85,2],[85,30,88,30],[85,31,85,32],[86,1,86,2],[86,31,86,32],[87,1,87,2],[87,31,87,32],[88,1,88,2],[88,31,88,32],[89,1,89,2],[89,31,89,32],[92,1,92,2],[92,31,92,32],[93,1,93,2],[93,31,93,32],[94,1,94,2],[94,31,94,32],[95,1,95,2],[95,31,95,32],[96,1,96,2],[96,31,96,32],[97,1,97,2],[97,31,97,32],[98,1,98,2],[98,31,98,32],[99,1,99,2],[99,31,99,32],[100,1,100,2],[100,31,100,32],[101,1,101,2],[101,31,101,32],[102,1,102,2],[102,31,102,32],[103,1,103,2],[103,31,103,32],[104,1,104,2],[104,31,104,32],[105,1,105,2],[105,31,105,32],[108,0,111,0],[108,1,111,2],[108,3,111,3],[109,6,109,8],[109,11,109,13],[110,6,110,8],[110,11,110,13],[120,0,121,0],[120,1,120,2],[121,1,121,2]]}
[]
["ANNEXURE A:  TECHNICAL REQUIREMENTS PART 1"]
[]
["Bidder Name: ",null,"hkjg nb"]
[]
["Scoring Summary",{"$nulls":6},"Scoring Legend"]
[{"v":0.6,"d":"60%"},"The consolidated overall score for Computing Devices",null,{"$f":"IF(OR(I91=0,I123=0,N91=0,N123=0,S91=0,X91=0,AC91=0,AM91=0,AR91=0,AW91=0),0,I91*Lookups!K3+N91*Lookups!K4+S91*Lookups!K5+X91*Lookups!K6+AC91*Lookups!K7+AM91*Lookups!K8+AR91*Lookups!K9+AW91*Lookups!K10)","v":0},{"$nulls":3},"Not present",0]
[{"v":0.3,"d":"30%"},"The consolidated overall score for Component Failures",null,{"$f":"IF(OR(H107=0,M107=0,R107=0,W107=0,AB107=0,AL107=0,AQ107=0,AV107=0),0,ROUND(100-(H107*Lookups!K3+M107*Lookups!K4+R107*Lookups!K5+W107*Lookups!K6+AB107*Lookups!K7+AL107*Lookups!K8+AQ107*Lookups!K9+AV107*Lookups!K10),0))","v":0},{"$nulls":3},"Below minimum",3]
[{"v":0.1,"d":"10%"},"The consolidated overall score for Docking Station/Port Replicators ",null,{"$f":"IF(OR(I123=0,N123=0),0,AVERAGE(I123,N123))","v":0},{"$nulls":3},"Meets mimum",6]
[null,null,"Technical Requirement 1 score out of 10",{"$f":"IF(OR(D7=0,D8=0,D9=0),0,ROUND(SUMPRODUCT(A7:A9,D7:D9),0)/10)","v":0},{"$nulls":3},"Meets desired",8]
{"$rows_left_out":116}
{"sheet":"Annex A Technical req 2","index":3,"n_rows":71,"n_cols":5,"rows_kept":71,"merged":[[0,1,0,3],[1,1,1,3],[2,1,2,3],[3,1,3,3],[5,1,5,4],[6,2,6,4]]}
[null,"Instructions to complete:"]
[null,"1. Please complete only the green cells"]
[null,"2. The project plan and sub-sections will become part of the contracted agreement, should the Bidder be successful, and also   \n     provides the evaluation committee with a view of the ability of the Bidder to execute on the contract."]
[null,"3. By answering yes, the Bidder binds themselves to deliver on each corresponding aspect of the project."]
[]
[null,"Annex A Technical spec 2"]
[null,"Bidder Name:",{"$f":"IF('Annex A Technical req 1'!C4=\"\",\"\",'Annex A Technical req 1'!C4)","v":"hkjg nb"}]
[null,"Criteria","Yes  /No","Score allocation: \n0: Unable to meet requirement \n10: Able to meet requirement","Comments"]
[1,"Order fulfilment"]
[1.1," The bidder must establish a mechanism to generate quotes and time to fulfil"]
{"$rows_left_out":62}
{"sheet":"Annex B SLA Perf requirements","index":4,"n_rows":39,"n_cols":7,"rows_kept":39,"merged":[[1,0,1,6],[2,1,2,6],[3,0,19,0],[5,1,8,1],[6,2,8,2],[10,1,13,1],[12,2,13,2],[12,3,13,3]]}
[]
["Annexure B: SLA Performance requirements"]
["Bidder Name:",{"$f":"IF('Annex A Technical req 1'!C4=\"\",\"\",'Annex A Technical req 1'!C4)","v":"hkjg nb"}]
[null,"SLA call resolution requirements","Expected service delivery criteria ","Performance level","Reporting requirements","Met (yes or no)","Score"]
[null,"Same day for high priority calls","365 x 24 x 7 x 2hr to replace","95% on average","Monthly SLA reporting to include the following:"]
[null,null,"Defined as: days of the year x hours x days of the week x resolution time","95% on average","Number of calls logged per month",null,{"$f":"IF(F6=\"yes\",10,0)","v":0}]
[{"$nulls":4},"MTTR ",null,{"$f":"IF(F7=\"yes\",10,0)","v":0}]
[{"$nulls":4},"Root Cause Analysis report for all incidents/requests.",null,{"$f":"IF(F8=\"yes\",10,0)","v":0}]
[{"$nulls":4},"Summary of maintenance and support actions undertaken per month",null,{"$f":"IF(F9=\"yes\",10,0)","v":0}]
[null,"Next business day (NBD) resolution for medium priority calls","Expected service delivery criteria ","Performance level","Monthly SLA reporting to include the following:"]
{"$rows_left_out":30}
{"sheet":"Annex C Company Info","index":5,"n_rows":23,"n_cols":5,"rows_kept":23,"merged":[[3,1,3,4]]}
[]
["Annexure C: Company Informaton"]
[]
["Bidder Name:",{"$f":"IF('Annex A Technical req 1'!C4=\"\",\"\",'Annex A Technical req 1'!C4)","v":"hkjg nb"}]
[]
[]
["                                                      OEM Presence\n\n          Region","OEM Office(s)","24x7x365 Call Centre","Number of Next Business Day On-site Repair Agents","Number Spares Stores"]
["GAUTENG",null,null,{"$f":"SUM(D9:D13)","v":0}]
["CSIR Pretoria"]
["CSIR Kloppersbos (Pretoria North)"]
{"$rows_left_out":14}
{"sheet":"PART 2 Pricing Schedule","index":6,"n_rows":78,"n_cols":50,"rows_kept":78,"merged":[[3,1,3,7],[5,0,5,1],[5,3,5,7],[5,9,5,13],[5,15,5,19],[5,21,5,25],[5,27,5,31],[5,33,5,37],[5,39,5,43],[5,45,5,49],[6,0,6,1],[6,3,6,7],[6,9,6,13],[6,15,6,19],[6,21,6,25],[6,27,6,31],[6,33,6,37],[6,39,6,43],[6,45,6,49],[7,0,7,1],[7,3,7,7],[7,9,7,13],[7,15,7,19],[7,21,7,25],[7,27,7,31],[7,33,7,37],[7,39,7,43],[7,45,7,49],[8,0,8,1],[8,3,8,7],[8,9,8,13],[8,15,8,19],[8,21,8,25],[8,27,8,31],[8,33,8,37],[8,39,8,43],[8,45,8,49],[9,0,11,0],[9,3,9,7],[9,9,9,13],[9,15,9,19],[9,21,9,25],[9,27,9,31],[9,33,9,37],[9,39,9,43],[9,45,9,49],[10,1,11,1],[12,0,14,0],[12,3,12,7],[12,9,12,13],[12,15,12,19],[12,21,12,25],[12,27,12,31],[12,33,12,37],[12,39,12,43],[12,45,12,49],[13,1,14,1],[15,0,17,0],[15,3,15,7],[15,9,15,13],[15,15,15,19],[15,21,15,25],[15,27,15,31],[15,33,15,37],[15,39,15,43],[15,45,15,49],[16,1,17,1],[19,0,19,1],[19,3,19,7],[19,9,19,13],[19,15,19,19],[19,21,19,25],[19,27,19,31],[19,33,19,37],[19,39,19,43],[19,45,19,49],[20,0,20,1],[20,3,20,7],[20,9,20,13],[20,15,20,19],[20,21,20,25],[20,27,20,31],[20,33,20,37],[20,39,20,43],[20,45,20,49],[21,0,21,1],[21,3,21,7],[21,9,21,13],[21,15,21,19],[21,21,21,25],[21,27,21,31],[21,33,21,37],[21,39,21,43],[21,45,21,49],[22,0,22,1],[22,3,22,7],[22,9,22,13],[22,15,22,19],[22,21,22,25],[22,27,22,31],[22,33,22,37],[22,39,22,43],[22,45,22,49],[23,0,23,1],[23,3,23,7],[23,9,23,13],[23,15,23,19],[23,21,23,25],[23,27,23,31],[23,33,23,37],[23,39,23,43],[23,45,23,49],[24,0,24,1],[24,3,24,7],[24,9,24,13],[24,15,24,19],[24,21,24,25],[24,27,24,31],[24,33,24,37],[24,39,24,43],[24,45,24,49],[25,0,25,1],[25,3,25,7],[25,9,25,13],[25,15,25,19],[25,21,25,25],[25,27,25,31],[25,33,25,37],[25,39,25,43],[25,45,25,49],[26,0,26,1],[26,3,26,7],[26,9,26,13],[26,15,26,19],[26,21,26,25],[26,27,26,31],[26,33,26,37],[26,39,26,43],[26,45,26,49],[27,0,27,1],[27,3,27,7],[27,9,27,13],[27,15,27,19],[27,21,27,25],[27,27,27,31],[27,33,27,37],[27,39,27,43],[27,45,27,49],[28,0,28,1],[28,3,28,7],[28,9,28,13],[28,15,28,19],[28,21,28,25],[28,27,28,31],[28,33,28,37],[28,39,28,43],[28,45,28,49],[29,0,29,1],[29,3,29,7],[29,9,29,13],[29,15,29,19],[29,21,29,25],[29,27,29,31],[29,33,29,37],[29,39,29,43],[29,45,29,49],[30,0,30,1],[30,3,30,7],[30,9,30,13],[30,15,30,19],[30,21,30,25],[30,27,30,31],[30,33,30,37],[30,39,30,43],[30,45,30,49],[31,0,31,1],[31,3,31,7],[31,9,31,13],[31,15,31,19],[31,21,31,25],[31,27,31,31],[31,33,31,37],[31,39,31,43],[31,45,31,49],[32,0,32,1],[32,3,32,7],[32,9,32,13],[32,15,32,19],[32,21,32,25],[32,27,32,31],[32,33,32,37],[32,39,32,43],[32,45,32,49],[33,0,33,1],[33,3,33,7],[33,9,33,13],[33,15,33,19],[33,21,33,25],[33,27,33,31],[33,33,33,37],[33,39,33,43],[33,45,33,49],[34,0,34,1],[34,3,34,7],[34,9,34,13],[34,15,34,19],[34,21,34,25],[34,27,34,31],[34,33,34,37],[34,39,34,43],[34,45,34,49],[35,0,36,1],[38,0,38,1],[38,3,38,7],[38,9,38,13],[39,0,39,1],[39,3,39,7],[39,9,39,13],[40,0,40,1],[40,3,40,7],[40,9,40,13],[41,0,41,1],[41,3,41,7],[41,9,41,13],[42,0,44,0],[42,3,42,7],[42,9,42,13],[43,1,44,1],[45,0,47,0],[45,3,45,7],[45,9,45,13],[46,1,47,1],[48,0,50,0],[48,3,48,7],[48,9,48,13],[49,1,50,1],[52,0,52,1],[52,3,52,7],[52,9,52,13],[52,15,52,19],[52,21,52,25],[53,0,56,1],[53,3,53,4],[53,5,53,7],[53,9,53,10],[53,11,53,13],[53,15,53,16],[53,17,53,19],[53,21,53,22],[53,23,53,25],[54,3,54,4],[54,5,54,7],[54,9,54,10],[54,11,54,13],[54,15,54,16],[54,17,54,19],[54,21,54,22],[54,23,54,25],[55,3,55,4],[55,5,55,7],[55,9,55,10],[55,11,55,13],[55,15,55,16],[55,17,55,19],[55,21,55,22],[55,23,55,25],[56,5,56,7],[56,11,56,13],[56,17,56,19],[56,23,56,25],[57,0,59,0],[57,3,57,7],[57,9,57,13],[57,15,57,19],[57,21,57,25],[58,1,59,1],[60,0,62,0],[60,3,60,7],[60,9,60,13],[60,15,60,19],[60,21,60,25],[61,1,62,1],[63,0,65,0],[63,3,63,7],[63,9,63,13],[63,15,63,19],[63,21,63,25],[64,1,65,1],[67,0,67,1],[67,3,67,7],[68,0,68,1],[68,3,68,7],[69,0,71,0],[69,3,69,7],[70,1,71,1],[72,0,74,0],[72,3,72,7],[73,1,74,1],[75,0,77,0],[75,3,75,7],[76,1,77,1]]}
[]
["PRICING SCHEDULE"]
[]
["Bidder Name:",{"$f":"IF('Annex A Technical req 1'!C4=\"\",\"\",'Annex A Technical req 1'!C4)","v":"hkjg nb"}]
[]
["Notebook/Desktops Pricing in ZAR",null,null,"Highly Mobile Notebook (Mobile, Connector)",{"$nulls":5},"Traditional Mainstream Notebook  (Connector, Collaborator)",{"$nulls":5},"Modern Mainstream Notebook  (Connector, Collaborator)",{"$nulls":5},"High-End Notebook  (Connector, Collaborator)- 15\" screen",{"$nulls":5},"High-End Notebook (Connector, Collaborator) - 17\" screen",{"$nulls":5},"Traditional Mainstream Desktop (Connector, Collaborator)",{"$nulls":5},"Modern Mainstream Desktop (Connector, Collaborator)",{"$nulls":5},"High-End Desktop with Xeon CPU (Connector, Collaborator)"]
["Make",null,null,{"$f":"IF('Annex A Technical req 1'!G19=\"\",\"\",'Annex A Technical req 1'!G19)","v":""},{"$nulls":5},{"$f":"IF('Annex A Technical req 1'!L19=\"\",\"\",'Annex A Technical req 1'!L19)","v":""},{"$nulls":5},{"$f":"IF('Annex A Technical req 1'!Q19=\"\",\"\",'Annex A Technical req 1'!Q19)","v":""},{"$nulls":5},{"$f":"IF('Annex A Technical req 1'!V19=\"\",\"\",'Annex A Technical req 1'!V19)","v":""},{"$nulls":5},{"$f":"IF('Annex A Technical req 1'!AA19=\"\",\"\",'Annex A Technical req 1'!AA19)","v":""},{"$nulls":5},{"$f":"IF('Annex A Technical req 1'!AK19=\"\",\"\",'Annex A Technical req 1'!AK19)","v":""},{"$nulls":5},{"$f":"IF('Annex A Technical req 1'!AP19=\"\",\"\",'Annex A Technical req 1'!AP19)","v":""},{"$nulls":5},{"$f":"IF('Annex A Technical req 1'!AU19=\"\",\"\",'Annex A Technical req 1'!AU19)","v":""}]
["Model",null,null,{"$f":"IF('Annex A Technical req 1'!G20=\"\",\"\",'Annex A Technical req 1'!G20)","v":""},{"$nulls":5},{"$f":"IF('Annex A Technical req 1'!L20=\"\",\"\",'Annex A Technical req 1'!L20)","v":""},{"$nulls":5},{"$f":"IF('Annex A Technical req 1'!Q20=\"\",\"\",'Annex A Technical req 1'!Q20)","v":""},{"$nulls":5},{"$f":"IF('Annex A Technical req 1'!V20=\"\",\"\",'Annex A Technical req 1'!V20)","v":""},{"$nulls":5},{"$f":"IF('Annex A Technical req 1'!AA20=\"\",\"\",'Annex A Technical req 1'!AA20)","v":""},{"$nulls":5},{"$f":"IF('Annex A Technical req 1'!AK20=\"\",\"\",'Annex A Technical req 1'!AK20)","v":""},{"$nulls":5},{"$f":"IF('Annex A Technical req 1'!AP20=\"\",\"\",'Annex A Technical req 1'!AP20)","v":""},{"$nulls":5},{"$f":"IF('Annex A Technical req 1'!AU20=\"\",\"\",'Annex A Technical req 1'!AU20)","v":""}]
["Next Business Day (NBD) Warranty Included",null,null,{"$f":"IF('Annex A Technical req 1'!H89=\"\",\"\",'Annex A Technical req 1'!H89)","v":""},{"$nulls":5},{"$f":"IF('Annex A Technical req 1'!M89=\"\",\"\",'Annex A Technical req 1'!M89)","v":""},{"$nulls":5},{"$f":"IF('Annex A Technical req 1'!R89=\"\",\"\",'Annex A Technical req 1'!R89)","v":""},{"$nulls":5},{"$f":"IF('Annex A Technical req 1'!W89=\"\",\"\",'Annex A Technical req 1'!W89)","v":""},{"$nulls":5},{"$f":"IF('Annex A Technical req 1'!AB89=\"\",\"\",'Annex A Technical req 1'!AB89)","v":""},{"$nulls":5},{"$f":"IF('Annex A Technical req 1'!AL89=\"\",\"\",'Annex A Technical req 1'!AL89)","v":""},{"$nulls":5},{"$f":"IF('Annex A Technical req 1'!AQ89=\"\",\"\",'Annex A Technical req 1'!AQ89)","v":""},{"$nulls":5},{"$f":"IF('Annex A Technical req 1'!AN89=\"\",\"\",'Annex A Technical req 1'!AN89)","v":""}]
["Outright purchase","Purchase Price"]
{"$rows_left_out":69}
{"sheet":"TCO","index":7,"n_rows":111,"n_cols":50,"rows_kept":111,"merged":[[3,1,3,7],[5,0,5,1],[5,3,5,4],[5,5,5,7],[6,0,6,1],[6,3,6,4],[6,5,6,7],[7,0,7,1],[7,3,7,4],[7,5,7,7],[8,0,8,1],[8,3,8,4],[8,5,8,7],[10,0,10,1],[11,0,11,1],[11,3,11,7],[11,9,11,13],[11,15,11,19],[11,21,11,25],[11,27,11,31],[11,33,11,37],[11,39,11,43],[11,45,11,49],[12,0,12,1],[12,3,12,7],[12,9,12,13],[12,15,12,19],[12,21,12,25],[12,27,12,31],[12,33,12,37],[12,39,12,43],[12,45,12,49],[13,0,13,1],[13,3,13,7],[13,9,13,13],[13,15,13,19],[13,21,13,25],[13,27,13,31],[13,33,13,37],[13,39,13,43],[13,45,13,49],[14,0,19,0],[14,3,14,7],[14,9,14,13],[14,15,14,19],[14,21,14,25],[14,27,14,31],[14,33,14,37],[14,39,14,43],[14,45,14,49],[15,3,15,7],[15,9,15,13],[15,15,15,19],[15,21,15,25],[15,27,15,31],[15,33,15,37],[15,39,15,43],[15,45,15,49],[16,3,16,7],[16,9,16,13],[16,15,16,19],[16,21,16,25],[16,27,16,31],[16,33,16,37],[16,39,16,43],[16,45,16,49],[17,3,17,7],[17,9,17,13],[17,15,17,19],[17,21,17,25],[17,27,17,31],[17,33,17,37],[17,39,17,43],[17,45,17,49],[18,3,18,7],[18,9,18,13],[18,15,18,19],[18,21,18,25],[18,27,18,31],[18,33,18,37],[18,39,18,43],[18,45,18,49],[19,3,19,7],[19,9,19,13],[19,15,19,19],[19,21,19,25],[19,27,19,31],[19,33,19,37],[19,39,19,43],[19,45,19,49],[20,0,25,0],[20,3,20,7],[20,9,20,13],[20,15,20,19],[20,21,20,25],[20,27,20,31],[20,33,20,37],[20,39,20,43],[20,45,20,49],[21,3,21,7],[21,9,21,13],[21,15,21,19],[21,21,21,25],[21,27,21,31],[21,33,21,37],[21,39,21,43],[21,45,21,49],[22,3,22,7],[22,9,22,13],[22,15,22,19],[22,21,22,25],[22,27,22,31],[22,33,22,37],[22,39,22,43],[22,45,22,49],[23,3,23,7],[23,9,23,13],[23,15,23,19],[23,21,23,25],[23,27,23,31],[23,33,23,37],[23,39,23,43],[23,45,23,49],[24,3,24,7],[24,9,24,13],[24,15,24,19],[24,21,24,25],[24,27,24,31],[24,33,24,37],[24,39,24,43],[24,45,24,49],[25,3,25,7],[25,9,25,13],[25,15,25,19],[25,21,25,25],[25,27,25,31],[25,33,25,37],[25,39,25,43],[25,45,25,49],[26,0,31,0],[26,3,26,7],[26,9,26,13],[26,15,26,19],[26,21,26,25],[26,27,26,31],[26,33,26,37],[26,39,26,43],[26,45,26,49],[27,3,27,7],[27,9,27,13],[27,15,27,19],[27,21,27,25],[27,27,27,31],[27,33,27,37],[27,39,27,43],[27,45,27,49],[28,3,28,7],[28,9,28,13],[28,15,28,19],[28,21,28,25],[28,27,28,31],[28,33,28,37],[28,39,28,43],[28,45,28,49],[29,3,29,7],[29,9,29,13],[29,15,29,19],[29,21,29,25],[29,27,29,31],[29,33,29,37],[29,39,29,43],[29,45,29,49],[30,3,30,7],[30,9,30,13],[30,15,30,19],[30,21,30,25],[30,27,30,31],[30,33,30,37],[30,39,30,43],[30,45,30,49],[31,3,31,7],[31,9,31,13],[31,15,31,19],[31,21,31,25],[31,27,31,31],[31,33,31,37],[31,39,31,43],[31,45,31,49],[33,0,33,1],[34,0,34,1],[34,3,34,7],[34,9,34,13],[34,15,34,19],[34,21,34,25],[34,27,34,31],[34,33,34,37],[34,39,34,43],[34,45,34,49],[35,0,35,1],[35,3,35,7],[35,9,35,13],[35,15,35,19],[35,21,35,25],[35,27,35,31],[35,33,35,37],[35,39,35,43],[35,45,35,49],[36,0,36,1],[36,3,36,7],[36,9,36,13],[36,15,36,19],[36,21,36,25],[36,27,36,31],[36,33,36,37],[36,39,36,43],[36,45,36,49],[38,0,38,1],[39,0,44,0],[45,0,50,0],[52,0,52,1],[53,0,53,1],[55,0,55,1],[56,0,56,1],[56,3,56,7],[56,9,56,13],[57,0,57,1],[57,3,57,7],[57,9,57,13],[58,0,58,1],[58,3,58,7],[58,9,58,13],[60,0,60,1],[61,0,66,0],[67,0,72,0],[75,0,75,1],[75,3,75,7],[75,9,75,13],[75,15,75,19],[75,21,75,25],[76,0,79,1],[76,3,76,4],[76,5,76,7],[76,9,76,10],[76,11,76,13],[76,15,76,16],[76,17,76,19],[76,21,76,22],[76,23,76,25],[77,3,77,4],[77,5,77,7],[77,9,77,10],[77,11,77,13],[77,15,77,16],[77,17,77,19],[77,21,77,22],[77,23,77,25],[78,3,78,4],[78,5,78,7],[78,9,78,10],[78,11,78,13],[78,15,78,16],[78,17,78,19],[78,21,78,22],[78,23,78,25],[79,5,79,7],[79,11,79,13],[79,17,79,19],[79,23,79,25],[80,0,80,1],[81,0,81,1],[82,0,87,0],[88,0,93,0],[95,0,95,1],[95,3,95,7],[96,0,96,1],[96,3,96,7],[98,0,98,1],[99,0,104,0],[105,0,110,0]]}
[]
["Total Cost of Ownership"]
[]
["Bidder Name:",{"$f":"IF('Annex A Technical req 1'!C4=\"\",\"\",'Annex A Technical req 1'!C4)","v":"hkjg nb"}]
[]
["Overall TCOE",null,null,"Total",null,"Normalized per year under Warranty"]
["Outright purchase",null,null,{"$f":"SUM(D15:AX15)","v":0},null,{"$f":"D15/D$14+J15/J$14+P15/P$14+V15/V$14+AB15/AB$14+AH15/AH$14+AN15/AN$14+AT15/AT$14","v":{"$error":"#VALUE!"}}]
["36 Month Rental",null,null,{"$f":"SUM(D21:AX21)","v":0},null,{"$f":"D21/D$14+J21/J$14+P21/P$14+V21/V$14+AB21/AB$14+AH21/AH$14+AN21/AN$14+AT21/AT$14","v":{"$error":"#VALUE!"}}]
["60 Month Rental",null,null,{"$f":"SUM(D27:AX27)","v":0},null,{"$f":"D27/D$14+J27/J$14+P27/P$14+V27/V$14+AB27/AB$14+AH27/AH$14+AN27/AN$14+AT27/AT$14","v":{"$error":"#VALUE!"}}]
[]
{"$rows_left_out":102}
{"sheet":"Lookups","index":8,"n_rows":160,"n_cols":17,"rows_kept":160,"hidden":true}
[]
[{"$nulls":8},"MODEL","UNITS","%",null,"Yes"]
["HD (1280x720)",1280,720,null,null,{"v":0.8,"d":"80%"},null,null,"Highly Mobile Notebook (Mobile, Connector)",489,{"$f":"J3/SUM($J$3:$J$10)","v":{"v":0.2660500544069641,"d":"27%"}},null,"No"]
["FHD (1920x1080)",1920,1080,{"$nulls":5},"Traditional Mainstream Notebook  (Connector, Collaborator)",75,{"$f":"J4/SUM($J$3:$J$10)","v":{"v":0.040805223068552776,"d":"4%"}}]
["QHD (2560x1440)",2560,1440,{"$nulls":5},"Modern Mainstream Notebook  (Connector, Collaborator)",710,{"v":0.3862894450489663,"d":"39%"}]
["UHD(3840x2160)",3840,2160,{"$nulls":5},"High-End Notebook  (Connector, Collaborator)- 15\" screen",{"$f":"ROUND(268*0.3,0)","v":80},{"v":0.04352557127312296,"d":"4%"}]
["UHD (7680x4320)",7680,4320,{"$nulls":5},"High-End Notebook (Connector, Collaborator) - 17\" screen",{"$f":"ROUND(268*0.7,0)","v":188},{"v":0.10228509249183895,"d":"10%"}]
[{"$nulls":8},"Traditional Mainstream Desktop (Connector, Collaborator)",118,{"v":0.06420021762785637,"d":"6%"}]
[{"$nulls":8},"Modern Mainstream Desktop (Connector, Collaborator)",164,{"v":0.08922742110990206,"d":"9%"}]
[{"$nulls":8},"High-End Desktop with Xeon CPU (Connector, Collaborator)",14,{"v":0.007616974972796518,"d":"1%"}]
{"$rows_left_out":151}
{"sheet":"References","index":9,"n_rows":21,"n_cols":25,"rows_kept":21,"hidden":true}
["References"]
[]
["CPU"]
["https://en.wikipedia.org/wiki/List_of_Intel_processors"]
["https://www.windowscentral.com/intel-12th-gen-p-u-series-officially-announced"]
[]
[]
[]
[]
[]
{"$rows_left_out":11}