{"text_format":"3","workbook":"xlsx","n_sheets":8,"sheets":["T2.22_Final BOQ","FINAL SUMMARY","C2_Pricing Data-fly","C2.1 Pricing Instructions","C2.2_Prelim Fly","C2.2_Notes to QS Prelims & Gen","C2.3_BOQ - Fly","UNPRICED BOQ"],"not_rendered":{"images":3,"external_links":7,"defined_names":27},"read":"whole","date_system":"1900"}

{"sheet":"T2.22_Final BOQ","index":0,"n_rows":19,"n_cols":9,"rows_kept":19,"merged":[[1,1,1,9],[3,1,6,2],[3,3,6,9],[7,1,7,2],[7,3,7,5],[7,6,7,7],[7,8,7,9],[18,1,18,9],[20,1,20,5],[22,1,22,5],[24,1,24,9],[26,1,27,9],[30,1,30,3],[30,4,30,9],[31,1,31,3],[31,4,31,9],[32,1,32,3],[32,4,32,9],[33,1,33,3],[33,4,33,9],[34,1,34,2]]}
[]
[null,"T2.22 - FINAL BILL OF QUANTITY SUMMARY"]
[]
[null,"Project title:",null,{"$f":"+'[1]Master Data'!E18","v":"ZNT 04280 W: DEPARTMENT OF HEALTH: MBONGOLWANE: WIMS NO. 056687: MBONGOLWANE HOSPITAL: PROVISION OF TWO BOREHOLES WITH BOOSTER PUMP AND WATER TREATMENT SYSTEM\t"}]
[]
[]
[]
[null,"Tender no:         ",null,{"$f":"+'[1]Master Data'!E13","v":"ZNTU 04280 W"},null,null,"Project Code:",null,{"$f":"+'[1]Master Data'!G13","v":"056687"}]
{"$rows_empty":10}
[null,"ATTACH SUMMARY PAGE OF THE BILL OF QUANTITIES"]

{"sheet":"FINAL SUMMARY","index":1,"n_rows":38,"n_cols":8,"rows_kept":38,"merged":[[0,0,0,8],[2,0,5,1],[2,2,5,8],[6,0,6,1],[6,2,6,4],[6,5,6,6],[6,7,6,8]]}
["T2.22 - FINAL BILL OF QUANTITY SUMMARY"]
[]
[{"$f":"'[1]T2.22_Final BOQ'!B4","v":"Project title:"},null,{"$f":"'[1]T2.22_Final BOQ'!D4","v":"ZNT 04280 W: DEPARTMENT OF HEALTH: MBONGOLWANE: WIMS NO. 056687: MBONGOLWANE HOSPITAL: PROVISION OF TWO BOREHOLES WITH BOOSTER PUMP AND WATER TREATMENT SYSTEM\t"}]
[]
[]
[]
[{"$f":"'[1]T2.22_Final BOQ'!B8","v":"Tender no:         "},null,{"$f":"'[1]T2.22_Final BOQ'!D8","v":"ZNTU 04280 W"},null,null,{"$f":"'[1]T2.22_Final BOQ'!G8","v":"Project Code:"},null,{"$f":"'[1]T2.22_Final BOQ'!I8","v":"056687"}]
{"$rows_empty":9}
["CONCRETE, FORMWORK AND REINFORCEMENT"]
[]
[]
["DRILLING "]
[]
[]
["PUMP TESTING"]
[]
[]
["WATER TREATMENT PLANT"]
[]
[]
["PUMP INSTALLATION"]
[]
[]
["WATER PURIFICATION"]
[]
[]
[]
[]
[]
[{"$nulls":6},"SUB TOTAL"]

{"sheet":"C2_Pricing Data-fly","index":2,"n_rows":16,"n_cols":1,"rows_kept":16,"merged":[[1,0,1,10],[15,0,15,9]]}
[]
[{"$f":"+'[1]Master Data'!ProjectTitle","v":"ZNT 04280 W: DEPARTMENT OF HEALTH: MBONGOLWANE: WIMS NO. 056687: MBONGOLWANE HOSPITAL: PROVISION OF TWO BOREHOLES WITH BOOSTER PUMP AND WATER TREATMENT SYSTEM\t"}]
{"$rows_empty":13}
["PART C2 - PRICING DATA"]

{"sheet":"C2.1 Pricing Instructions","index":3,"n_rows":91,"n_cols":15,"rows_kept":91,"merged":[[0,1,0,11],[2,1,2,3],[2,4,2,11],[3,1,3,3],[3,4,3,7],[3,8,3,9],[3,10,3,11],[5,1,5,11],[7,2,7,11],[9,2,9,11],[11,2,11,10],[13,2,13,11],[15,2,15,10],[17,2,17,11],[19,2,19,10],[20,2,20,11],[22,2,22,10],[23,2,23,11],[24,2,24,11],[25,2,25,10],[26,2,26,11],[28,2,28,10],[30,2,30,11],[32,2,32,11],[34,2,34,11],[36,2,36,10],[38,2,38,11],[39,2,39,11],[40,2,40,11],[42,2,42,11],[44,2,44,11],[45,2,45,11],[45,14,45,18],[46,2,46,11],[48,2,48,10],[50,2,50,11],[52,2,52,10],[54,3,54,11],[55,3,55,11],[56,3,56,11],[57,3,57,11],[58,2,58,11],[60,3,60,11],[61,3,61,11],[62,3,62,11],[63,3,63,11],[64,3,64,11],[64,12,64,21],[65,2,65,7],[65,8,65,11],[66,2,66,7],[66,8,66,11],[67,2,67,10],[68,2,68,11],[69,3,69,11],[70,3,70,11],[71,3,71,11],[72,4,72,11],[73,4,73,11],[74,4,74,11],[75,2,75,6],[75,7,75,11],[76,2,76,6],[76,7,76,11],[77,1,78,1],[77,2,78,11],[79,2,79,11],[79,12,79,20],[80,12,80,20],[81,2,81,11],[83,2,83,11],[83,12,83,20],[85,2,85,11],[87,2,87,11]]}
[null,"C2.1 PRICING INSTRUCTIONS\nGCC FOR CONSTRUCTION WORKS (Second Edition  2010)"]
[]
[null,"Project title:",null,null,{"$f":"+'[1]Master Data'!E18","v":"ZNT 04280 W: DEPARTMENT OF HEALTH: MBONGOLWANE: WIMS NO. 056687: MBONGOLWANE HOSPITAL: PROVISION OF TWO BOREHOLES WITH BOOSTER PUMP AND WATER TREATMENT SYSTEM\t"}]
[null,"Tender no:",null,null,{"$f":"+'[1]Master Data'!E13","v":"ZNTU 04280 W"},{"$nulls":3},"Project Code:",null,{"$f":"+'[1]Master Data'!G13","v":"056687"}]
[]
[null,"C2.1 Pricing Instructions"]
[]
[null,null,"Where any item is not relevant to this specific contract, such item is marked N/A (signifying “not applicable”)"]
[]
[null,null,"The adjustment of the preliminaries each item  priced is to be allocated to one or more of the three categories by insertion of “F”, “V”, “T” as the case may be against the price in the “rate” column immediately preceding the “amount” column, where “F” denotes a fixed amount (amount not varied), “V” denotes an amount variable in proportion to value and “T” denotes an amount variable in proportion to time."]
[]
[null,1,"MASSES AND MEASURING UNITS"]
[]
[null,null,"These shall be in accordance with the Measuring Units and National Measuring Standards Act No. 76 of 1973 and amendments thereto.\n\nThe pages of each of these documents are numbered consecutively and before the Tenderer submits his tender he should check the number of pages, and if any are found missing or duplicated, or the figures or writing indistinct, or the documents contain any obvious error, he should apply to the Head : Public Works AT ONCE and have same rectified as no liability whatsoever will be admitted by the Administration in respect of errors in Tender due to the foregoing."]
[]
[null,2,"PRICES FOR VARIATIONS"]
[]
[null,null,"Where prices or quotations for variations are submitted by the Contractor during the currency of the Contract, it is to be clearly understood that these are for the purpose of consideration by the Head : Public Works and that there is no assumption of acceptance.  The Contractor will be notified of acceptance of prices or quotations either by insertion of the amount on the variation order or by written intimation."]
[]
[null,3,"SCALE"]
[null,null,"The scale to which the Drawings are made is only to be made use of when no figured dimensions are given either on the Drawings or in the tender documents and the figured dimensions are always to be followed though they may not coincide with the scale of the Drawings, but dimensions where possible are to be taken from the buildings."]
[]
[null,4,"PROVISIONAL ITEMS"]
[null,null,"All items described as \"Provisional\" shall be used as directed by the Employer and measured and valued or paid for. \n\nNo work for which \"Provisional\" items are allowed shall be commenced without written instructions from the Head : Public Works."]
[]
[null,5,"TIMELY ORDERING OF MATERIALS"]
[null,null,"The Contractor is warned to place all orders for materials or special articles as early as possible, as he will be held solely responsible for any delay in the delivery of such goods.\nNevertheless this tender is conditional upon no liability being attached to the Contractor if delivery of materials is rendered impossible by reason of any act of the Government."]
[]
[null,6,"ELECTRICAL LIGHTING, POWER AND WATER REQUIREMENTS"]
[]
[null," ","The Contractor shall provide any artificial lighting which may be necessary or required for the proper execution of the works, and provide electric power and water required by all Sub-Contractors, Nominated Sub-Contractors and Sub-Contractors appointed directly by the Employer."]
[]
[null,null,"The Contractor shall give all notices and pay all fees in connection with temporary electrical and water connections and shall connect temporary Electrical and Water meters for and pay for all current and water consumed."]
[]
[null,null,"Tenderers are advised that the permanent light fittings and water points of any kind installed in the Works are not to be used to provide temporary lighting and supplement water requirements for construction purposes."]
[]
[null,7,"IMPORT PERMITS, DUTIES AND SURCHARGES."]
[]
[null,null,"All tenders by means of which imported products are being called for, must use the rate of exchange 14 days prior to the closing date indicated in the tender documents.  If this day falls on a weekend or public holiday, the next working day must be used."]
[null,null,"Furthermore, Tenderers must submit documentary proof (in the form of a certified copy) from their bank or legally recognised financial institution, clearly indicating what the rate of exchange was 14 days prior to the closing date, as mentioned above."]
[null,null,"Together with this, the Tenderer must confirm that the tender price relating to an imported product, was based on the rate of exchange 14 days prior to the closing date as mentioned above."]
[]
[null,8,"STANDARD SYSTEM OF MEASUREMENT WHERE BILLS OF QUANTITIES FORM PART OF THE TENDER DOCUMENTS"]
[]
[null,null,"The work executed under this Contract has been measured in accordance with the;"]
[null,null,{"$f":"IF('[1]Master Data'!E404=1,\"Standard System of Measuring Builders Work (6th Edition)\",IF('[1]Master Data'!E404=2,\"Standard System of Measuring Builders Work (7th Edition)\",IF('[1]Master Data'!E404=3,\"Standard System of Measuring Building Works for Small or Simple Buildings 1999\",IF('[1]Master Data'!E404=4,\"Civil Engineering Standard Method of Measurement Southern African (Edition 3)\",\"Other (Specify)\"))))","v":"Standard System of Measuring Builders Work (7th Edition)"},{"$nulls":11}," "]
[null,null,"including all amendments unless descriptions of items indicate a deviation and it shall be understood that the system of measurement which is herein adopted is the only system of measurement which will be recognised in connection with this contract. Any contradictions to this system of measurement contained in the “Model Preambles for Trades 2008” shall be disregarded (unless same have been accommodated in the system of measurement) but applicable rates shall be included for all requirements stated and not measured separately in compliance with this system."]
[]
[null,9,"PRICING OF ROCK EXCAVATIONS"]
[]
[null,null,"It is a condition of this tender that should the tenderer elect to price the Rock Excavation included in this tender, the rates must be market related and should be identically priced for the same classification of excavations and not vary for similar billed items in the different sections."]
[]
[null,10,"BROAD BASED BLACK ECONOMIC EMPOWERMENT"]
[]
[null,null,"1.                   ","It is the deliberate policy of the Provincial Administration of KwaZulu-Natal to foster and to encourage the economic empowerment of Black South Africans. This policy will be implemented without prescription and without prejudicing the principles and the integrity of the Provincial Administration of KwaZulu-Natal. Subject to these constraints and also subject to good business practise and commercial consideration, it is therefore considered appropriate that the Provincial Administration of KwaZulu-Natal should encourage business relationships with companies which actively pursue Affirmative Action and Black Economic Empowerment Programmes. "]
[null,null,"2.                   ","In responding to this tender you are therefore encouraged to devote attention to these two subjects of Affirmative Action and Economic Empowerment. In addition, in considering the appointment of sub-contractors, you are requested to extend the spirit of these policies."]
[null,null,"3.                   ","The foregoing enunciations of this policy are not intended to be prescriptive nor to preclude any individual or operation from responding to this tender."]
[]
[null,11,"REGISTRATION ON THE CENTRAL SUPPLIERS DATABASE"]
[]
{"$rows_left_out":32}
{"sheet":"C2.2_Prelim Fly","index":4,"n_rows":16,"n_cols":1,"rows_kept":16,"merged":[[1,0,1,10],[15,0,15,9]]}
[]
[{"$f":"+'[1]Master Data'!ProjectTitle","v":"ZNT 04280 W: DEPARTMENT OF HEALTH: MBONGOLWANE: WIMS NO. 056687: MBONGOLWANE HOSPITAL: PROVISION OF TWO BOREHOLES WITH BOOSTER PUMP AND WATER TREATMENT SYSTEM\t"}]
{"$rows_empty":13}
["C2.2 - Preliminaries for GCC for Construction works - 2nd Edition 2010 "]

{"sheet":"C2.2_Notes to QS Prelims & Gen","index":5,"n_rows":634,"n_cols":9,"rows_kept":634,"merged":[[0,0,0,4],[2,7,2,11],[3,7,3,11],[4,7,4,11],[5,7,5,11],[6,7,11,11],[285,1,286,1],[578,0,578,5],[580,0,580,5],[581,0,581,1],[581,4,581,5],[630,0,630,1],[631,0,631,5],[632,0,632,5],[633,0,633,1]]}
[{"$f":"+'[1]Master Data'!E18","v":"ZNT 04280 W: DEPARTMENT OF HEALTH: MBONGOLWANE: WIMS NO. 056687: MBONGOLWANE HOSPITAL: PROVISION OF TWO BOREHOLES WITH BOOSTER PUMP AND WATER TREATMENT SYSTEM\t"}]
[null,"BILL NO. 1  "]
[null,"C2 .2 PRELIMINARY AND GENERAL"]
[null,"NOTES  ","UNIT","QUANTITY","RATE","AMOUNT"]
[]
["i)","The agreement is to be the General Conditions of Contract for Works of Civil Engineering Construction (2010) (Second Edition) , published by the S. A. Institution Of Civil Engineering."]
[]
["ii)","The Preliminaries are to be the Construction and management requirements for works contracts - Part 1: General engineering and construction works (SANS 1921-1: 2004 Edition 1) prepared by Standards South Africa and shall be deemed  to be incorporated herein."]
[]
["iii)","Tenderers are referred to the abovementioned  documents for the full intent and meaning of each  clause thereof (hereinafter referred to by heading and  clause number only) for which such allowance must be  made as may be considered necessary."]
[]
[]
["iv)","Where standard clauses or alternatives are not  entirely applicable to this contract such modifications,  corrections or supplements as will apply are given  under each relevant clause heading."]
[]
["v) ","Where any item is not relevant to this specific  contract such item is marked N/A (signifying \"not  applicable\")."]
[]
["vi)","Adjustment of the preliminaries:  each item priced, is to be allocated to one or more of  the three categories, where \"F\" denotes a fixed amount  (amount not to be varied), \"V\" denotes an amount  variable in proportion to value and \"T\" denotes an  amount in proportion to time."]
[]
["vii)","Time (T) related Preliminaries will only be adjusted for omissions or additions, issued by the Employer, or delays caused by the Employer, for which variation and extension of time has been granted. See Contract Data."]
[]
[null,"SECTION A:  GENERAL CONDITIONS OF CONTRACT"]
[]
["A1","General (clause 1) "]
[null,"F:............................. V:............................ T:............................ ","Item"]
[]
["A2","Basis of Contract (clause 2) "]
[null,"F:............................. V:............................ T:............................ ","Item"]
[]
["A3","Engineer (clause 3) "]
[null,"F:............................. V:............................ T:............................ ","Item"]
[]
["A4","Contractor's General Obligation (clause 4) "]
[null,"F:............................. V:............................ T:............................ ","Item"]
[null," "]
["A5","Time and Related Matters (clause 5) - As referred to in the Contract Data under Special Condition of Contract. The Contract Period shall be deemed to include all Non – Working Days, Special Non – Working Days and the year-end Builders Annual Industry Holiday Periods. "]
[null,"\nF:............................. V:............................ T:............................ \n","Item"]
[null,"Carried forward to collection",null,null,"R"]
[]
[null,null,"UNIT","QUANTITY","RATE","AMOUNT"]
["A6","Payment and Related Matters (clause 6) "]
[null,"F:............................. V:............................ T:............................ ","Item"]
[null," "]
["A7","Quality and Related Matters (clause 7) "]
[null,"F:............................. V:............................ T:............................ ","Item"]
[]
["A8","Risk and Related Matters (clause 8) "]
[null,"F:............................. V:............................ T:............................ ","Item"]
[null," "]
["A9","Termination of Contract (clause 9) "]
[null,"F:............................. V:............................ T:............................ ","Item"]
[null," "]
["A10","Claims and Disputes (clause 10) "]
[null,"F:............................. V:............................ T:............................ ","Item"]
[null," "]
[]
[null,"SECTION B:   SANS 1921-1:2004 (Edition 1):  CONSTRUCTION AND MANAGEMENT REQUIREMENTS FOR WORKS CONTRACTS:  PART 1"," "]
[null,"Refer to  the  SCOPE OF WORK for detail requirements:"]
[]
["B1","Scope"," "]
[null,"F:............................. V:............................ T:............................ ","Item"]
{"$rows_left_out":527}
{"sheet":"C2.3_BOQ - Fly","index":6,"n_rows":16,"n_cols":1,"rows_kept":16,"merged":[[1,0,1,10],[15,0,15,9]]}
[]
[{"$f":"+'[1]Master Data'!E18","v":"ZNT 04280 W: DEPARTMENT OF HEALTH: MBONGOLWANE: WIMS NO. 056687: MBONGOLWANE HOSPITAL: PROVISION OF TWO BOREHOLES WITH BOOSTER PUMP AND WATER TREATMENT SYSTEM\t"}]
{"$rows_empty":13}
["PART C2.3  BILL OF QUANTITIES"]

{"sheet":"UNPRICED BOQ","index":7,"n_rows":116,"n_cols":7,"rows_kept":116,"merged":[[0,0,0,6],[1,0,1,1],[2,0,2,1],[3,1,3,2],[4,0,4,6],[8,1,8,6],[9,1,9,6],[11,1,11,2],[12,1,12,2],[13,1,13,2],[14,1,14,2],[15,1,15,2],[16,1,16,2],[17,1,17,2],[18,1,18,2],[21,1,21,2],[22,1,22,2],[24,1,24,2],[25,1,25,2],[26,1,26,2],[29,1,29,2],[30,1,30,2],[31,1,31,2],[34,1,34,2],[35,1,35,2],[36,1,36,2],[39,1,39,2],[40,1,40,2],[41,1,41,2],[45,1,45,2],[46,1,46,2],[47,1,47,2],[49,1,49,2],[50,1,50,2],[51,1,51,2],[54,1,54,2],[55,1,55,2],[56,1,56,2],[58,1,58,2],[59,1,59,2],[60,1,60,2],[63,1,63,2],[64,1,64,2],[65,1,65,2],[66,1,66,2],[67,1,67,2],[68,1,68,2],[69,1,69,2],[70,1,70,2],[71,1,71,2],[73,1,73,2],[75,1,75,2],[76,1,76,2],[77,1,77,2],[78,1,78,2],[79,1,79,2],[80,1,80,2],[82,1,82,2],[85,1,85,2],[87,1,87,2],[91,1,91,2],[93,1,93,2],[94,1,94,2],[95,1,95,2],[96,1,96,2],[97,1,97,2],[99,1,99,2],[100,1,100,2],[101,1,101,2],[102,1,102,2],[103,1,103,2],[104,1,104,2],[105,1,105,2],[106,1,106,2],[107,1,107,2],[108,1,108,2],[109,1,109,2],[110,1,110,2],[111,1,111,2],[112,1,112,2],[115,1,115,2]]}
["BILL  OF  QUANTITIES  FOR  BOREHOLE DRILLING"]
["Client Name:",null,"Department of Health"]
["B/Hole Contract:"]
["Item","Description",null,"Unit","Qty","Rate","Total"]
["SECTION NO.2 "]
[null,"SECTION NO. 2"]
[null,"BILL NO.1"]
[null,"BOREHOLE INSTALLATION (PROVISIONAL)"]
[null,"The Tenderer is referred to the \"KwaZulu Natal: Department of Health Standard Preambles to all Trades - January 2009 (Rev 3)\" for supplementary and comprehensive expansion of descriptions, appropriate provision for which shall be deemed to have been included in all relevant rates"]
[null,"Registration with the Borehole Water Association of South Africa (BWA) AND Ground Water Association of KwaZulu-Natal (GAKZN) is required"]
[null,{"$f":"'[7]Table 16'!$A$4","v":"DRILLING"},null,"Unit ","Qty","Rate","Total"]
[null,"CONCRETE, FORMWORK AND REINFORCEMENT"]
[null,"NOTE:"]
[null,"For preambles see Standard Preambles to All Trades - WB20 and Supplementary Preambles - pages SUP1 to SUP6."]
[null,"Tenderers are to allow in the rates tendered for all concrete with a compression strength equal to or greater than 20 MPa, for all concrete testing as specified in TESTS on page SP13 of the Standard Preambles to all Trades."]
[null,"No separate item against which any allowance for costs, in connection with the tests, has been included in this document."]
[null,"VIBRATED REINFORCED CONCRETE"]
[null,"25 MPa / 19mm Concrete:"]
[1,"Strip footings, bases, etc., cast against excavated surfaces.",null,{"$f":"\"m\"&CHAR(179)","v":"m³"},3]
[]
[]
[null,"Carried to final summary"]
[null,"DRILLING"]
[null,"Drilling with foam from 0 to 100m"]
[2,"Drilling 165mm diameter",null,"m",200]
[3,"Drilling 203mm diameter",null,"m",100]
[4,"Drilling exceeding 254m to not exceeding 305 diameter",null,"m","-",null,"Rate Only"]
[]
[null,"Drilling with foam from 101 to 150m"]
[5,"Drilling 165mm diameter",null,"m",100]
[6,"Drilling 203mm diameter",null,"m",100]
[7,"Drilling exceeding 254m to not exceeding 305 diameter",null,"m","-",null,"Rate Only"]
[]
[null,"Drilling with foam from 151 to 300m"]
[8,"Drilling 165mm diameter",null,"m","-",null,"Rate Only"]
[9,"Drilling 203mm diameter",null,"m","-",null,"Rate Only"]
[10,"Drilling exceeding 254m to not exceeding 305 diameter",null,"m","-",null,"Rate Only"]
[]
[null,"Mud Flush up to 100m"]
[11,"Drilling 165mm diameter",null,"m",100]
[12,"Drilling 203mm diameter",null,"m","-",null,"Rate Only"]
[13,"Drilling exceeding 254m to not exceeding 305 diameter",null,"m","-",null,"Rate Only"]
[null,"Drilling with foams (Highly abrasive rocks)"]
[]
[null,"Drilling with foam from 0 to 100m"]
[14,"Drilling 165mm diameter",null,"m",100]
[15,"Drilling 203mm diameter",null,"m","-",null,"Rate Only"]
[16,"Drilling exceeding 254m to not exceeding 305 diameter",null,"m","-",null,"Rate Only"]
[null,"Drilling with foam from 101 to 150m"]
[17,"Drilling 165mm diameter",null,"m","-",null,"Rate Only"]
[18,"Drilling 203mm diameter",null,"m","-",null,"Rate Only"]
[19,"Drilling exceeding 254m to not exceeding 305 diameter",null,"m","-",null,"Rate Only"]
[]
[null,"Drilling with foam from 151 to 300m"]
[20,"Drilling 165mm diameter",null,"m","-",null,"Rate Only"]
[21,"Drilling 203mm diameter",null,"m","-",null,"Rate Only"]
[22,"Drilling exceeding 254m to not exceeding 305 diameter",null,"m","-",null,"Rate Only"]
[]
[23,"Supply and Install 152mm dia plain steel casings",null,"m",150]
[24,"Supply and Install 152mm dia plasma cut steel  casings",null,"m",74]
{"$rows_left_out":56}